beam-commits mailing list archives

Site index · List index
Message view « Date » · « Thread »
Top « Date » · « Thread »
From Apache Jenkins Server <jenk...@builds.apache.org>
Subject Build failed in Jenkins: beam_PerformanceTests_Python #777
Date Thu, 11 Jan 2018 12:07:43 GMT
See <https://builds.apache.org/job/beam_PerformanceTests_Python/777/display/redirect>

------------------------------------------
[...truncated 545.54 KB...]
[INFO] --- maven-compiler-plugin:3.6.2:compile (default-compile) @ beam-sdks-java-fn-execution
---
[INFO] Changes detected - recompiling the module!
[INFO] Compiling 19 source files to /tmp/perfkitbenchmarker/runs/85d939fc/beam/sdks/java/fn-execution/target/classes
[WARNING] bootstrap class path not set in conjunction with -source 1.7
[INFO] /tmp/perfkitbenchmarker/runs/85d939fc/beam/sdks/java/fn-execution/src/main/java/org/apache/beam/sdk/fn/channel/SocketAddressFactory.java:
/tmp/perfkitbenchmarker/runs/85d939fc/beam/sdks/java/fn-execution/src/main/java/org/apache/beam/sdk/fn/channel/SocketAddressFactory.java
uses or overrides a deprecated API.
[INFO] /tmp/perfkitbenchmarker/runs/85d939fc/beam/sdks/java/fn-execution/src/main/java/org/apache/beam/sdk/fn/channel/SocketAddressFactory.java:
Recompile with -Xlint:deprecation for details.
[INFO] /tmp/perfkitbenchmarker/runs/85d939fc/beam/sdks/java/fn-execution/src/main/java/org/apache/beam/sdk/fn/stream/BufferingStreamObserver.java:
Some input files use unchecked or unsafe operations.
[INFO] /tmp/perfkitbenchmarker/runs/85d939fc/beam/sdks/java/fn-execution/src/main/java/org/apache/beam/sdk/fn/stream/BufferingStreamObserver.java:
Recompile with -Xlint:unchecked for details.
[INFO] 
[INFO] --- maven-resources-plugin:3.0.2:testResources (default-testResources) @ beam-sdks-java-fn-execution
---
[INFO] Using 'UTF-8' encoding to copy filtered resources.
[INFO] skip non existing resourceDirectory /tmp/perfkitbenchmarker/runs/85d939fc/beam/sdks/java/fn-execution/src/test/resources
[INFO] Copying 3 resources
[INFO] 
[INFO] --- maven-compiler-plugin:3.6.2:testCompile (default-testCompile) @ beam-sdks-java-fn-execution
---
[INFO] Changes detected - recompiling the module!
[INFO] Compiling 18 source files to /tmp/perfkitbenchmarker/runs/85d939fc/beam/sdks/java/fn-execution/target/test-classes
[INFO] /tmp/perfkitbenchmarker/runs/85d939fc/beam/sdks/java/fn-execution/src/test/java/org/apache/beam/sdk/fn/stream/DataStreamsTest.java:
/tmp/perfkitbenchmarker/runs/85d939fc/beam/sdks/java/fn-execution/src/test/java/org/apache/beam/sdk/fn/stream/DataStreamsTest.java
uses unchecked or unsafe operations.
[INFO] /tmp/perfkitbenchmarker/runs/85d939fc/beam/sdks/java/fn-execution/src/test/java/org/apache/beam/sdk/fn/stream/DataStreamsTest.java:
Recompile with -Xlint:unchecked for details.
[INFO] 
[INFO] --- maven-checkstyle-plugin:2.17:check (default) @ beam-sdks-java-fn-execution ---
[INFO] 
[INFO] --- maven-surefire-plugin:2.20:test (default-test) @ beam-sdks-java-fn-execution ---
[INFO] Tests are skipped.
[INFO] 
[INFO] --- build-helper-maven-plugin:3.0.0:regex-properties (render-artifact-id) @ beam-sdks-java-fn-execution
---
[INFO] 
[INFO] --- maven-jar-plugin:3.0.2:jar (default-jar) @ beam-sdks-java-fn-execution ---
[INFO] Building jar: /tmp/perfkitbenchmarker/runs/85d939fc/beam/sdks/java/fn-execution/target/beam-sdks-java-fn-execution-2.3.0-SNAPSHOT.jar
[INFO] 
[INFO] --- maven-site-plugin:3.5.1:attach-descriptor (attach-descriptor) @ beam-sdks-java-fn-execution
---
[INFO] 
[INFO] --- maven-jar-plugin:3.0.2:test-jar (default-test-jar) @ beam-sdks-java-fn-execution
---
[INFO] Building jar: /tmp/perfkitbenchmarker/runs/85d939fc/beam/sdks/java/fn-execution/target/beam-sdks-java-fn-execution-2.3.0-SNAPSHOT-tests.jar
[INFO] 
[INFO] --- maven-shade-plugin:3.0.0:shade (bundle-and-repackage) @ beam-sdks-java-fn-execution
---
[INFO] Excluding org.apache.beam:beam-model-pipeline:jar:2.3.0-SNAPSHOT from the shaded jar.
[INFO] Excluding org.apache.beam:beam-model-fn-execution:jar:2.3.0-SNAPSHOT from the shaded
jar.
[INFO] Excluding io.grpc:grpc-protobuf:jar:1.2.0 from the shaded jar.
[INFO] Excluding com.google.protobuf:protobuf-java-util:jar:3.2.0 from the shaded jar.
[INFO] Excluding com.google.code.gson:gson:jar:2.7 from the shaded jar.
[INFO] Excluding io.grpc:grpc-protobuf-lite:jar:1.2.0 from the shaded jar.
[INFO] Excluding org.apache.beam:beam-sdks-java-core:jar:2.3.0-SNAPSHOT from the shaded jar.
[INFO] Excluding com.google.code.findbugs:jsr305:jar:3.0.1 from the shaded jar.
[INFO] Excluding com.github.stephenc.findbugs:findbugs-annotations:jar:1.3.9-1 from the shaded
jar.
[INFO] Excluding com.fasterxml.jackson.core:jackson-core:jar:2.8.9 from the shaded jar.
[INFO] Excluding com.fasterxml.jackson.core:jackson-annotations:jar:2.8.9 from the shaded
jar.
[INFO] Excluding com.fasterxml.jackson.core:jackson-databind:jar:2.8.9 from the shaded jar.
[INFO] Excluding net.bytebuddy:byte-buddy:jar:1.6.8 from the shaded jar.
[INFO] Excluding org.apache.avro:avro:jar:1.8.2 from the shaded jar.
[INFO] Excluding org.codehaus.jackson:jackson-core-asl:jar:1.9.13 from the shaded jar.
[INFO] Excluding org.codehaus.jackson:jackson-mapper-asl:jar:1.9.13 from the shaded jar.
[INFO] Excluding com.thoughtworks.paranamer:paranamer:jar:2.7 from the shaded jar.
[INFO] Excluding org.tukaani:xz:jar:1.5 from the shaded jar.
[INFO] Excluding org.xerial.snappy:snappy-java:jar:1.1.4 from the shaded jar.
[INFO] Excluding org.apache.commons:commons-compress:jar:1.14 from the shaded jar.
[INFO] Excluding org.apache.commons:commons-lang3:jar:3.6 from the shaded jar.
[INFO] Excluding joda-time:joda-time:jar:2.4 from the shaded jar.
[INFO] Excluding com.google.protobuf:protobuf-java:jar:3.2.0 from the shaded jar.
[INFO] Excluding io.grpc:grpc-core:jar:1.2.0 from the shaded jar.
[INFO] Excluding com.google.errorprone:error_prone_annotations:jar:2.0.15 from the shaded
jar.
[INFO] Excluding io.grpc:grpc-context:jar:1.2.0 from the shaded jar.
[INFO] Excluding com.google.instrumentation:instrumentation-api:jar:0.3.0 from the shaded
jar.
[INFO] Excluding io.grpc:grpc-stub:jar:1.2.0 from the shaded jar.
[INFO] Excluding io.grpc:grpc-netty:jar:1.2.0 from the shaded jar.
[INFO] Excluding io.netty:netty-codec-http2:jar:4.1.8.Final from the shaded jar.
[INFO] Excluding io.netty:netty-codec-http:jar:4.1.8.Final from the shaded jar.
[INFO] Excluding io.netty:netty-codec:jar:4.1.8.Final from the shaded jar.
[INFO] Excluding io.netty:netty-handler:jar:4.1.8.Final from the shaded jar.
[INFO] Excluding io.netty:netty-handler-proxy:jar:4.1.8.Final from the shaded jar.
[INFO] Excluding io.netty:netty-codec-socks:jar:4.1.8.Final from the shaded jar.
[INFO] Excluding io.netty:netty-transport-native-epoll:jar:linux-x86_64:4.1.8.Final from the
shaded jar.
[INFO] Excluding io.netty:netty-common:jar:4.1.8.Final from the shaded jar.
[INFO] Excluding io.netty:netty-buffer:jar:4.1.8.Final from the shaded jar.
[INFO] Excluding io.netty:netty-transport:jar:4.1.8.Final from the shaded jar.
[INFO] Excluding io.netty:netty-resolver:jar:4.1.8.Final from the shaded jar.
[INFO] Including com.google.guava:guava:jar:20.0 in the shaded jar.
[INFO] Excluding org.slf4j:slf4j-api:jar:1.7.25 from the shaded jar.
[INFO] Replacing original artifact with shaded artifact.
[INFO] Replacing /tmp/perfkitbenchmarker/runs/85d939fc/beam/sdks/java/fn-execution/target/beam-sdks-java-fn-execution-2.3.0-SNAPSHOT.jar
with /tmp/perfkitbenchmarker/runs/85d939fc/beam/sdks/java/fn-execution/target/beam-sdks-java-fn-execution-2.3.0-SNAPSHOT-shaded.jar
[INFO] Replacing original test artifact with shaded test artifact.
[INFO] Replacing /tmp/perfkitbenchmarker/runs/85d939fc/beam/sdks/java/fn-execution/target/beam-sdks-java-fn-execution-2.3.0-SNAPSHOT-tests.jar
with /tmp/perfkitbenchmarker/runs/85d939fc/beam/sdks/java/fn-execution/target/beam-sdks-java-fn-execution-2.3.0-SNAPSHOT-shaded-tests.jar
[INFO] Dependency-reduced POM written at: /tmp/perfkitbenchmarker/runs/85d939fc/beam/sdks/java/fn-execution/dependency-reduced-pom.xml
[INFO] 
[INFO] --- maven-dependency-plugin:3.0.1:analyze-only (default) @ beam-sdks-java-fn-execution
---
[WARNING] Used undeclared dependencies found:
[WARNING]    joda-time:joda-time:jar:2.4:compile
[INFO] ------------------------------------------------------------------------
[INFO] Reactor Summary:
[INFO] 
[INFO] Apache Beam :: Parent .............................. SUCCESS [  9.333 s]
[INFO] Apache Beam :: SDKs :: Java :: Build Tools ......... SUCCESS [  4.321 s]
[INFO] Apache Beam :: Model ............................... SUCCESS [  0.087 s]
[INFO] Apache Beam :: Model :: Pipeline ................... SUCCESS [  9.034 s]
[INFO] Apache Beam :: Model :: Job Management ............. SUCCESS [  3.849 s]
[INFO] Apache Beam :: Model :: Fn Execution ............... SUCCESS [  5.263 s]
[INFO] Apache Beam :: SDKs ................................ SUCCESS [  0.162 s]
[INFO] Apache Beam :: SDKs :: Go .......................... SUCCESS [ 13.247 s]
[INFO] Apache Beam :: SDKs :: Java ........................ SUCCESS [  0.143 s]
[INFO] Apache Beam :: SDKs :: Java :: Core ................ SUCCESS [ 22.244 s]
[INFO] Apache Beam :: Runners ............................. SUCCESS [  0.141 s]
[INFO] Apache Beam :: Runners :: Local Java Core .......... SUCCESS [  1.961 s]
[INFO] Apache Beam :: Runners :: Core Construction Java ... SUCCESS [  4.035 s]
[INFO] Apache Beam :: Runners :: Core Java ................ SUCCESS [  4.247 s]
[INFO] Apache Beam :: Runners :: Direct Java .............. SUCCESS [ 10.870 s]
[INFO] Apache Beam :: SDKs :: Java :: IO .................. SUCCESS [  0.100 s]
[INFO] Apache Beam :: SDKs :: Java :: IO :: AMQP .......... SUCCESS [  3.182 s]
[INFO] Apache Beam :: SDKs :: Java :: IO :: Common ........ SUCCESS [  2.039 s]
[INFO] Apache Beam :: SDKs :: Java :: IO :: Cassandra ..... SUCCESS [  3.577 s]
[INFO] Apache Beam :: SDKs :: Java :: IO :: Elasticsearch . SUCCESS [  2.784 s]
[INFO] Apache Beam :: SDKs :: Java :: IO :: Elasticsearch-Tests SUCCESS [  0.898 s]
[INFO] Apache Beam :: SDKs :: Java :: IO :: Elasticsearch-Tests :: Common SUCCESS [  0.791
s]
[INFO] Apache Beam :: SDKs :: Java :: IO :: Elasticsearch-Tests :: 2.x SUCCESS [  2.723 s]
[INFO] Apache Beam :: SDKs :: Java :: IO :: Elasticsearch-Tests :: 5.x SUCCESS [  3.763 s]
[INFO] Apache Beam :: SDKs :: Java :: Extensions .......... SUCCESS [  0.055 s]
[INFO] Apache Beam :: SDKs :: Java :: Extensions :: Google Cloud Platform Core SUCCESS [ 
3.347 s]
[INFO] Apache Beam :: SDKs :: Java :: Extensions :: Protobuf SUCCESS [  2.306 s]
[INFO] Apache Beam :: SDKs :: Java :: IO :: Google Cloud Platform SUCCESS [  7.660 s]
[INFO] Apache Beam :: Runners :: Google Cloud Dataflow .... SUCCESS [  8.017 s]
[INFO] Apache Beam :: SDKs :: Java :: IO :: File-based-io-tests SUCCESS [  2.112 s]
[INFO] Apache Beam :: SDKs :: Java :: IO :: Hadoop Common . SUCCESS [  7.163 s]
[INFO] Apache Beam :: SDKs :: Java :: IO :: Hadoop File System SUCCESS [  4.303 s]
[INFO] Apache Beam :: SDKs :: Java :: IO :: Hadoop ........ SUCCESS [  1.685 s]
[INFO] Apache Beam :: SDKs :: Java :: IO :: Hadoop :: input-format SUCCESS [  3.069 s]
[INFO] Apache Beam :: SDKs :: Java :: IO :: Hadoop :: jdk1.8-tests SUCCESS [ 22.207 s]
[INFO] Apache Beam :: SDKs :: Java :: IO :: HBase ......... SUCCESS [  6.884 s]
[INFO] Apache Beam :: SDKs :: Java :: IO :: HCatalog ...... SUCCESS [ 10.151 s]
[INFO] Apache Beam :: SDKs :: Java :: IO :: JDBC .......... SUCCESS [  3.469 s]
[INFO] Apache Beam :: SDKs :: Java :: IO :: JMS ........... SUCCESS [  2.584 s]
[INFO] Apache Beam :: SDKs :: Java :: IO :: Kafka ......... SUCCESS [  3.084 s]
[INFO] Apache Beam :: SDKs :: Java :: IO :: Kinesis ....... SUCCESS [  3.239 s]
[INFO] Apache Beam :: SDKs :: Java :: IO :: MongoDB ....... SUCCESS [  2.543 s]
[INFO] Apache Beam :: SDKs :: Java :: IO :: MQTT .......... SUCCESS [  2.414 s]
[INFO] Apache Beam :: SDKs :: Java :: IO :: Redis ......... SUCCESS [  2.247 s]
[INFO] Apache Beam :: SDKs :: Java :: IO :: Solr .......... SUCCESS [  5.819 s]
[INFO] Apache Beam :: SDKs :: Java :: IO :: Tika .......... SUCCESS [  6.047 s]
[INFO] Apache Beam :: SDKs :: Java :: IO :: XML ........... SUCCESS [  2.532 s]
[INFO] Apache Beam :: SDKs :: Java :: Maven Archetypes .... SUCCESS [  0.062 s]
[INFO] Apache Beam :: SDKs :: Java :: Maven Archetypes :: Starter SUCCESS [  9.669 s]
[INFO] Apache Beam :: Examples ............................ SUCCESS [  0.068 s]
[INFO] Apache Beam :: Examples :: Java .................... SUCCESS [  3.225 s]
[INFO] Apache Beam :: SDKs :: Java :: Maven Archetypes :: Examples SUCCESS [ 24.323 s]
[INFO] Apache Beam :: Examples :: Java 8 .................. SUCCESS [  3.451 s]
[INFO] Apache Beam :: SDKs :: Java :: Maven Archetypes :: Examples - Java 8 SUCCESS [ 25.432
s]
[INFO] Apache Beam :: SDKs :: Java :: Extensions :: Jackson SUCCESS [  1.916 s]
[INFO] Apache Beam :: SDKs :: Java :: Extensions :: Join library SUCCESS [  1.969 s]
[INFO] Apache Beam :: SDKs :: Java :: Extensions :: Sketching SUCCESS [  2.812 s]
[INFO] Apache Beam :: SDKs :: Java :: Extensions :: Sorter  SUCCESS [  2.386 s]
[INFO] Apache Beam :: SDKs :: Java :: Extensions :: SQL ... SUCCESS [ 19.967 s]
[INFO] Apache Beam :: SDKs :: Java :: Fn Execution ........ FAILURE [  2.705 s]
[INFO] Apache Beam :: SDKs :: Java :: Nexmark ............. SKIPPED
[INFO] Apache Beam :: SDKs :: Java :: Harness ............. SKIPPED
[INFO] Apache Beam :: SDKs :: Java :: Container ........... SKIPPED
[INFO] Apache Beam :: SDKs :: Java :: Java 8 Tests ........ SKIPPED
[INFO] Apache Beam :: SDKs :: Python ...................... SKIPPED
[INFO] Apache Beam :: SDKs :: Python :: Container ......... SKIPPED
[INFO] Apache Beam :: Runners :: Java Fn Execution ........ SKIPPED
[INFO] Apache Beam :: Runners :: Java Local Artifact Service SKIPPED
[INFO] Apache Beam :: Runners :: Reference ................ SKIPPED
[INFO] Apache Beam :: Runners :: Reference :: Java ........ SKIPPED
[INFO] Apache Beam :: Runners :: Reference :: Job Orchestrator SKIPPED
[INFO] Apache Beam :: Runners :: Flink .................... SKIPPED
[INFO] Apache Beam :: Runners :: Spark .................... SKIPPED
[INFO] Apache Beam :: Runners :: Apex ..................... SKIPPED
[INFO] Apache Beam :: Runners :: Google Cloud Platform .... SKIPPED
[INFO] Apache Beam :: Runners :: Google Cloud Platform :: GCE metadata provisioning SKIPPED
[INFO] Apache Beam :: Runners :: Google Cloud Platform :: GCS artifact proxy SKIPPED
[INFO] Apache Beam :: Runners :: Gearpump ................. SKIPPED
[INFO] Apache Beam :: SDKs :: Java :: Aggregated Javadoc .. SKIPPED
[INFO] ------------------------------------------------------------------------
[INFO] BUILD FAILURE
[INFO] ------------------------------------------------------------------------
[INFO] Total time: 05:24 min
[INFO] Finished at: 2018-01-11T12:07:18Z
[INFO] Final Memory: 339M/1990M
[INFO] ------------------------------------------------------------------------
[ERROR] Failed to execute goal org.apache.maven.plugins:maven-dependency-plugin:3.0.1:analyze-only
(default) on project beam-sdks-java-fn-execution: Dependency problems found -> [Help 1]
[ERROR] 
[ERROR] To see the full stack trace of the errors, re-run Maven with the -e switch.
[ERROR] Re-run Maven using the -X switch to enable full debug logging.
[ERROR] 
[ERROR] For more information about the errors and possible solutions, please read the following
articles:
[ERROR] [Help 1] http://cwiki.apache.org/confluence/display/MAVEN/MojoExecutionException
[ERROR] 
[ERROR] After correcting the problems, you can resume the build with the command
[ERROR]   mvn <goals> -rf :beam-sdks-java-fn-execution

STDERR: ++ dirname /tmp/perfkitbenchmarker/runs/85d939fc/beam/sdks/java/maven-archetypes/examples-java8/generate-sources.sh
+ HERE=/tmp/perfkitbenchmarker/runs/85d939fc/beam/sdks/java/maven-archetypes/examples-java8
+ EXAMPLES_ROOT=/tmp/perfkitbenchmarker/runs/85d939fc/beam/sdks/java/maven-archetypes/examples-java8/../../../../examples/java
+ JAVA8_EXAMPLES_ROOT=/tmp/perfkitbenchmarker/runs/85d939fc/beam/sdks/java/maven-archetypes/examples-java8/../../../../examples/java8
+ ARCHETYPE_ROOT=/tmp/perfkitbenchmarker/runs/85d939fc/beam/sdks/java/maven-archetypes/examples-java8/src/main/resources/archetype-resources
+ mkdir -p /tmp/perfkitbenchmarker/runs/85d939fc/beam/sdks/java/maven-archetypes/examples-java8/src/main/resources/archetype-resources/src/main/java
+ mkdir -p /tmp/perfkitbenchmarker/runs/85d939fc/beam/sdks/java/maven-archetypes/examples-java8/src/main/resources/archetype-resources/src/test/java
+ rsync -a --exclude cookbook --exclude complete /tmp/perfkitbenchmarker/runs/85d939fc/beam/sdks/java/maven-archetypes/examples-java8/../../../../examples/java/src/main/java/org/apache/beam/examples/
/tmp/perfkitbenchmarker/runs/85d939fc/beam/sdks/java/maven-archetypes/examples-java8/src/main/resources/archetype-resources/src/main/java
--delete
+ rsync -a --exclude cookbook --exclude complete --exclude '*IT.java' /tmp/perfkitbenchmarker/runs/85d939fc/beam/sdks/java/maven-archetypes/examples-java8/../../../../examples/java/src/test/java/org/apache/beam/examples/
/tmp/perfkitbenchmarker/runs/85d939fc/beam/sdks/java/maven-archetypes/examples-java8/src/main/resources/archetype-resources/src/test/java
--delete
+ rsync -a /tmp/perfkitbenchmarker/runs/85d939fc/beam/sdks/java/maven-archetypes/examples-java8/../../../../examples/java8/src/main/java/org/apache/beam/examples/
/tmp/perfkitbenchmarker/runs/85d939fc/beam/sdks/java/maven-archetypes/examples-java8/src/main/resources/archetype-resources/src/main/java
+ rsync -a /tmp/perfkitbenchmarker/runs/85d939fc/beam/sdks/java/maven-archetypes/examples-java8/../../../../examples/java8/src/test/java/org/apache/beam/examples/
/tmp/perfkitbenchmarker/runs/85d939fc/beam/sdks/java/maven-archetypes/examples-java8/src/main/resources/archetype-resources/src/test/java
+ find /tmp/perfkitbenchmarker/runs/85d939fc/beam/sdks/java/maven-archetypes/examples-java8/src/main/resources/archetype-resources/src/main/java
-name '*.java' -print0
+ xargs -0 sed -i.bak 's/^package org\.apache\.beam\.examples/package ${package}/g'
+ find /tmp/perfkitbenchmarker/runs/85d939fc/beam/sdks/java/maven-archetypes/examples-java8/src/main/resources/archetype-resources/src/test/java
-name '*.java' -print0
+ xargs -0 sed -i.bak 's/^package org\.apache\.beam\.examples/package ${package}/g'
+ find /tmp/perfkitbenchmarker/runs/85d939fc/beam/sdks/java/maven-archetypes/examples-java8/src/main/resources/archetype-resources/src/main/java
-name '*.java' -print0
+ xargs -0 sed -i.bak 's/^import org\.apache\.beam\.examples/import ${package}/g'
+ find /tmp/perfkitbenchmarker/runs/85d939fc/beam/sdks/java/maven-archetypes/examples-java8/src/main/resources/archetype-resources/src/test/java
-name '*.java' -print0
+ xargs -0 sed -i.bak 's/^import org\.apache\.beam\.examples/import ${package}/g'
+ find /tmp/perfkitbenchmarker/runs/85d939fc/beam/sdks/java/maven-archetypes/examples-java8/src/main/resources/archetype-resources/src
-name '*.bak' -delete
log4j:WARN No appenders could be found for logger (freemarker.cache).
log4j:WARN Please initialize the log4j system properly.
Warning: Lookahead adequacy checking not being performed since option LOOKAHEAD is more than
1.  Set option FORCE_LA_CHECK to true to force checking.

2018-01-11 12:07:19,959 85d939fc MainThread beam_integration_benchmark(1/1) INFO     Running
benchmark beam_integration_benchmark
2018-01-11 12:07:19,965 85d939fc MainThread beam_integration_benchmark(1/1) ERROR    Error
during benchmark beam_integration_benchmark
Traceback (most recent call last):
  File "<https://builds.apache.org/job/beam_PerformanceTests_Python/ws/PerfKitBenchmarker/perfkitbenchmarker/pkb.py",>
line 601, in RunBenchmark
    DoRunPhase(spec, collector, detailed_timer)
  File "<https://builds.apache.org/job/beam_PerformanceTests_Python/ws/PerfKitBenchmarker/perfkitbenchmarker/pkb.py",>
line 504, in DoRunPhase
    samples = spec.BenchmarkRun(spec)
  File "<https://builds.apache.org/job/beam_PerformanceTests_Python/ws/PerfKitBenchmarker/perfkitbenchmarker/linux_benchmarks/beam_integration_benchmark.py",>
line 159, in Run
    job_type=job_type)
  File "<https://builds.apache.org/job/beam_PerformanceTests_Python/ws/PerfKitBenchmarker/perfkitbenchmarker/providers/gcp/gcp_dpb_dataflow.py",>
line 87, in SubmitJob
    self.spec, classname, job_arguments)
  File "<https://builds.apache.org/job/beam_PerformanceTests_Python/ws/PerfKitBenchmarker/perfkitbenchmarker/beam_benchmark_helper.py",>
line 175, in BuildBeamCommand
    cmd = _BuildPythonCommand(benchmark_spec, classname, job_arguments)
  File "<https://builds.apache.org/job/beam_PerformanceTests_Python/ws/PerfKitBenchmarker/perfkitbenchmarker/beam_benchmark_helper.py",>
line 265, in _BuildPythonCommand
    'apache-beam*.tar.gz')
  File "<https://builds.apache.org/job/beam_PerformanceTests_Python/ws/PerfKitBenchmarker/perfkitbenchmarker/beam_benchmark_helper.py",>
line 290, in _FindFiles
    raise RuntimeError('No such directory: %s' % base_path)
RuntimeError: No such directory: /tmp/perfkitbenchmarker/runs/85d939fc/beam/sdks/python/target
2018-01-11 12:07:19,966 85d939fc MainThread beam_integration_benchmark(1/1) INFO     Cleaning
up benchmark beam_integration_benchmark
2018-01-11 12:07:19,968 85d939fc MainThread beam_integration_benchmark(1/1) ERROR    Benchmark
1/1 beam_integration_benchmark (UID: beam_integration_benchmark0) failed. Execution will continue.
2018-01-11 12:07:19,998 85d939fc MainThread INFO     Benchmark run statuses:
---------------------------------------------------------------
Name                        UID                          Status
---------------------------------------------------------------
beam_integration_benchmark  beam_integration_benchmark0  FAILED
---------------------------------------------------------------
Success rate: 0.00% (0/1)
2018-01-11 12:07:19,999 85d939fc MainThread INFO     Complete logs can be found at: /tmp/perfkitbenchmarker/runs/85d939fc/pkb.log
2018-01-11 12:07:19,999 85d939fc MainThread INFO     Completion statuses can be found at:
/tmp/perfkitbenchmarker/runs/85d939fc/completion_statuses.json
Build step 'Execute shell' marked build as failure
Not sending mail to unregistered user swegner@google.com
Not sending mail to unregistered user arostami@google.com
Not sending mail to unregistered user github@alasdairhodge.co.uk
Not sending mail to unregistered user mariagh@mariagh.svl.corp.google.com
Not sending mail to unregistered user ankurgoenka@gmail.com
Not sending mail to unregistered user ehudm@google.com
Not sending mail to unregistered user kirpichov@google.com
Not sending mail to unregistered user jb@nanthrax.net

Mime
View raw message