beam-commits mailing list archives

Site index · List index
Message view « Date » · « Thread »
Top « Date » · « Thread »
From Apache Jenkins Server <jenk...@builds.apache.org>
Subject Build failed in Jenkins: beam_PostCommit_Python_Verify #3539
Date Mon, 13 Nov 2017 21:41:54 GMT
See <https://builds.apache.org/job/beam_PostCommit_Python_Verify/3539/display/redirect>

------------------------------------------
[...truncated 930.74 KB...]
copying apache_beam/runners/dataflow/native_io/iobase_test.py -> apache-beam-2.3.0.dev0/apache_beam/runners/dataflow/native_io
copying apache_beam/runners/dataflow/native_io/streaming_create.py -> apache-beam-2.3.0.dev0/apache_beam/runners/dataflow/native_io
copying apache_beam/runners/direct/__init__.py -> apache-beam-2.3.0.dev0/apache_beam/runners/direct
copying apache_beam/runners/direct/bundle_factory.py -> apache-beam-2.3.0.dev0/apache_beam/runners/direct
copying apache_beam/runners/direct/clock.py -> apache-beam-2.3.0.dev0/apache_beam/runners/direct
copying apache_beam/runners/direct/consumer_tracking_pipeline_visitor.py -> apache-beam-2.3.0.dev0/apache_beam/runners/direct
copying apache_beam/runners/direct/consumer_tracking_pipeline_visitor_test.py -> apache-beam-2.3.0.dev0/apache_beam/runners/direct
copying apache_beam/runners/direct/direct_metrics.py -> apache-beam-2.3.0.dev0/apache_beam/runners/direct
copying apache_beam/runners/direct/direct_metrics_test.py -> apache-beam-2.3.0.dev0/apache_beam/runners/direct
copying apache_beam/runners/direct/direct_runner.py -> apache-beam-2.3.0.dev0/apache_beam/runners/direct
copying apache_beam/runners/direct/direct_runner_test.py -> apache-beam-2.3.0.dev0/apache_beam/runners/direct
copying apache_beam/runners/direct/evaluation_context.py -> apache-beam-2.3.0.dev0/apache_beam/runners/direct
copying apache_beam/runners/direct/executor.py -> apache-beam-2.3.0.dev0/apache_beam/runners/direct
copying apache_beam/runners/direct/helper_transforms.py -> apache-beam-2.3.0.dev0/apache_beam/runners/direct
copying apache_beam/runners/direct/transform_evaluator.py -> apache-beam-2.3.0.dev0/apache_beam/runners/direct
copying apache_beam/runners/direct/util.py -> apache-beam-2.3.0.dev0/apache_beam/runners/direct
copying apache_beam/runners/direct/watermark_manager.py -> apache-beam-2.3.0.dev0/apache_beam/runners/direct
copying apache_beam/runners/experimental/__init__.py -> apache-beam-2.3.0.dev0/apache_beam/runners/experimental
copying apache_beam/runners/experimental/python_rpc_direct/__init__.py -> apache-beam-2.3.0.dev0/apache_beam/runners/experimental/python_rpc_direct
copying apache_beam/runners/experimental/python_rpc_direct/python_rpc_direct_runner.py ->
apache-beam-2.3.0.dev0/apache_beam/runners/experimental/python_rpc_direct
copying apache_beam/runners/experimental/python_rpc_direct/server.py -> apache-beam-2.3.0.dev0/apache_beam/runners/experimental/python_rpc_direct
copying apache_beam/runners/job/__init__.py -> apache-beam-2.3.0.dev0/apache_beam/runners/job
copying apache_beam/runners/job/manager.py -> apache-beam-2.3.0.dev0/apache_beam/runners/job
copying apache_beam/runners/job/utils.py -> apache-beam-2.3.0.dev0/apache_beam/runners/job
copying apache_beam/runners/portability/__init__.py -> apache-beam-2.3.0.dev0/apache_beam/runners/portability
copying apache_beam/runners/portability/fn_api_runner.py -> apache-beam-2.3.0.dev0/apache_beam/runners/portability
copying apache_beam/runners/portability/fn_api_runner_test.py -> apache-beam-2.3.0.dev0/apache_beam/runners/portability
copying apache_beam/runners/portability/maptask_executor_runner.py -> apache-beam-2.3.0.dev0/apache_beam/runners/portability
copying apache_beam/runners/portability/maptask_executor_runner_test.py -> apache-beam-2.3.0.dev0/apache_beam/runners/portability
copying apache_beam/runners/portability/universal_local_runner.py -> apache-beam-2.3.0.dev0/apache_beam/runners/portability
copying apache_beam/runners/portability/universal_local_runner_main.py -> apache-beam-2.3.0.dev0/apache_beam/runners/portability
copying apache_beam/runners/portability/universal_local_runner_test.py -> apache-beam-2.3.0.dev0/apache_beam/runners/portability
copying apache_beam/runners/test/__init__.py -> apache-beam-2.3.0.dev0/apache_beam/runners/test
copying apache_beam/runners/worker/__init__.py -> apache-beam-2.3.0.dev0/apache_beam/runners/worker
copying apache_beam/runners/worker/bundle_processor.py -> apache-beam-2.3.0.dev0/apache_beam/runners/worker
copying apache_beam/runners/worker/data_plane.py -> apache-beam-2.3.0.dev0/apache_beam/runners/worker
copying apache_beam/runners/worker/data_plane_test.py -> apache-beam-2.3.0.dev0/apache_beam/runners/worker
copying apache_beam/runners/worker/log_handler.py -> apache-beam-2.3.0.dev0/apache_beam/runners/worker
copying apache_beam/runners/worker/log_handler_test.py -> apache-beam-2.3.0.dev0/apache_beam/runners/worker
copying apache_beam/runners/worker/logger.pxd -> apache-beam-2.3.0.dev0/apache_beam/runners/worker
copying apache_beam/runners/worker/logger.py -> apache-beam-2.3.0.dev0/apache_beam/runners/worker
copying apache_beam/runners/worker/logger_test.py -> apache-beam-2.3.0.dev0/apache_beam/runners/worker
copying apache_beam/runners/worker/opcounters.pxd -> apache-beam-2.3.0.dev0/apache_beam/runners/worker
copying apache_beam/runners/worker/opcounters.py -> apache-beam-2.3.0.dev0/apache_beam/runners/worker
copying apache_beam/runners/worker/opcounters_test.py -> apache-beam-2.3.0.dev0/apache_beam/runners/worker
copying apache_beam/runners/worker/operation_specs.py -> apache-beam-2.3.0.dev0/apache_beam/runners/worker
copying apache_beam/runners/worker/operations.pxd -> apache-beam-2.3.0.dev0/apache_beam/runners/worker
copying apache_beam/runners/worker/operations.py -> apache-beam-2.3.0.dev0/apache_beam/runners/worker
copying apache_beam/runners/worker/sdk_worker.py -> apache-beam-2.3.0.dev0/apache_beam/runners/worker
copying apache_beam/runners/worker/sdk_worker_main.py -> apache-beam-2.3.0.dev0/apache_beam/runners/worker
copying apache_beam/runners/worker/sdk_worker_test.py -> apache-beam-2.3.0.dev0/apache_beam/runners/worker
copying apache_beam/runners/worker/sideinputs.py -> apache-beam-2.3.0.dev0/apache_beam/runners/worker
copying apache_beam/runners/worker/sideinputs_test.py -> apache-beam-2.3.0.dev0/apache_beam/runners/worker
copying apache_beam/runners/worker/statesampler.pyx -> apache-beam-2.3.0.dev0/apache_beam/runners/worker
copying apache_beam/runners/worker/statesampler_fake.py -> apache-beam-2.3.0.dev0/apache_beam/runners/worker
copying apache_beam/runners/worker/statesampler_test.py -> apache-beam-2.3.0.dev0/apache_beam/runners/worker
copying apache_beam/testing/__init__.py -> apache-beam-2.3.0.dev0/apache_beam/testing
copying apache_beam/testing/pipeline_verifiers.py -> apache-beam-2.3.0.dev0/apache_beam/testing
copying apache_beam/testing/pipeline_verifiers_test.py -> apache-beam-2.3.0.dev0/apache_beam/testing
copying apache_beam/testing/test_pipeline.py -> apache-beam-2.3.0.dev0/apache_beam/testing
copying apache_beam/testing/test_pipeline_test.py -> apache-beam-2.3.0.dev0/apache_beam/testing
copying apache_beam/testing/test_stream.py -> apache-beam-2.3.0.dev0/apache_beam/testing
copying apache_beam/testing/test_stream_test.py -> apache-beam-2.3.0.dev0/apache_beam/testing
copying apache_beam/testing/test_utils.py -> apache-beam-2.3.0.dev0/apache_beam/testing
copying apache_beam/testing/test_utils_test.py -> apache-beam-2.3.0.dev0/apache_beam/testing
copying apache_beam/testing/util.py -> apache-beam-2.3.0.dev0/apache_beam/testing
copying apache_beam/testing/util_test.py -> apache-beam-2.3.0.dev0/apache_beam/testing
copying apache_beam/testing/data/standard_coders.yaml -> apache-beam-2.3.0.dev0/apache_beam/testing/data
copying apache_beam/testing/data/trigger_transcripts.yaml -> apache-beam-2.3.0.dev0/apache_beam/testing/data
copying apache_beam/transforms/__init__.py -> apache-beam-2.3.0.dev0/apache_beam/transforms
copying apache_beam/transforms/combiners.py -> apache-beam-2.3.0.dev0/apache_beam/transforms
copying apache_beam/transforms/combiners_test.py -> apache-beam-2.3.0.dev0/apache_beam/transforms
copying apache_beam/transforms/core.py -> apache-beam-2.3.0.dev0/apache_beam/transforms
copying apache_beam/transforms/create_test.py -> apache-beam-2.3.0.dev0/apache_beam/transforms
copying apache_beam/transforms/cy_combiners.pxd -> apache-beam-2.3.0.dev0/apache_beam/transforms
copying apache_beam/transforms/cy_combiners.py -> apache-beam-2.3.0.dev0/apache_beam/transforms
copying apache_beam/transforms/display.py -> apache-beam-2.3.0.dev0/apache_beam/transforms
copying apache_beam/transforms/display_test.py -> apache-beam-2.3.0.dev0/apache_beam/transforms
copying apache_beam/transforms/ptransform.py -> apache-beam-2.3.0.dev0/apache_beam/transforms
copying apache_beam/transforms/ptransform_test.py -> apache-beam-2.3.0.dev0/apache_beam/transforms
copying apache_beam/transforms/sideinputs.py -> apache-beam-2.3.0.dev0/apache_beam/transforms
copying apache_beam/transforms/sideinputs_test.py -> apache-beam-2.3.0.dev0/apache_beam/transforms
copying apache_beam/transforms/timeutil.py -> apache-beam-2.3.0.dev0/apache_beam/transforms
copying apache_beam/transforms/trigger.py -> apache-beam-2.3.0.dev0/apache_beam/transforms
copying apache_beam/transforms/trigger_test.py -> apache-beam-2.3.0.dev0/apache_beam/transforms
copying apache_beam/transforms/util.py -> apache-beam-2.3.0.dev0/apache_beam/transforms
copying apache_beam/transforms/util_test.py -> apache-beam-2.3.0.dev0/apache_beam/transforms
copying apache_beam/transforms/window.py -> apache-beam-2.3.0.dev0/apache_beam/transforms
copying apache_beam/transforms/window_test.py -> apache-beam-2.3.0.dev0/apache_beam/transforms
copying apache_beam/transforms/write_ptransform_test.py -> apache-beam-2.3.0.dev0/apache_beam/transforms
copying apache_beam/typehints/__init__.py -> apache-beam-2.3.0.dev0/apache_beam/typehints
copying apache_beam/typehints/decorators.py -> apache-beam-2.3.0.dev0/apache_beam/typehints
copying apache_beam/typehints/native_type_compatibility.py -> apache-beam-2.3.0.dev0/apache_beam/typehints
copying apache_beam/typehints/native_type_compatibility_test.py -> apache-beam-2.3.0.dev0/apache_beam/typehints
copying apache_beam/typehints/opcodes.py -> apache-beam-2.3.0.dev0/apache_beam/typehints
copying apache_beam/typehints/trivial_inference.py -> apache-beam-2.3.0.dev0/apache_beam/typehints
copying apache_beam/typehints/trivial_inference_test.py -> apache-beam-2.3.0.dev0/apache_beam/typehints
copying apache_beam/typehints/typecheck.py -> apache-beam-2.3.0.dev0/apache_beam/typehints
copying apache_beam/typehints/typed_pipeline_test.py -> apache-beam-2.3.0.dev0/apache_beam/typehints
copying apache_beam/typehints/typehints.py -> apache-beam-2.3.0.dev0/apache_beam/typehints
copying apache_beam/typehints/typehints_test.py -> apache-beam-2.3.0.dev0/apache_beam/typehints
copying apache_beam/utils/__init__.py -> apache-beam-2.3.0.dev0/apache_beam/utils
copying apache_beam/utils/annotations.py -> apache-beam-2.3.0.dev0/apache_beam/utils
copying apache_beam/utils/annotations_test.py -> apache-beam-2.3.0.dev0/apache_beam/utils
copying apache_beam/utils/counters.pxd -> apache-beam-2.3.0.dev0/apache_beam/utils
copying apache_beam/utils/counters.py -> apache-beam-2.3.0.dev0/apache_beam/utils
copying apache_beam/utils/counters_test.py -> apache-beam-2.3.0.dev0/apache_beam/utils
copying apache_beam/utils/plugin.py -> apache-beam-2.3.0.dev0/apache_beam/utils
copying apache_beam/utils/processes.py -> apache-beam-2.3.0.dev0/apache_beam/utils
copying apache_beam/utils/processes_test.py -> apache-beam-2.3.0.dev0/apache_beam/utils
copying apache_beam/utils/profiler.py -> apache-beam-2.3.0.dev0/apache_beam/utils
copying apache_beam/utils/proto_utils.py -> apache-beam-2.3.0.dev0/apache_beam/utils
copying apache_beam/utils/retry.py -> apache-beam-2.3.0.dev0/apache_beam/utils
copying apache_beam/utils/retry_test.py -> apache-beam-2.3.0.dev0/apache_beam/utils
copying apache_beam/utils/timestamp.py -> apache-beam-2.3.0.dev0/apache_beam/utils
copying apache_beam/utils/timestamp_test.py -> apache-beam-2.3.0.dev0/apache_beam/utils
copying apache_beam/utils/urns.py -> apache-beam-2.3.0.dev0/apache_beam/utils
copying apache_beam/utils/windowed_value.pxd -> apache-beam-2.3.0.dev0/apache_beam/utils
copying apache_beam/utils/windowed_value.py -> apache-beam-2.3.0.dev0/apache_beam/utils
copying apache_beam/utils/windowed_value_test.py -> apache-beam-2.3.0.dev0/apache_beam/utils
Writing apache-beam-2.3.0.dev0/setup.cfg
Creating tar archive
removing 'apache-beam-2.3.0.dev0' (and everything under it)

SDK_LOCATION=$(find dist/apache-beam-*.tar.gz)
find dist/apache-beam-*.tar.gz

# Run integration tests on the Google Cloud Dataflow service
# and validate that jobs finish successfully.
echo ">>> RUNNING TEST DATAFLOW RUNNER it tests"
>>> RUNNING TEST DATAFLOW RUNNER it tests
python setup.py nosetests \
  --attr IT \
  --nocapture \
  --processes=4 \
  --process-timeout=900 \
  --test-pipeline-options=" \
    --runner=TestDataflowRunner \
    --project=$PROJECT \
    --staging_location=$GCS_LOCATION/staging-it \
    --temp_location=$GCS_LOCATION/temp-it \
    --output=$GCS_LOCATION/py-it-cloud/output \
    --sdk_location=$SDK_LOCATION \
    --num_workers=1 \
    --sleep_secs=20"
<https://builds.apache.org/job/beam_PostCommit_Python_Verify/ws/sdks/python/local/lib/python2.7/site-packages/setuptools/dist.py>:347:
UserWarning: Normalizing '2.3.0.dev' to '2.3.0.dev0'
  normalized_version,
running nosetests
running egg_info
writing requirements to apache_beam.egg-info/requires.txt
writing apache_beam.egg-info/PKG-INFO
writing top-level names to apache_beam.egg-info/top_level.txt
writing dependency_links to apache_beam.egg-info/dependency_links.txt
writing entry points to apache_beam.egg-info/entry_points.txt
reading manifest file 'apache_beam.egg-info/SOURCES.txt'
reading manifest template 'MANIFEST.in'
warning: no files found matching 'README.md'
warning: no files found matching 'NOTICE'
warning: no files found matching 'LICENSE'
writing manifest file 'apache_beam.egg-info/SOURCES.txt'
<https://builds.apache.org/job/beam_PostCommit_Python_Verify/ws/sdks/python/apache_beam/coders/typecoders.py>:134:
UserWarning: Using fallback coder for typehint: Any.
  warnings.warn('Using fallback coder for typehint: %r.' % typehint)
<https://builds.apache.org/job/beam_PostCommit_Python_Verify/ws/sdks/python/apache_beam/io/gcp/gcsio.py>:122:
DeprecationWarning: object() takes no parameters
  super(GcsIO, cls).__new__(cls, storage_client))
<https://builds.apache.org/job/beam_PostCommit_Python_Verify/ws/sdks/python/apache_beam/io/gcp/gcsio.py>:122:
DeprecationWarning: object() takes no parameters
  super(GcsIO, cls).__new__(cls, storage_client))
<https://builds.apache.org/job/beam_PostCommit_Python_Verify/ws/sdks/python/apache_beam/coders/typecoders.py>:134:
UserWarning: Using fallback coder for typehint: <type 'NoneType'>.
  warnings.warn('Using fallback coder for typehint: %r.' % typehint)
<https://builds.apache.org/job/beam_PostCommit_Python_Verify/ws/sdks/python/apache_beam/coders/typecoders.py>:134:
UserWarning: Using fallback coder for typehint: Any.
  warnings.warn('Using fallback coder for typehint: %r.' % typehint)
<https://builds.apache.org/job/beam_PostCommit_Python_Verify/ws/sdks/python/apache_beam/coders/typecoders.py>:134:
UserWarning: Using fallback coder for typehint: Any.
  warnings.warn('Using fallback coder for typehint: %r.' % typehint)
test_bigquery_tornadoes_it (apache_beam.examples.cookbook.bigquery_tornadoes_it_test.BigqueryTornadoesIT)
... ok
test_wordcount_it (apache_beam.examples.wordcount_it_test.WordCountIT) ... ok
Found: https://console.cloud.google.com/dataflow/jobsDetail/locations/us-central1/jobs/2017-11-13_13_26_38-3027947539281924446?project=apache-beam-testing
test_wordcount_fnapi_it (apache_beam.examples.wordcount_it_test.WordCountIT) ... ERROR

======================================================================
ERROR: test_wordcount_fnapi_it (apache_beam.examples.wordcount_it_test.WordCountIT)
----------------------------------------------------------------------
Traceback (most recent call last):
  File "<https://builds.apache.org/job/beam_PostCommit_Python_Verify/ws/sdks/python/.eggs/nose-1.3.7-py2.7.egg/nose/plugins/multiprocess.py",>
line 812, in run
    test(orig)
  File "<https://builds.apache.org/job/beam_PostCommit_Python_Verify/ws/sdks/python/.eggs/nose-1.3.7-py2.7.egg/nose/case.py",>
line 45, in __call__
    return self.run(*arg, **kwarg)
  File "<https://builds.apache.org/job/beam_PostCommit_Python_Verify/ws/sdks/python/.eggs/nose-1.3.7-py2.7.egg/nose/case.py",>
line 133, in run
    self.runTest(result)
  File "<https://builds.apache.org/job/beam_PostCommit_Python_Verify/ws/sdks/python/.eggs/nose-1.3.7-py2.7.egg/nose/case.py",>
line 151, in runTest
    test(result)
  File "/usr/lib/python2.7/unittest/case.py", line 395, in __call__
    return self.run(*args, **kwds)
  File "/usr/lib/python2.7/unittest/case.py", line 331, in run
    testMethod()
  File "<https://builds.apache.org/job/beam_PostCommit_Python_Verify/ws/sdks/python/apache_beam/examples/wordcount_it_test.py",>
line 77, in test_wordcount_fnapi_it
    on_success_matcher=PipelineStateMatcher()))
  File "<https://builds.apache.org/job/beam_PostCommit_Python_Verify/ws/sdks/python/apache_beam/examples/wordcount_fnapi.py",>
line 130, in run
    result = p.run()
  File "<https://builds.apache.org/job/beam_PostCommit_Python_Verify/ws/sdks/python/apache_beam/pipeline.py",>
line 330, in run
    self.to_runner_api(), self.runner, self._options).run(False)
  File "<https://builds.apache.org/job/beam_PostCommit_Python_Verify/ws/sdks/python/apache_beam/pipeline.py",>
line 339, in run
    return self.runner.run(self)
  File "<https://builds.apache.org/job/beam_PostCommit_Python_Verify/ws/sdks/python/apache_beam/runners/dataflow/test_dataflow_runner.py",>
line 49, in run
    self.result.wait_until_finish()
  File "<https://builds.apache.org/job/beam_PostCommit_Python_Verify/ws/sdks/python/apache_beam/runners/dataflow/dataflow_runner.py",>
line 953, in wait_until_finish
    time.sleep(5.0)
  File "<https://builds.apache.org/job/beam_PostCommit_Python_Verify/ws/sdks/python/.eggs/nose-1.3.7-py2.7.egg/nose/plugins/multiprocess.py",>
line 276, in signalhandler
    raise TimedOutException()
TimedOutException: 'test_wordcount_fnapi_it (apache_beam.examples.wordcount_it_test.WordCountIT)'

----------------------------------------------------------------------
Ran 3 tests in 901.632s

FAILED (errors=1)
Found: https://console.cloud.google.com/dataflow/jobsDetail/locations/us-central1/jobs/2017-11-13_13_26_33-15038963587519080423?project=apache-beam-testing
Found: https://console.cloud.google.com/dataflow/jobsDetail/locations/us-central1/jobs/2017-11-13_13_26_34-6732846717462689300?project=apache-beam-testing
Build step 'Execute shell' marked build as failure
Not sending mail to unregistered user ajamato@ajamato2016.sea.corp.google.com
Not sending mail to unregistered user valentyn@google.com
Not sending mail to unregistered user xumingmingv@gmail.com
Not sending mail to unregistered user klk@google.com
Not sending mail to unregistered user kirpichov@google.com
Not sending mail to unregistered user github@nakomis.com
Not sending mail to unregistered user herohde@google.com
Not sending mail to unregistered user ekirpichov@gmail.com
ERROR: Unable to send to address: echauchot@gmail.com+jbonofre@apache.org
javax.mail.internet.AddressException: Domain contains illegal character in string ``echauchot@gmail.com+jbonofre@apache.org''
	at javax.mail.internet.InternetAddress.checkAddress(InternetAddress.java:1269)
	at javax.mail.internet.InternetAddress.parse(InternetAddress.java:1091)
	at javax.mail.internet.InternetAddress.parse(InternetAddress.java:633)
	at javax.mail.internet.InternetAddress.<init>(InternetAddress.java:111)
	at hudson.tasks.Mailer.stringToAddress(Mailer.java:206)
	at jenkins.plugins.mailer.tasks.MimeMessageBuilder.toNormalizedAddress(MimeMessageBuilder.java:309)
	at jenkins.plugins.mailer.tasks.MimeMessageBuilder.addRecipients(MimeMessageBuilder.java:168)
	at jenkins.plugins.mailer.tasks.MimeMessageBuilder.addRecipients(MimeMessageBuilder.java:160)
	at hudson.tasks.MailSender.createEmptyMail(MailSender.java:389)
	at hudson.tasks.MailSender.createFailureMail(MailSender.java:266)
	at hudson.tasks.MailSender.createMail(MailSender.java:181)
	at hudson.tasks.MailSender.run(MailSender.java:112)
	at hudson.tasks.Mailer.perform(Mailer.java:170)
	at hudson.tasks.BuildStepCompatibilityLayer.perform(BuildStepCompatibilityLayer.java:81)
	at hudson.tasks.BuildStepMonitor$1.perform(BuildStepMonitor.java:20)
	at hudson.model.AbstractBuild$AbstractBuildExecution.perform(AbstractBuild.java:736)
	at hudson.model.AbstractBuild$AbstractBuildExecution.performAllBuildSteps(AbstractBuild.java:682)
	at hudson.model.Build$BuildExecution.post2(Build.java:186)
	at hudson.model.AbstractBuild$AbstractBuildExecution.post(AbstractBuild.java:627)
	at hudson.model.Run.execute(Run.java:1762)
	at hudson.model.FreeStyleBuild.run(FreeStyleBuild.java:43)
	at hudson.model.ResourceController.execute(ResourceController.java:97)
	at hudson.model.Executor.run(Executor.java:419)

Mime
View raw message