beam-commits mailing list archives

Site index · List index
Message view « Date » · « Thread »
Top « Date » · « Thread »
From Apache Jenkins Server <jenk...@builds.apache.org>
Subject Build failed in Jenkins: beam_PostCommit_Python_ValidatesRunner_Dataflow #241
Date Fri, 10 Nov 2017 03:19:42 GMT
See <https://builds.apache.org/job/beam_PostCommit_Python_ValidatesRunner_Dataflow/241/display/redirect>

------------------------------------------
[...truncated 81.68 KB...]
  File was already downloaded /tmp/dataflow-requirements-cache/six-1.11.0.tar.gz
Collecting funcsigs>=1 (from mock->-r postcommit_requirements.txt (line 2))
  File was already downloaded /tmp/dataflow-requirements-cache/funcsigs-1.0.2.tar.gz
Collecting pbr>=0.11 (from mock->-r postcommit_requirements.txt (line 2))
  File was already downloaded /tmp/dataflow-requirements-cache/pbr-3.1.1.tar.gz
Successfully downloaded pyhamcrest mock setuptools six funcsigs pbr
test_as_list_and_as_dict_side_inputs (apache_beam.transforms.sideinputs_test.SideInputsTest)
... ok
<https://builds.apache.org/job/beam_PostCommit_Python_ValidatesRunner_Dataflow/ws/sdks/python/apache_beam/coders/typecoders.py>:134:
UserWarning: Using fallback coder for typehint: Union[Tuple[NoneType, Tuple[Any, NoneType]],
Tuple[NoneType, Tuple[Any, Tuple[int, str]]]].
  warnings.warn('Using fallback coder for typehint: %r.' % typehint)
<https://builds.apache.org/job/beam_PostCommit_Python_ValidatesRunner_Dataflow/ws/sdks/python/apache_beam/coders/typecoders.py>:134:
UserWarning: Using fallback coder for typehint: Union[Tuple[Any, NoneType], Tuple[Any, Tuple[int,
str]]].
  warnings.warn('Using fallback coder for typehint: %r.' % typehint)
DEPRECATION: pip install --download has been deprecated and will be removed in the future.
Pip now has a download command that should be used instead.
Collecting pyhamcrest (from -r postcommit_requirements.txt (line 1))
  File was already downloaded /tmp/dataflow-requirements-cache/PyHamcrest-1.9.0.tar.gz
Collecting mock (from -r postcommit_requirements.txt (line 2))
  File was already downloaded /tmp/dataflow-requirements-cache/mock-2.0.0.tar.gz
Collecting setuptools (from pyhamcrest->-r postcommit_requirements.txt (line 1))
<https://builds.apache.org/job/beam_PostCommit_Python_ValidatesRunner_Dataflow/ws/sdks/python/local/lib/python2.7/site-packages/pip/_vendor/requests/packages/urllib3/util/ssl_.py>:318:
SNIMissingWarning: An HTTPS request has been made, but the SNI (Subject Name Indication) extension
to TLS is not available on this platform. This may cause the server to present an incorrect
TLS certificate, which can cause validation failures. You can upgrade to a newer version of
Python to solve this. For more information, see https://urllib3.readthedocs.io/en/latest/security.html#snimissingwarning.
  SNIMissingWarning
<https://builds.apache.org/job/beam_PostCommit_Python_ValidatesRunner_Dataflow/ws/sdks/python/local/lib/python2.7/site-packages/pip/_vendor/requests/packages/urllib3/util/ssl_.py>:122:
InsecurePlatformWarning: A true SSLContext object is not available. This prevents urllib3
from configuring SSL appropriately and may cause certain SSL connections to fail. You can
upgrade to a newer version of Python to solve this. For more information, see https://urllib3.readthedocs.io/en/latest/security.html#insecureplatformwarning.
  InsecurePlatformWarning
  File was already downloaded /tmp/dataflow-requirements-cache/setuptools-36.7.0.zip
Collecting six (from pyhamcrest->-r postcommit_requirements.txt (line 1))
  File was already downloaded /tmp/dataflow-requirements-cache/six-1.11.0.tar.gz
Collecting funcsigs>=1 (from mock->-r postcommit_requirements.txt (line 2))
  File was already downloaded /tmp/dataflow-requirements-cache/funcsigs-1.0.2.tar.gz
Collecting pbr>=0.11 (from mock->-r postcommit_requirements.txt (line 2))
  File was already downloaded /tmp/dataflow-requirements-cache/pbr-3.1.1.tar.gz
Successfully downloaded pyhamcrest mock setuptools six funcsigs pbr
test_as_singleton_with_different_defaults (apache_beam.transforms.sideinputs_test.SideInputsTest)
... ok
<https://builds.apache.org/job/beam_PostCommit_Python_ValidatesRunner_Dataflow/ws/sdks/python/apache_beam/coders/typecoders.py>:134:
UserWarning: Using fallback coder for typehint: Union[Tuple[NoneType, Tuple[Any, Any]], Tuple[NoneType,
Tuple[Any, NoneType]]].
  warnings.warn('Using fallback coder for typehint: %r.' % typehint)
<https://builds.apache.org/job/beam_PostCommit_Python_ValidatesRunner_Dataflow/ws/sdks/python/apache_beam/coders/typecoders.py>:134:
UserWarning: Using fallback coder for typehint: Union[Tuple[Any, Any], Tuple[Any, NoneType]].
  warnings.warn('Using fallback coder for typehint: %r.' % typehint)
DEPRECATION: pip install --download has been deprecated and will be removed in the future.
Pip now has a download command that should be used instead.
Collecting pyhamcrest (from -r postcommit_requirements.txt (line 1))
<https://builds.apache.org/job/beam_PostCommit_Python_ValidatesRunner_Dataflow/ws/sdks/python/local/lib/python2.7/site-packages/pip/_vendor/requests/packages/urllib3/util/ssl_.py>:318:
SNIMissingWarning: An HTTPS request has been made, but the SNI (Subject Name Indication) extension
to TLS is not available on this platform. This may cause the server to present an incorrect
TLS certificate, which can cause validation failures. You can upgrade to a newer version of
Python to solve this. For more information, see https://urllib3.readthedocs.io/en/latest/security.html#snimissingwarning.
  SNIMissingWarning
<https://builds.apache.org/job/beam_PostCommit_Python_ValidatesRunner_Dataflow/ws/sdks/python/local/lib/python2.7/site-packages/pip/_vendor/requests/packages/urllib3/util/ssl_.py>:122:
InsecurePlatformWarning: A true SSLContext object is not available. This prevents urllib3
from configuring SSL appropriately and may cause certain SSL connections to fail. You can
upgrade to a newer version of Python to solve this. For more information, see https://urllib3.readthedocs.io/en/latest/security.html#insecureplatformwarning.
  InsecurePlatformWarning
  File was already downloaded /tmp/dataflow-requirements-cache/PyHamcrest-1.9.0.tar.gz
Collecting mock (from -r postcommit_requirements.txt (line 2))
  File was already downloaded /tmp/dataflow-requirements-cache/mock-2.0.0.tar.gz
Collecting setuptools (from pyhamcrest->-r postcommit_requirements.txt (line 1))
  File was already downloaded /tmp/dataflow-requirements-cache/setuptools-36.7.0.zip
Collecting six (from pyhamcrest->-r postcommit_requirements.txt (line 1))
  File was already downloaded /tmp/dataflow-requirements-cache/six-1.11.0.tar.gz
Collecting funcsigs>=1 (from mock->-r postcommit_requirements.txt (line 2))
  File was already downloaded /tmp/dataflow-requirements-cache/funcsigs-1.0.2.tar.gz
Collecting pbr>=0.11 (from mock->-r postcommit_requirements.txt (line 2))
  File was already downloaded /tmp/dataflow-requirements-cache/pbr-3.1.1.tar.gz
Successfully downloaded pyhamcrest mock setuptools six funcsigs pbr
test_as_singleton_without_unique_labels (apache_beam.transforms.sideinputs_test.SideInputsTest)
... ok
<https://builds.apache.org/job/beam_PostCommit_Python_ValidatesRunner_Dataflow/ws/sdks/python/apache_beam/coders/typecoders.py>:134:
UserWarning: Using fallback coder for typehint: Union[Tuple[NoneType, Tuple[Any, Any]], Tuple[NoneType,
Tuple[Any, NoneType]]].
  warnings.warn('Using fallback coder for typehint: %r.' % typehint)
<https://builds.apache.org/job/beam_PostCommit_Python_ValidatesRunner_Dataflow/ws/sdks/python/apache_beam/coders/typecoders.py>:134:
UserWarning: Using fallback coder for typehint: Union[Tuple[Any, Any], Tuple[Any, NoneType]].
  warnings.warn('Using fallback coder for typehint: %r.' % typehint)
DEPRECATION: pip install --download has been deprecated and will be removed in the future.
Pip now has a download command that should be used instead.
Collecting pyhamcrest (from -r postcommit_requirements.txt (line 1))
  File was already downloaded /tmp/dataflow-requirements-cache/PyHamcrest-1.9.0.tar.gz
Collecting mock (from -r postcommit_requirements.txt (line 2))
  File was already downloaded /tmp/dataflow-requirements-cache/mock-2.0.0.tar.gz
Collecting setuptools (from pyhamcrest->-r postcommit_requirements.txt (line 1))
  File was already downloaded /tmp/dataflow-requirements-cache/setuptools-36.7.0.zip
Collecting six (from pyhamcrest->-r postcommit_requirements.txt (line 1))
  File was already downloaded /tmp/dataflow-requirements-cache/six-1.11.0.tar.gz
Collecting funcsigs>=1 (from mock->-r postcommit_requirements.txt (line 2))
  File was already downloaded /tmp/dataflow-requirements-cache/funcsigs-1.0.2.tar.gz
Collecting pbr>=0.11 (from mock->-r postcommit_requirements.txt (line 2))
  File was already downloaded /tmp/dataflow-requirements-cache/pbr-3.1.1.tar.gz
Successfully downloaded pyhamcrest mock setuptools six funcsigs pbr
test_default_value_singleton_side_input (apache_beam.transforms.sideinputs_test.SideInputsTest)
... ok
DEPRECATION: pip install --download has been deprecated and will be removed in the future.
Pip now has a download command that should be used instead.
Collecting pyhamcrest (from -r postcommit_requirements.txt (line 1))
  File was already downloaded /tmp/dataflow-requirements-cache/PyHamcrest-1.9.0.tar.gz
Collecting mock (from -r postcommit_requirements.txt (line 2))
  File was already downloaded /tmp/dataflow-requirements-cache/mock-2.0.0.tar.gz
test_flattened_side_input (apache_beam.transforms.sideinputs_test.SideInputsTest) ... ok
Collecting setuptools (from pyhamcrest->-r postcommit_requirements.txt (line 1))
  File was already downloaded /tmp/dataflow-requirements-cache/setuptools-36.7.0.zip
Collecting six (from pyhamcrest->-r postcommit_requirements.txt (line 1))
  File was already downloaded /tmp/dataflow-requirements-cache/six-1.11.0.tar.gz
Collecting funcsigs>=1 (from mock->-r postcommit_requirements.txt (line 2))
  File was already downloaded /tmp/dataflow-requirements-cache/funcsigs-1.0.2.tar.gz
Collecting pbr>=0.11 (from mock->-r postcommit_requirements.txt (line 2))
  File was already downloaded /tmp/dataflow-requirements-cache/pbr-3.1.1.tar.gz
Successfully downloaded pyhamcrest mock setuptools six funcsigs pbr
test_empty_singleton_side_input (apache_beam.transforms.sideinputs_test.SideInputsTest) ...
ok
test_iterable_side_input (apache_beam.transforms.sideinputs_test.SideInputsTest) ... ok
test_multi_valued_singleton_side_input (apache_beam.transforms.sideinputs_test.SideInputsTest)
... ok

======================================================================
ERROR: test_par_do_with_multiple_outputs_and_using_return (apache_beam.transforms.ptransform_test.PTransformTest)
----------------------------------------------------------------------
Traceback (most recent call last):
  File "<https://builds.apache.org/job/beam_PostCommit_Python_ValidatesRunner_Dataflow/ws/sdks/python/apache_beam/transforms/ptransform_test.py",>
line 240, in test_par_do_with_multiple_outputs_and_using_return
    pipeline.run()
  File "<https://builds.apache.org/job/beam_PostCommit_Python_ValidatesRunner_Dataflow/ws/sdks/python/apache_beam/testing/test_pipeline.py",>
line 102, in run
    result = super(TestPipeline, self).run()
  File "<https://builds.apache.org/job/beam_PostCommit_Python_ValidatesRunner_Dataflow/ws/sdks/python/apache_beam/pipeline.py",>
line 330, in run
    self.to_runner_api(), self.runner, self._options).run(False)
  File "<https://builds.apache.org/job/beam_PostCommit_Python_ValidatesRunner_Dataflow/ws/sdks/python/apache_beam/pipeline.py",>
line 339, in run
    return self.runner.run(self)
  File "<https://builds.apache.org/job/beam_PostCommit_Python_ValidatesRunner_Dataflow/ws/sdks/python/apache_beam/runners/dataflow/test_dataflow_runner.py",>
line 39, in run
    self.result = super(TestDataflowRunner, self).run(pipeline)
  File "<https://builds.apache.org/job/beam_PostCommit_Python_ValidatesRunner_Dataflow/ws/sdks/python/apache_beam/runners/dataflow/dataflow_runner.py",>
line 312, in run
    self.dataflow_client.create_job(self.job), self)
  File "<https://builds.apache.org/job/beam_PostCommit_Python_ValidatesRunner_Dataflow/ws/sdks/python/apache_beam/utils/retry.py",>
line 175, in wrapper
    return fun(*args, **kwargs)
  File "<https://builds.apache.org/job/beam_PostCommit_Python_ValidatesRunner_Dataflow/ws/sdks/python/apache_beam/runners/dataflow/internal/apiclient.py",>
line 456, in create_job
    self.create_job_description(job)
  File "<https://builds.apache.org/job/beam_PostCommit_Python_ValidatesRunner_Dataflow/ws/sdks/python/apache_beam/runners/dataflow/internal/apiclient.py",>
line 479, in create_job_description
    job.options, file_copy=self._gcs_file_copy)
  File "<https://builds.apache.org/job/beam_PostCommit_Python_ValidatesRunner_Dataflow/ws/sdks/python/apache_beam/runners/dataflow/internal/dependency.py",>
line 329, in stage_job_resources
    setup_options.requirements_file, requirements_cache_path)
  File "<https://builds.apache.org/job/beam_PostCommit_Python_ValidatesRunner_Dataflow/ws/sdks/python/apache_beam/runners/dataflow/internal/dependency.py",>
line 263, in _populate_requirements_cache
    processes.check_call(cmd_args)
  File "<https://builds.apache.org/job/beam_PostCommit_Python_ValidatesRunner_Dataflow/ws/sdks/python/apache_beam/utils/processes.py",>
line 44, in check_call
    return subprocess.check_call(*args, **kwargs)
  File "/usr/lib/python2.7/subprocess.py", line 540, in check_call
    raise CalledProcessError(retcode, cmd)
CalledProcessError: Command '['<https://builds.apache.org/job/beam_PostCommit_Python_ValidatesRunner_Dataflow/ws/sdks/python/bin/python',>
'-m', 'pip', 'install', '--download', '/tmp/dataflow-requirements-cache', '-r', 'postcommit_requirements.txt',
'--no-binary', ':all:']' returned non-zero exit status 2
-------------------- >> begin captured logging << --------------------
root: DEBUG: PValue computed by Some Numbers/Read (tag None): refcount: 1 => 0
root: DEBUG: PValue computed by ClassifyNumbers/FlatMap(some_fn) (tag None): refcount: 1 =>
0
root: DEBUG: PValue computed by assert_that/WindowInto(WindowIntoFn) (tag None): refcount:
1 => 0
root: DEBUG: PValue computed by assert_that/Create/Read (tag None): refcount: 1 => 0
root: DEBUG: PValue computed by assert_that/ToVoidKey (tag None): refcount: 1 => 0
root: DEBUG: PValue computed by assert_that/Group/pair_with_0 (tag None): refcount: 1 =>
0
root: DEBUG: PValue computed by assert_that/Group/pair_with_1 (tag None): refcount: 1 =>
0
root: DEBUG: PValue computed by assert_that/Group/Flatten (tag None): refcount: 1 => 0
root: DEBUG: PValue computed by assert_that/Group/GroupByKey (tag None): refcount: 1 =>
0
root: DEBUG: PValue computed by assert_that/Group/Map(_merge_tagged_vals_under_key) (tag None):
refcount: 1 => 0
root: DEBUG: PValue computed by assert_that/Unkey (tag None): refcount: 1 => 0
root: DEBUG: PValue computed by ClassifyNumbers/FlatMap(some_fn) (tag odd): refcount: 1 =>
0
root: DEBUG: PValue computed by assert:odd/WindowInto(WindowIntoFn) (tag None): refcount:
1 => 0
root: DEBUG: PValue computed by assert:odd/Create/Read (tag None): refcount: 1 => 0
root: DEBUG: PValue computed by assert:odd/ToVoidKey (tag None): refcount: 1 => 0
root: DEBUG: PValue computed by assert:odd/Group/pair_with_0 (tag None): refcount: 1 =>
0
root: DEBUG: PValue computed by assert:odd/Group/pair_with_1 (tag None): refcount: 1 =>
0
root: DEBUG: PValue computed by assert:odd/Group/Flatten (tag None): refcount: 1 => 0
root: DEBUG: PValue computed by assert:odd/Group/GroupByKey (tag None): refcount: 1 =>
0
root: DEBUG: PValue computed by assert:odd/Group/Map(_merge_tagged_vals_under_key) (tag None):
refcount: 1 => 0
root: DEBUG: PValue computed by assert:odd/Unkey (tag None): refcount: 1 => 0
root: DEBUG: PValue computed by ClassifyNumbers/FlatMap(some_fn) (tag even): refcount: 1 =>
0
root: DEBUG: PValue computed by assert:even/WindowInto(WindowIntoFn) (tag None): refcount:
1 => 0
root: DEBUG: PValue computed by assert:even/Create/Read (tag None): refcount: 1 => 0
root: DEBUG: PValue computed by assert:even/ToVoidKey (tag None): refcount: 1 => 0
root: DEBUG: PValue computed by assert:even/Group/pair_with_0 (tag None): refcount: 1 =>
0
root: DEBUG: PValue computed by assert:even/Group/pair_with_1 (tag None): refcount: 1 =>
0
root: DEBUG: PValue computed by assert:even/Group/Flatten (tag None): refcount: 1 => 0
root: DEBUG: PValue computed by assert:even/Group/GroupByKey (tag None): refcount: 1 =>
0
root: DEBUG: PValue computed by assert:even/Group/Map(_merge_tagged_vals_under_key) (tag None):
refcount: 1 => 0
root: DEBUG: PValue computed by assert:even/Unkey (tag None): refcount: 1 => 0
root: DEBUG: Connecting using Google Application Default Credentials.
root: INFO: Starting GCS upload to gs://temp-storage-for-end-to-end-tests/staging-validatesrunner-test/beamapp-jenkins-1110030038-842025.1510282838.842291/requirements.txt...
oauth2client.transport: INFO: Attempting refresh to obtain initial access_token
root: INFO: Completed GCS upload to gs://temp-storage-for-end-to-end-tests/staging-validatesrunner-test/beamapp-jenkins-1110030038-842025.1510282838.842291/requirements.txt
root: INFO: Executing command: ['<https://builds.apache.org/job/beam_PostCommit_Python_ValidatesRunner_Dataflow/ws/sdks/python/bin/python',>
'-m', 'pip', 'install', '--download', '/tmp/dataflow-requirements-cache', '-r', 'postcommit_requirements.txt',
'--no-binary', ':all:']
--------------------- >> end captured logging << ---------------------

======================================================================
ERROR: test_multiple_empty_outputs (apache_beam.transforms.ptransform_test.PTransformTest)
----------------------------------------------------------------------
Traceback (most recent call last):
  File "<https://builds.apache.org/job/beam_PostCommit_Python_ValidatesRunner_Dataflow/ws/sdks/python/apache_beam/transforms/ptransform_test.py",>
line 266, in test_multiple_empty_outputs
    pipeline.run()
  File "<https://builds.apache.org/job/beam_PostCommit_Python_ValidatesRunner_Dataflow/ws/sdks/python/apache_beam/testing/test_pipeline.py",>
line 102, in run
    result = super(TestPipeline, self).run()
  File "<https://builds.apache.org/job/beam_PostCommit_Python_ValidatesRunner_Dataflow/ws/sdks/python/apache_beam/pipeline.py",>
line 330, in run
    self.to_runner_api(), self.runner, self._options).run(False)
  File "<https://builds.apache.org/job/beam_PostCommit_Python_ValidatesRunner_Dataflow/ws/sdks/python/apache_beam/pipeline.py",>
line 339, in run
    return self.runner.run(self)
  File "<https://builds.apache.org/job/beam_PostCommit_Python_ValidatesRunner_Dataflow/ws/sdks/python/apache_beam/runners/dataflow/test_dataflow_runner.py",>
line 39, in run
    self.result = super(TestDataflowRunner, self).run(pipeline)
  File "<https://builds.apache.org/job/beam_PostCommit_Python_ValidatesRunner_Dataflow/ws/sdks/python/apache_beam/runners/dataflow/dataflow_runner.py",>
line 312, in run
    self.dataflow_client.create_job(self.job), self)
  File "<https://builds.apache.org/job/beam_PostCommit_Python_ValidatesRunner_Dataflow/ws/sdks/python/apache_beam/utils/retry.py",>
line 175, in wrapper
    return fun(*args, **kwargs)
  File "<https://builds.apache.org/job/beam_PostCommit_Python_ValidatesRunner_Dataflow/ws/sdks/python/apache_beam/runners/dataflow/internal/apiclient.py",>
line 456, in create_job
    self.create_job_description(job)
  File "<https://builds.apache.org/job/beam_PostCommit_Python_ValidatesRunner_Dataflow/ws/sdks/python/apache_beam/runners/dataflow/internal/apiclient.py",>
line 479, in create_job_description
    job.options, file_copy=self._gcs_file_copy)
  File "<https://builds.apache.org/job/beam_PostCommit_Python_ValidatesRunner_Dataflow/ws/sdks/python/apache_beam/runners/dataflow/internal/dependency.py",>
line 329, in stage_job_resources
    setup_options.requirements_file, requirements_cache_path)
  File "<https://builds.apache.org/job/beam_PostCommit_Python_ValidatesRunner_Dataflow/ws/sdks/python/apache_beam/runners/dataflow/internal/dependency.py",>
line 263, in _populate_requirements_cache
    processes.check_call(cmd_args)
  File "<https://builds.apache.org/job/beam_PostCommit_Python_ValidatesRunner_Dataflow/ws/sdks/python/apache_beam/utils/processes.py",>
line 44, in check_call
    return subprocess.check_call(*args, **kwargs)
  File "/usr/lib/python2.7/subprocess.py", line 540, in check_call
    raise CalledProcessError(retcode, cmd)
CalledProcessError: Command '['<https://builds.apache.org/job/beam_PostCommit_Python_ValidatesRunner_Dataflow/ws/sdks/python/bin/python',>
'-m', 'pip', 'install', '--download', '/tmp/dataflow-requirements-cache', '-r', 'postcommit_requirements.txt',
'--no-binary', ':all:']' returned non-zero exit status 2
-------------------- >> begin captured logging << --------------------
root: DEBUG: PValue computed by Some Numbers/Read (tag None): refcount: 1 => 0
root: DEBUG: PValue computed by ClassifyNumbers/FlatMap(<lambda at ptransform_test.py:260>)
(tag None): refcount: 1 => 0
root: DEBUG: PValue computed by assert_that/WindowInto(WindowIntoFn) (tag None): refcount:
1 => 0
root: DEBUG: PValue computed by assert_that/Create/Read (tag None): refcount: 1 => 0
root: DEBUG: PValue computed by assert_that/ToVoidKey (tag None): refcount: 1 => 0
root: DEBUG: PValue computed by assert_that/Group/pair_with_0 (tag None): refcount: 1 =>
0
root: DEBUG: PValue computed by assert_that/Group/pair_with_1 (tag None): refcount: 1 =>
0
root: DEBUG: PValue computed by assert_that/Group/Flatten (tag None): refcount: 1 => 0
root: DEBUG: PValue computed by assert_that/Group/GroupByKey (tag None): refcount: 1 =>
0
root: DEBUG: PValue computed by assert_that/Group/Map(_merge_tagged_vals_under_key) (tag None):
refcount: 1 => 0
root: DEBUG: PValue computed by assert_that/Unkey (tag None): refcount: 1 => 0
root: DEBUG: PValue computed by ClassifyNumbers/FlatMap(<lambda at ptransform_test.py:260>)
(tag odd): refcount: 1 => 0
root: DEBUG: PValue computed by assert:odd/WindowInto(WindowIntoFn) (tag None): refcount:
1 => 0
root: DEBUG: PValue computed by assert:odd/Create/Read (tag None): refcount: 1 => 0
root: DEBUG: PValue computed by assert:odd/ToVoidKey (tag None): refcount: 1 => 0
root: DEBUG: PValue computed by assert:odd/Group/pair_with_0 (tag None): refcount: 1 =>
0
root: DEBUG: PValue computed by assert:odd/Group/pair_with_1 (tag None): refcount: 1 =>
0
root: DEBUG: PValue computed by assert:odd/Group/Flatten (tag None): refcount: 1 => 0
root: DEBUG: PValue computed by assert:odd/Group/GroupByKey (tag None): refcount: 1 =>
0
root: DEBUG: PValue computed by assert:odd/Group/Map(_merge_tagged_vals_under_key) (tag None):
refcount: 1 => 0
root: DEBUG: PValue computed by assert:odd/Unkey (tag None): refcount: 1 => 0
root: DEBUG: PValue computed by ClassifyNumbers/FlatMap(<lambda at ptransform_test.py:260>)
(tag even): refcount: 1 => 0
root: DEBUG: PValue computed by assert:even/WindowInto(WindowIntoFn) (tag None): refcount:
1 => 0
root: DEBUG: PValue computed by assert:even/Create/Read (tag None): refcount: 1 => 0
root: DEBUG: PValue computed by assert:even/ToVoidKey (tag None): refcount: 1 => 0
root: DEBUG: PValue computed by assert:even/Group/pair_with_0 (tag None): refcount: 1 =>
0
root: DEBUG: PValue computed by assert:even/Group/pair_with_1 (tag None): refcount: 1 =>
0
root: DEBUG: PValue computed by assert:even/Group/Flatten (tag None): refcount: 1 => 0
root: DEBUG: PValue computed by assert:even/Group/GroupByKey (tag None): refcount: 1 =>
0
root: DEBUG: PValue computed by assert:even/Group/Map(_merge_tagged_vals_under_key) (tag None):
refcount: 1 => 0
root: DEBUG: PValue computed by assert:even/Unkey (tag None): refcount: 1 => 0
root: DEBUG: Connecting using Google Application Default Credentials.
root: INFO: Starting GCS upload to gs://temp-storage-for-end-to-end-tests/staging-validatesrunner-test/beamapp-jenkins-1110030038-384329.1510282838.384629/requirements.txt...
oauth2client.transport: INFO: Attempting refresh to obtain initial access_token
root: INFO: Completed GCS upload to gs://temp-storage-for-end-to-end-tests/staging-validatesrunner-test/beamapp-jenkins-1110030038-384329.1510282838.384629/requirements.txt
root: INFO: Executing command: ['<https://builds.apache.org/job/beam_PostCommit_Python_ValidatesRunner_Dataflow/ws/sdks/python/bin/python',>
'-m', 'pip', 'install', '--download', '/tmp/dataflow-requirements-cache', '-r', 'postcommit_requirements.txt',
'--no-binary', ':all:']
--------------------- >> end captured logging << ---------------------

----------------------------------------------------------------------
Ran 15 tests in 1145.464s

FAILED (errors=2)
Found: https://console.cloud.google.com/dataflow/jobsDetail/locations/us-central1/jobs/2017-11-09_19_01_29-10708922835365531424?project=apache-beam-testing
Found: https://console.cloud.google.com/dataflow/jobsDetail/locations/us-central1/jobs/2017-11-09_19_06_09-1735504776345699773?project=apache-beam-testing
Found: https://console.cloud.google.com/dataflow/jobsDetail/locations/us-central1/jobs/2017-11-09_19_10_57-14745647572275069281?project=apache-beam-testing
Found: https://console.cloud.google.com/dataflow/jobsDetail/locations/us-central1/jobs/2017-11-09_19_15_53-18142085376626807388?project=apache-beam-testing
Found: https://console.cloud.google.com/dataflow/jobsDetail/locations/us-central1/jobs/2017-11-09_19_01_31-1357365829215864200?project=apache-beam-testing
Found: https://console.cloud.google.com/dataflow/jobsDetail/locations/us-central1/jobs/2017-11-09_19_07_04-17722347520910253785?project=apache-beam-testing
Found: https://console.cloud.google.com/dataflow/jobsDetail/locations/us-central1/jobs/2017-11-09_19_11_45-2828501233279439051?project=apache-beam-testing
Found: https://console.cloud.google.com/dataflow/jobsDetail/locations/us-central1/jobs/2017-11-09_19_01_21-6592914242058793350?project=apache-beam-testing
Found: https://console.cloud.google.com/dataflow/jobsDetail/locations/us-central1/jobs/2017-11-09_19_06_55-13190801892674778709?project=apache-beam-testing
Found: https://console.cloud.google.com/dataflow/jobsDetail/locations/us-central1/jobs/2017-11-09_19_11_21-10219784504889497361?project=apache-beam-testing
Found: https://console.cloud.google.com/dataflow/jobsDetail/locations/us-central1/jobs/2017-11-09_19_01_34-9830879510617414712?project=apache-beam-testing
Found: https://console.cloud.google.com/dataflow/jobsDetail/locations/us-central1/jobs/2017-11-09_19_06_00-17233959769854300148?project=apache-beam-testing
Found: https://console.cloud.google.com/dataflow/jobsDetail/locations/us-central1/jobs/2017-11-09_19_11_22-10849408628258222630?project=apache-beam-testing
Build step 'Execute shell' marked build as failure

Mime
View raw message