beam-commits mailing list archives

Site index · List index
Message view « Date » · « Thread »
Top « Date » · « Thread »
From Apache Jenkins Server <jenk...@builds.apache.org>
Subject Build failed in Jenkins: beam_PostCommit_Java_MavenInstall #5086
Date Sun, 22 Oct 2017 09:00:20 GMT
See <https://builds.apache.org/job/beam_PostCommit_Java_MavenInstall/5086/display/redirect?page=changes>

Changes:

[robertwb] Implement FnApi side inputs in Python.

------------------------------------------
[...truncated 2.00 MB...]
2017-10-22T08:58:52.707 [INFO] 
2017-10-22T08:58:52.707 [INFO] <<< findbugs-maven-plugin:3.0.4:check (default) <
:findbugs @ beam-runners-gearpump <<<
2017-10-22T08:58:52.707 [INFO] 
2017-10-22T08:58:52.707 [INFO] --- findbugs-maven-plugin:3.0.4:check (default) @ beam-runners-gearpump
---
2017-10-22T08:58:52.714 [INFO] BugInstance size is 1
2017-10-22T08:58:52.715 [INFO] Error size is 0
2017-10-22T08:58:52.717 [INFO] Total bugs: 1
2017-10-22T08:58:52.717 [INFO] org.apache.beam.runners.gearpump.GearpumpPipelineResult.metrics()
may return null, but is declared @Nonnull [org.apache.beam.runners.gearpump.GearpumpPipelineResult]
At GearpumpPipelineResult.java:[line 86] NP_NONNULL_RETURN_VIOLATION
2017-10-22T08:58:52.717 [INFO] 


To see bug detail using the Findbugs GUI, use the following command "mvn findbugs:gui"



[JENKINS] Archiving disabled
2017-10-22T08:58:53.588 [INFO]                                                           
             
2017-10-22T08:58:53.588 [INFO] ------------------------------------------------------------------------
2017-10-22T08:58:53.588 [INFO] Skipping Apache Beam :: SDKs :: Java :: Aggregated Javadoc
2017-10-22T08:58:53.588 [INFO] This project has been banned from the build due to previous
failures.
2017-10-22T08:58:53.588 [INFO] ------------------------------------------------------------------------
2017-10-22T08:58:53.859 [INFO]                                                           
             
2017-10-22T08:58:53.859 [INFO] ------------------------------------------------------------------------
2017-10-22T08:58:53.859 [INFO] Building Apache Beam :: Parent 2.3.0-SNAPSHOT
2017-10-22T08:58:53.859 [INFO] ------------------------------------------------------------------------
2017-10-22T08:58:53.947 [WARNING] The POM for org.eclipse.m2e:lifecycle-mapping:jar:1.0.0
is missing, no dependency information available
2017-10-22T08:58:53.948 [WARNING] Failed to retrieve plugin descriptor for org.eclipse.m2e:lifecycle-mapping:1.0.0:
Plugin org.eclipse.m2e:lifecycle-mapping:1.0.0 or one of its dependencies could not be resolved:
Failure to find org.eclipse.m2e:lifecycle-mapping:jar:1.0.0 in https://repo.maven.apache.org/maven2
was cached in the local repository, resolution will not be reattempted until the update interval
of central has elapsed or updates are forced
2017-10-22T08:58:53.949 [INFO] 
2017-10-22T08:58:53.949 [INFO] --- coveralls-maven-plugin:4.3.0:report (default-cli) @ beam-parent
---
2017-10-22T08:58:53.976 [INFO] Downloading: https://repo.maven.apache.org/maven2/org/apache/httpcomponents/httpmime/4.5.2/httpmime-4.5.2.pom
2017-10-22T08:58:54.003 [INFO] Downloaded: https://repo.maven.apache.org/maven2/org/apache/httpcomponents/httpmime/4.5.2/httpmime-4.5.2.pom
(5 KB at 173.0 KB/sec)
2017-10-22T08:58:54.008 [INFO] Downloading: https://repo.maven.apache.org/maven2/com/fasterxml/jackson/core/jackson-core/2.8.3/jackson-core-2.8.3.pom
2017-10-22T08:58:54.034 [INFO] Downloaded: https://repo.maven.apache.org/maven2/com/fasterxml/jackson/core/jackson-core/2.8.3/jackson-core-2.8.3.pom
(6 KB at 203.4 KB/sec)
2017-10-22T08:58:54.039 [INFO] Downloading: https://repo.maven.apache.org/maven2/com/fasterxml/jackson/core/jackson-annotations/2.8.3/jackson-annotations-2.8.3.pom
2017-10-22T08:58:54.065 [INFO] Downloaded: https://repo.maven.apache.org/maven2/com/fasterxml/jackson/core/jackson-annotations/2.8.3/jackson-annotations-2.8.3.pom
(2 KB at 69.4 KB/sec)
2017-10-22T08:58:54.069 [INFO] Downloading: https://repo.maven.apache.org/maven2/com/fasterxml/jackson/core/jackson-databind/2.8.3/jackson-databind-2.8.3.pom
2017-10-22T08:58:54.096 [INFO] Downloaded: https://repo.maven.apache.org/maven2/com/fasterxml/jackson/core/jackson-databind/2.8.3/jackson-databind-2.8.3.pom
(6 KB at 196.3 KB/sec)
2017-10-22T08:58:54.101 [INFO] Downloading: https://repo.maven.apache.org/maven2/org/eclipse/jgit/org.eclipse.jgit/4.5.0.201609210915-r/org.eclipse.jgit-4.5.0.201609210915-r.pom
2017-10-22T08:58:54.128 [INFO] Downloaded: https://repo.maven.apache.org/maven2/org/eclipse/jgit/org.eclipse.jgit/4.5.0.201609210915-r/org.eclipse.jgit-4.5.0.201609210915-r.pom
(10 KB at 343.7 KB/sec)
2017-10-22T08:58:54.151 [INFO] Downloading: https://repo.maven.apache.org/maven2/org/eclipse/jgit/org.eclipse.jgit-parent/4.5.0.201609210915-r/org.eclipse.jgit-parent-4.5.0.201609210915-r.pom
2017-10-22T08:58:54.180 [INFO] Downloaded: https://repo.maven.apache.org/maven2/org/eclipse/jgit/org.eclipse.jgit-parent/4.5.0.201609210915-r/org.eclipse.jgit-parent-4.5.0.201609210915-r.pom
(27 KB at 911.2 KB/sec)
2017-10-22T08:58:54.208 [INFO] Downloading: https://repo.maven.apache.org/maven2/com/jcraft/jsch/0.1.53/jsch-0.1.53.pom
2017-10-22T08:58:54.235 [INFO] Downloaded: https://repo.maven.apache.org/maven2/com/jcraft/jsch/0.1.53/jsch-0.1.53.pom
(4 KB at 117.0 KB/sec)
2017-10-22T08:58:54.237 [INFO] Downloading: https://repo.maven.apache.org/maven2/org/sonatype/oss/oss-parent/6/oss-parent-6.pom
2017-10-22T08:58:54.265 [INFO] Downloaded: https://repo.maven.apache.org/maven2/org/sonatype/oss/oss-parent/6/oss-parent-6.pom
(5 KB at 168.5 KB/sec)
2017-10-22T08:58:54.267 [INFO] Downloading: https://repo.maven.apache.org/maven2/com/googlecode/javaewah/JavaEWAH/0.7.9/JavaEWAH-0.7.9.pom
2017-10-22T08:58:54.338 [INFO] Downloaded: https://repo.maven.apache.org/maven2/com/googlecode/javaewah/JavaEWAH/0.7.9/JavaEWAH-0.7.9.pom
(5 KB at 59.7 KB/sec)
2017-10-22T08:58:54.340 [INFO] Downloading: https://repo.maven.apache.org/maven2/org/codehaus/plexus/plexus-utils/2.0.7/plexus-utils-2.0.7.pom
2017-10-22T08:58:54.367 [INFO] Downloaded: https://repo.maven.apache.org/maven2/org/codehaus/plexus/plexus-utils/2.0.7/plexus-utils-2.0.7.pom
(3 KB at 101.7 KB/sec)
2017-10-22T08:58:54.370 [INFO] Downloading: https://repo.maven.apache.org/maven2/org/sonatype/sisu/sisu-inject-plexus/1.4.3.2/sisu-inject-plexus-1.4.3.2.pom
2017-10-22T08:58:54.397 [INFO] Downloaded: https://repo.maven.apache.org/maven2/org/sonatype/sisu/sisu-inject-plexus/1.4.3.2/sisu-inject-plexus-1.4.3.2.pom
(6 KB at 188.4 KB/sec)
2017-10-22T08:58:54.415 [INFO] Downloading: https://repo.maven.apache.org/maven2/org/sonatype/sisu/inject/guice-plexus/1.4.3.2/guice-plexus-1.4.3.2.pom
2017-10-22T08:58:54.442 [INFO] Downloaded: https://repo.maven.apache.org/maven2/org/sonatype/sisu/inject/guice-plexus/1.4.3.2/guice-plexus-1.4.3.2.pom
(3 KB at 109.7 KB/sec)
2017-10-22T08:58:54.444 [INFO] Downloading: https://repo.maven.apache.org/maven2/org/sonatype/sisu/inject/guice-bean/1.4.3.2/guice-bean-1.4.3.2.pom
2017-10-22T08:58:54.470 [INFO] Downloaded: https://repo.maven.apache.org/maven2/org/sonatype/sisu/inject/guice-bean/1.4.3.2/guice-bean-1.4.3.2.pom
(3 KB at 94.9 KB/sec)
2017-10-22T08:58:54.472 [INFO] Downloading: https://repo.maven.apache.org/maven2/org/sonatype/sisu/sisu-inject/1.4.3.2/sisu-inject-1.4.3.2.pom
2017-10-22T08:58:54.498 [INFO] Downloaded: https://repo.maven.apache.org/maven2/org/sonatype/sisu/sisu-inject/1.4.3.2/sisu-inject-1.4.3.2.pom
(2 KB at 45.2 KB/sec)
2017-10-22T08:58:54.500 [INFO] Downloading: https://repo.maven.apache.org/maven2/org/sonatype/sisu/sisu-parent/1.4.3.2/sisu-parent-1.4.3.2.pom
2017-10-22T08:58:54.528 [INFO] Downloaded: https://repo.maven.apache.org/maven2/org/sonatype/sisu/sisu-parent/1.4.3.2/sisu-parent-1.4.3.2.pom
(8 KB at 281.9 KB/sec)
2017-10-22T08:58:54.532 [INFO] Downloading: https://repo.maven.apache.org/maven2/org/sonatype/sisu/sisu-inject-bean/1.4.3.2/sisu-inject-bean-1.4.3.2.pom
2017-10-22T08:58:54.559 [INFO] Downloaded: https://repo.maven.apache.org/maven2/org/sonatype/sisu/sisu-inject-bean/1.4.3.2/sisu-inject-bean-1.4.3.2.pom
(6 KB at 191.7 KB/sec)
2017-10-22T08:58:54.564 [INFO] Downloading: https://repo.maven.apache.org/maven2/org/sonatype/sisu/sisu-guice/2.9.2/sisu-guice-2.9.2.pom
2017-10-22T08:58:54.591 [INFO] Downloaded: https://repo.maven.apache.org/maven2/org/sonatype/sisu/sisu-guice/2.9.2/sisu-guice-2.9.2.pom
(8 KB at 265.8 KB/sec)
2017-10-22T08:58:54.609 [INFO] Downloading: https://repo.maven.apache.org/maven2/org/sonatype/sisu/inject/guice-parent/2.9.2/guice-parent-2.9.2.pom
2017-10-22T08:58:54.637 [INFO] Downloaded: https://repo.maven.apache.org/maven2/org/sonatype/sisu/inject/guice-parent/2.9.2/guice-parent-2.9.2.pom
(12 KB at 427.0 KB/sec)
2017-10-22T08:58:54.641 [INFO] Downloading: https://repo.maven.apache.org/maven2/org/slf4j/jcl-over-slf4j/1.7.21/jcl-over-slf4j-1.7.21.pom
2017-10-22T08:58:54.667 [INFO] Downloaded: https://repo.maven.apache.org/maven2/org/slf4j/jcl-over-slf4j/1.7.21/jcl-over-slf4j-1.7.21.pom
(963 B at 36.2 KB/sec)
2017-10-22T08:58:54.703 [INFO] Downloading: https://repo.maven.apache.org/maven2/org/apache/httpcomponents/httpmime/4.5.2/httpmime-4.5.2.jar
2017-10-22T08:58:54.703 [INFO] Downloading: https://repo.maven.apache.org/maven2/com/fasterxml/jackson/core/jackson-core/2.8.3/jackson-core-2.8.3.jar
2017-10-22T08:58:54.704 [INFO] Downloading: https://repo.maven.apache.org/maven2/com/fasterxml/jackson/core/jackson-annotations/2.8.3/jackson-annotations-2.8.3.jar
2017-10-22T08:58:54.705 [INFO] Downloading: https://repo.maven.apache.org/maven2/com/fasterxml/jackson/core/jackson-databind/2.8.3/jackson-databind-2.8.3.jar
2017-10-22T08:58:54.706 [INFO] Downloading: https://repo.maven.apache.org/maven2/org/eclipse/jgit/org.eclipse.jgit/4.5.0.201609210915-r/org.eclipse.jgit-4.5.0.201609210915-r.jar
2017-10-22T08:58:54.750 [INFO] Downloaded: https://repo.maven.apache.org/maven2/org/apache/httpcomponents/httpmime/4.5.2/httpmime-4.5.2.jar
(41 KB at 852.5 KB/sec)
2017-10-22T08:58:54.750 [INFO] Downloading: https://repo.maven.apache.org/maven2/com/jcraft/jsch/0.1.53/jsch-0.1.53.jar
2017-10-22T08:58:54.750 [INFO] Downloaded: https://repo.maven.apache.org/maven2/com/fasterxml/jackson/core/jackson-annotations/2.8.3/jackson-annotations-2.8.3.jar
(55 KB at 1156.3 KB/sec)
2017-10-22T08:58:54.751 [INFO] Downloading: https://repo.maven.apache.org/maven2/com/googlecode/javaewah/JavaEWAH/0.7.9/JavaEWAH-0.7.9.jar
2017-10-22T08:58:54.778 [INFO] Downloaded: https://repo.maven.apache.org/maven2/com/fasterxml/jackson/core/jackson-core/2.8.3/jackson-core-2.8.3.jar
(275 KB at 3659.9 KB/sec)
2017-10-22T08:58:54.778 [INFO] Downloading: https://repo.maven.apache.org/maven2/org/codehaus/plexus/plexus-utils/2.0.7/plexus-utils-2.0.7.jar
2017-10-22T08:58:54.805 [INFO] Downloaded: https://repo.maven.apache.org/maven2/com/googlecode/javaewah/JavaEWAH/0.7.9/JavaEWAH-0.7.9.jar
(123 KB at 1222.1 KB/sec)
2017-10-22T08:58:54.805 [INFO] Downloading: https://repo.maven.apache.org/maven2/org/sonatype/sisu/sisu-inject-plexus/1.4.3.2/sisu-inject-plexus-1.4.3.2.jar
2017-10-22T08:58:54.846 [INFO] Downloaded: https://repo.maven.apache.org/maven2/com/jcraft/jsch/0.1.53/jsch-0.1.53.jar
(274 KB at 1940.7 KB/sec)
2017-10-22T08:58:54.847 [INFO] Downloading: https://repo.maven.apache.org/maven2/org/sonatype/sisu/sisu-inject-bean/1.4.3.2/sisu-inject-bean-1.4.3.2.jar
2017-10-22T08:58:54.929 [INFO] Downloaded: https://repo.maven.apache.org/maven2/org/sonatype/sisu/sisu-inject-plexus/1.4.3.2/sisu-inject-plexus-1.4.3.2.jar
(201 KB at 893.2 KB/sec)
2017-10-22T08:58:54.929 [INFO] Downloading: https://repo.maven.apache.org/maven2/org/sonatype/sisu/sisu-guice/2.9.2/sisu-guice-2.9.2-no_aop.jar
2017-10-22T08:58:54.966 [INFO] Downloaded: https://repo.maven.apache.org/maven2/org/codehaus/plexus/plexus-utils/2.0.7/plexus-utils-2.0.7.jar
(219 KB at 837.9 KB/sec)
2017-10-22T08:58:54.967 [INFO] Downloading: https://repo.maven.apache.org/maven2/org/slf4j/slf4j-api/1.7.21/slf4j-api-1.7.21.jar
2017-10-22T08:58:54.978 [INFO] Downloaded: https://repo.maven.apache.org/maven2/org/sonatype/sisu/sisu-inject-bean/1.4.3.2/sisu-inject-bean-1.4.3.2.jar
(157 KB at 573.9 KB/sec)
2017-10-22T08:58:54.978 [INFO] Downloading: https://repo.maven.apache.org/maven2/org/slf4j/jcl-over-slf4j/1.7.21/jcl-over-slf4j-1.7.21.jar
2017-10-22T08:58:55.006 [INFO] Downloaded: https://repo.maven.apache.org/maven2/org/slf4j/jcl-over-slf4j/1.7.21/jcl-over-slf4j-1.7.21.jar
(17 KB at 53.5 KB/sec)
2017-10-22T08:58:55.014 [INFO] Downloaded: https://repo.maven.apache.org/maven2/org/slf4j/slf4j-api/1.7.21/slf4j-api-1.7.21.jar
(41 KB at 129.8 KB/sec)
2017-10-22T08:58:55.045 [INFO] Downloaded: https://repo.maven.apache.org/maven2/org/sonatype/sisu/sisu-guice/2.9.2/sisu-guice-2.9.2-no_aop.jar
(469 KB at 1378.2 KB/sec)
2017-10-22T08:58:55.074 [INFO] Downloaded: https://repo.maven.apache.org/maven2/com/fasterxml/jackson/core/jackson-databind/2.8.3/jackson-databind-2.8.3.jar
(1205 KB at 3256.2 KB/sec)
2017-10-22T08:58:55.149 [INFO] Downloaded: https://repo.maven.apache.org/maven2/org/eclipse/jgit/org.eclipse.jgit/4.5.0.201609210915-r/org.eclipse.jgit-4.5.0.201609210915-r.jar
(2324 KB at 5221.0 KB/sec)
2017-10-22T08:58:56.983 [INFO] Starting Coveralls job for jenkins (5086 / https://builds.apache.org/job/beam_PostCommit_Java_MavenInstall/5086/)
2017-10-22T08:58:56.984 [INFO] Using repository token <secret>
2017-10-22T08:58:56.984 [INFO] Git commit 77c77ad in master
2017-10-22T08:58:56.984 [INFO] Writing Coveralls data to <https://builds.apache.org/job/beam_PostCommit_Java_MavenInstall/ws/src/target/coveralls.json...>
2017-10-22T08:58:57.048 [INFO] Processing coverage report from <https://builds.apache.org/job/beam_PostCommit_Java_MavenInstall/ws/src/sdks/java/core/target/site/jacoco/jacoco.xml>
2017-10-22T08:58:59.428 [INFO] Processing coverage report from <https://builds.apache.org/job/beam_PostCommit_Java_MavenInstall/ws/src/sdks/java/extensions/google-cloud-platform-core/target/site/jacoco/jacoco.xml>
2017-10-22T08:58:59.536 [INFO] Processing coverage report from <https://builds.apache.org/job/beam_PostCommit_Java_MavenInstall/ws/src/sdks/java/extensions/protobuf/target/site/jacoco/jacoco.xml>
2017-10-22T08:58:59.545 [INFO] Processing coverage report from <https://builds.apache.org/job/beam_PostCommit_Java_MavenInstall/ws/src/sdks/java/java8tests/target/site/jacoco/jacoco.xml>
2017-10-22T08:58:59.556 [INFO] Processing coverage report from <https://builds.apache.org/job/beam_PostCommit_Java_MavenInstall/ws/src/runners/core-java/target/site/jacoco/jacoco.xml>
2017-10-22T08:59:00.250 [INFO] Processing coverage report from <https://builds.apache.org/job/beam_PostCommit_Java_MavenInstall/ws/src/runners/direct-java/target/site/jacoco/jacoco.xml>
2017-10-22T08:59:00.597 [INFO] Processing coverage report from <https://builds.apache.org/job/beam_PostCommit_Java_MavenInstall/ws/src/runners/google-cloud-dataflow-java/target/site/jacoco/jacoco.xml>
2017-10-22T08:59:00.789 [INFO] Processing coverage report from <https://builds.apache.org/job/beam_PostCommit_Java_MavenInstall/ws/src/examples/java/target/site/jacoco/jacoco.xml>
2017-10-22T08:59:00.901 [INFO] Processing coverage report from <https://builds.apache.org/job/beam_PostCommit_Java_MavenInstall/ws/src/examples/java8/target/site/jacoco/jacoco.xml>
[JENKINS] Archiving disabled
[JENKINS] Archiving disabled
[JENKINS] Archiving disabled
[JENKINS] Archiving disabled
[JENKINS] Archiving disabled
[JENKINS] Archiving disabled
[JENKINS] Archiving disabled
[JENKINS] Archiving disabled
[JENKINS] Archiving disabled
[JENKINS] Archiving disabled
[JENKINS] Archiving disabled
[JENKINS] Archiving disabled
[JENKINS] Archiving disabled
[JENKINS] Archiving disabled
[JENKINS] Archiving disabled
[JENKINS] Archiving disabled
[JENKINS] Archiving disabled
[JENKINS] Archiving disabled
[JENKINS] Archiving disabled
[JENKINS] Archiving disabled
[JENKINS] Archiving disabled
[JENKINS] Archiving disabled
[JENKINS] Archiving disabled
[JENKINS] Archiving disabled
[JENKINS] Archiving disabled
[JENKINS] Archiving disabled
[JENKINS] Archiving disabled
[JENKINS] Archiving disabled
[JENKINS] Archiving disabled
[JENKINS] Archiving disabled
[JENKINS] Archiving disabled
[JENKINS] Archiving disabled
[JENKINS] Archiving disabled
[JENKINS] Archiving disabled
[JENKINS] Archiving disabled
[JENKINS] Archiving disabled
[JENKINS] Archiving disabled
[JENKINS] Archiving disabled
[JENKINS] Archiving disabled
[JENKINS] Archiving disabled
[JENKINS] Archiving disabled
[JENKINS] Archiving disabled
[JENKINS] Archiving disabled
[JENKINS] Archiving disabled
[JENKINS] Archiving disabled
[JENKINS] Archiving disabled
[JENKINS] Archiving disabled
[JENKINS] Archiving disabled
[JENKINS] Archiving disabled
[JENKINS] Archiving disabled
[JENKINS] Archiving disabled
[JENKINS] Archiving disabled
[JENKINS] Archiving disabled
[JENKINS] Archiving disabled
[JENKINS] Archiving disabled
[JENKINS] Archiving disabled
[JENKINS] Archiving disabled
[JENKINS] Archiving disabled
2017-10-22T08:59:55.245 [INFO] ------------------------------------------------------------------------
2017-10-22T08:59:55.245 [INFO] Reactor Summary:
2017-10-22T08:59:55.245 [INFO] 
2017-10-22T08:59:55.246 [INFO] Apache Beam :: Parent .............................. FAILURE
[  7.521 s]
2017-10-22T08:59:55.246 [INFO] Apache Beam :: SDKs :: Java :: Build Tools ......... SUCCESS
[ 15.203 s]
2017-10-22T08:59:55.246 [INFO] Apache Beam :: Model ............................... SUCCESS
[  2.248 s]
2017-10-22T08:59:55.246 [INFO] Apache Beam :: Model :: Pipeline ................... SUCCESS
[ 32.051 s]
2017-10-22T08:59:55.246 [INFO] Apache Beam :: Model :: Fn Execution ............... SUCCESS
[ 26.478 s]
2017-10-22T08:59:55.247 [INFO] Apache Beam :: SDKs ................................ SUCCESS
[  3.260 s]
2017-10-22T08:59:55.247 [INFO] Apache Beam :: SDKs :: Java ........................ SUCCESS
[  3.256 s]
2017-10-22T08:59:55.247 [INFO] Apache Beam :: SDKs :: Java :: Core ................ SUCCESS
[04:31 min]
2017-10-22T08:59:55.247 [INFO] Apache Beam :: Runners :: Core Construction Java ... SUCCESS
[01:04 min]
2017-10-22T08:59:55.247 [INFO] Apache Beam :: Runners :: Core Java ................ SUCCESS
[01:37 min]
2017-10-22T08:59:55.247 [INFO] Apache Beam :: Runners :: Direct Java .............. SUCCESS
[09:53 min]
2017-10-22T08:59:55.247 [INFO] Apache Beam :: SDKs :: Java :: IO :: AMQP .......... SUCCESS
[01:32 min]
2017-10-22T08:59:55.248 [INFO] Apache Beam :: SDKs :: Java :: IO :: Common ........ SUCCESS
[ 28.630 s]
2017-10-22T08:59:55.248 [INFO] Apache Beam :: SDKs :: Java :: IO :: Cassandra ..... SUCCESS
[01:09 min]
2017-10-22T08:59:55.248 [INFO] Apache Beam :: SDKs :: Java :: IO :: Elasticsearch . SUCCESS
[ 51.571 s]
2017-10-22T08:59:55.248 [INFO] Apache Beam :: SDKs :: Java :: IO :: Elasticsearch-Tests SUCCESS
[ 19.082 s]
2017-10-22T08:59:55.248 [INFO] Apache Beam :: SDKs :: Java :: IO :: Elasticsearch-Tests ::
Common SUCCESS [ 17.883 s]
2017-10-22T08:59:55.248 [INFO] Apache Beam :: SDKs :: Java :: IO :: Elasticsearch-Tests ::
2.x SUCCESS [01:03 min]
2017-10-22T08:59:55.248 [INFO] Apache Beam :: SDKs :: Java :: IO :: Elasticsearch-Tests ::
5.x SUCCESS [01:23 min]
2017-10-22T08:59:55.248 [INFO] Apache Beam :: SDKs :: Java :: Extensions :: Google Cloud Platform
Core SUCCESS [01:24 min]
2017-10-22T08:59:55.249 [INFO] Apache Beam :: SDKs :: Java :: Extensions :: Protobuf SUCCESS
[01:11 min]
2017-10-22T08:59:55.249 [INFO] Apache Beam :: SDKs :: Java :: IO :: Google Cloud Platform
SUCCESS [02:04 min]
2017-10-22T08:59:55.249 [INFO] Apache Beam :: SDKs :: Java :: IO :: Hadoop Common . SUCCESS
[ 28.853 s]
2017-10-22T08:59:55.249 [INFO] Apache Beam :: SDKs :: Java :: IO :: Hadoop File System SUCCESS
[ 46.678 s]
2017-10-22T08:59:55.249 [INFO] Apache Beam :: SDKs :: Java :: IO :: Hadoop ........ SUCCESS
[  6.751 s]
2017-10-22T08:59:55.249 [INFO] Apache Beam :: SDKs :: Java :: IO :: Hadoop :: input-format
SUCCESS [ 32.027 s]
2017-10-22T08:59:55.250 [INFO] Apache Beam :: Runners :: Google Cloud Dataflow .... SUCCESS
[08:04 min]
2017-10-22T08:59:55.250 [INFO] Apache Beam :: SDKs :: Java :: IO :: Hadoop :: jdk1.8-tests
SUCCESS [01:53 min]
2017-10-22T08:59:55.250 [INFO] Apache Beam :: SDKs :: Java :: IO :: HBase ......... SUCCESS
[01:51 min]
2017-10-22T08:59:55.250 [INFO] Apache Beam :: SDKs :: Java :: IO :: HCatalog ...... SUCCESS
[01:26 min]
2017-10-22T08:59:55.250 [INFO] Apache Beam :: SDKs :: Java :: IO :: JDBC .......... SUCCESS
[ 55.849 s]
2017-10-22T08:59:55.250 [INFO] Apache Beam :: SDKs :: Java :: IO :: JMS ........... SUCCESS
[ 30.480 s]
2017-10-22T08:59:55.250 [INFO] Apache Beam :: SDKs :: Java :: IO :: Kafka ......... SUCCESS
[ 49.717 s]
2017-10-22T08:59:55.251 [INFO] Apache Beam :: SDKs :: Java :: IO :: Kinesis ....... SUCCESS
[ 36.319 s]
2017-10-22T08:59:55.251 [INFO] Apache Beam :: SDKs :: Java :: IO :: MongoDB ....... SUCCESS
[01:03 min]
2017-10-22T08:59:55.251 [INFO] Apache Beam :: SDKs :: Java :: IO :: MQTT .......... SUCCESS
[ 30.811 s]
2017-10-22T08:59:55.251 [INFO] Apache Beam :: SDKs :: Java :: IO :: Redis ......... SUCCESS
[ 26.642 s]
2017-10-22T08:59:55.251 [INFO] Apache Beam :: SDKs :: Java :: IO :: Solr .......... SUCCESS
[ 51.508 s]
2017-10-22T08:59:55.251 [INFO] Apache Beam :: SDKs :: Java :: IO :: Tika .......... SUCCESS
[ 42.440 s]
2017-10-22T08:59:55.251 [INFO] Apache Beam :: SDKs :: Java :: IO :: XML ........... SUCCESS
[ 39.364 s]
2017-10-22T08:59:55.252 [INFO] Apache Beam :: SDKs :: Java :: Maven Archetypes :: Starter
SUCCESS [ 27.296 s]
2017-10-22T08:59:55.252 [INFO] Apache Beam :: Examples :: Java .................... SUCCESS
[05:44 min]
2017-10-22T08:59:55.252 [INFO] Apache Beam :: SDKs :: Java :: Maven Archetypes :: Examples
SUCCESS [ 50.597 s]
2017-10-22T08:59:55.252 [INFO] Apache Beam :: Examples :: Java 8 .................. SUCCESS
[ 55.562 s]
2017-10-22T08:59:55.252 [INFO] Apache Beam :: SDKs :: Java :: Maven Archetypes :: Examples
- Java 8 SUCCESS [ 38.148 s]
2017-10-22T08:59:55.252 [INFO] Apache Beam :: SDKs :: Java :: Extensions :: Jackson SUCCESS
[ 24.439 s]
2017-10-22T08:59:55.252 [INFO] Apache Beam :: SDKs :: Java :: Extensions :: Join library SUCCESS
[ 27.520 s]
2017-10-22T08:59:55.252 [INFO] Apache Beam :: SDKs :: Java :: Extensions :: Sorter  SUCCESS
[ 44.960 s]
2017-10-22T08:59:55.253 [INFO] Apache Beam :: SDKs :: Java :: Extensions :: SQL ... SUCCESS
[01:41 min]
2017-10-22T08:59:55.253 [INFO] Apache Beam :: SDKs :: Java :: Nexmark ............. SUCCESS
[02:25 min]
2017-10-22T08:59:55.253 [INFO] Apache Beam :: SDKs :: Java :: Harness ............. SUCCESS
[01:13 min]
2017-10-22T08:59:55.253 [INFO] Apache Beam :: SDKs :: Java :: Java 8 Tests ........ SUCCESS
[ 36.653 s]
2017-10-22T08:59:55.253 [INFO] Apache Beam :: Runners :: Flink .................... FAILURE
[ 37.966 s]
2017-10-22T08:59:55.253 [INFO] Apache Beam :: Runners :: Spark .................... SUCCESS
[02:48 min]
2017-10-22T08:59:55.253 [INFO] Apache Beam :: Runners :: Apex ..................... FAILURE
[ 30.412 s]
2017-10-22T08:59:55.253 [INFO] Apache Beam :: Runners :: Gearpump ................. FAILURE
[ 32.617 s]
2017-10-22T08:59:55.253 [INFO] Apache Beam :: SDKs :: Java :: Aggregated Javadoc .. SKIPPED
2017-10-22T08:59:55.254 [INFO] ------------------------------------------------------------------------
2017-10-22T08:59:55.254 [INFO] BUILD FAILURE
2017-10-22T08:59:55.254 [INFO] ------------------------------------------------------------------------
2017-10-22T08:59:55.254 [INFO] Total time: 01:16 h
2017-10-22T08:59:55.254 [INFO] Finished at: 2017-10-22T08:59:55+00:00
2017-10-22T08:59:57.224 [INFO] Final Memory: 381M/1997M
2017-10-22T08:59:57.225 [INFO] ------------------------------------------------------------------------
2017-10-22T08:59:57.246 [ERROR] Failed to execute goal org.codehaus.mojo:findbugs-maven-plugin:3.0.4:check
(default) on project beam-runners-flink_2.10: failed with 2 bugs and 0 errors -> [Help
1]
2017-10-22T08:59:57.247 [ERROR] Failed to execute goal org.codehaus.mojo:findbugs-maven-plugin:3.0.4:check
(default) on project beam-runners-apex: failed with 2 bugs and 0 errors -> [Help 1]
2017-10-22T08:59:57.247 [ERROR] Failed to execute goal org.codehaus.mojo:findbugs-maven-plugin:3.0.4:check
(default) on project beam-runners-gearpump: failed with 1 bugs and 0 errors -> [Help 1]
2017-10-22T08:59:57.247 [ERROR] Failed to execute goal org.eluder.coveralls:coveralls-maven-plugin:4.3.0:report
(default-cli) on project beam-parent: I/O operation failed: No source found for org/apache/beam/examples/Snippets.java
-> [Help 2]
2017-10-22T08:59:57.247 [ERROR] 
2017-10-22T08:59:57.247 [ERROR] To see the full stack trace of the errors, re-run Maven with
the -e switch.
2017-10-22T08:59:57.247 [ERROR] Re-run Maven using the -X switch to enable full debug logging.
2017-10-22T08:59:57.247 [ERROR] 
2017-10-22T08:59:57.248 [ERROR] For more information about the errors and possible solutions,
please read the following articles:
2017-10-22T08:59:57.248 [ERROR] [Help 1] http://cwiki.apache.org/confluence/display/MAVEN/MojoExecutionException
2017-10-22T08:59:57.248 [ERROR] [Help 2] http://cwiki.apache.org/confluence/display/MAVEN/MojoFailureException
2017-10-22T08:59:57.248 [ERROR] 
2017-10-22T08:59:57.248 [ERROR] After correcting the problems, you can resume the build with
the command
2017-10-22T08:59:57.248 [ERROR]   mvn <goals> -rf :beam-runners-flink_2.10
channel stopped
Not sending mail to unregistered user valentyn@google.com
Not sending mail to unregistered user ekirpichov@gmail.com
Not sending mail to unregistered user klk@google.com

Mime
View raw message