beam-commits mailing list archives

Site index · List index
Message view « Date » · « Thread »
Top « Date » · « Thread »
From Apache Jenkins Server <jenk...@builds.apache.org>
Subject Build failed in Jenkins: beam_PostCommit_Java_MavenInstall #5116
Date Fri, 27 Oct 2017 07:09:12 GMT
See <https://builds.apache.org/job/beam_PostCommit_Java_MavenInstall/5116/display/redirect>

------------------------------------------
[...truncated 1.35 MB...]
2017-10-27T07:07:34.968 [INFO] Excluding com.twitter:chill_2.10:jar:0.5.0 from the shaded
jar.
2017-10-27T07:07:34.968 [INFO] Excluding com.twitter:chill-java:jar:0.5.0 from the shaded
jar.
2017-10-27T07:07:34.968 [INFO] Excluding org.apache.xbean:xbean-asm5-shaded:jar:4.4 from the
shaded jar.
2017-10-27T07:07:34.968 [INFO] Excluding org.apache.hadoop:hadoop-client:jar:2.7.3 from the
shaded jar.
2017-10-27T07:07:34.968 [INFO] Excluding org.apache.hadoop:hadoop-common:jar:2.7.3 from the
shaded jar.
2017-10-27T07:07:34.968 [INFO] Excluding javax.servlet.jsp:jsp-api:jar:2.1 from the shaded
jar.
2017-10-27T07:07:34.968 [INFO] Excluding org.apache.hadoop:hadoop-auth:jar:2.7.3 from the
shaded jar.
2017-10-27T07:07:34.969 [INFO] Excluding org.apache.directory.server:apacheds-kerberos-codec:jar:2.0.0-M15
from the shaded jar.
2017-10-27T07:07:34.969 [INFO] Excluding org.apache.directory.server:apacheds-i18n:jar:2.0.0-M15
from the shaded jar.
2017-10-27T07:07:34.969 [INFO] Excluding org.apache.directory.api:api-asn1-api:jar:1.0.0-M20
from the shaded jar.
2017-10-27T07:07:34.969 [INFO] Excluding org.apache.directory.api:api-util:jar:1.0.0-M20 from
the shaded jar.
2017-10-27T07:07:34.969 [INFO] Excluding org.apache.curator:curator-client:jar:2.7.1 from
the shaded jar.
2017-10-27T07:07:34.969 [INFO] Excluding org.apache.hadoop:hadoop-mapreduce-client-app:jar:2.7.3
from the shaded jar.
2017-10-27T07:07:34.969 [INFO] Excluding org.apache.hadoop:hadoop-mapreduce-client-common:jar:2.7.3
from the shaded jar.
2017-10-27T07:07:34.969 [INFO] Excluding org.apache.hadoop:hadoop-yarn-server-common:jar:2.7.3
from the shaded jar.
2017-10-27T07:07:34.969 [INFO] Excluding org.apache.hadoop:hadoop-mapreduce-client-shuffle:jar:2.7.3
from the shaded jar.
2017-10-27T07:07:34.969 [INFO] Excluding org.apache.hadoop:hadoop-yarn-api:jar:2.7.3 from
the shaded jar.
2017-10-27T07:07:34.969 [INFO] Excluding org.apache.hadoop:hadoop-mapreduce-client-core:jar:2.7.3
from the shaded jar.
2017-10-27T07:07:34.970 [INFO] Excluding org.apache.hadoop:hadoop-mapreduce-client-jobclient:jar:2.7.3
from the shaded jar.
2017-10-27T07:07:34.970 [INFO] Excluding org.apache.hadoop:hadoop-annotations:jar:2.7.3 from
the shaded jar.
2017-10-27T07:07:34.970 [INFO] Excluding org.apache.spark:spark-launcher_2.10:jar:1.6.3 from
the shaded jar.
2017-10-27T07:07:34.970 [INFO] Excluding org.apache.spark:spark-network-common_2.10:jar:1.6.3
from the shaded jar.
2017-10-27T07:07:34.970 [INFO] Excluding org.apache.spark:spark-network-shuffle_2.10:jar:1.6.3
from the shaded jar.
2017-10-27T07:07:34.970 [INFO] Excluding org.fusesource.leveldbjni:leveldbjni-all:jar:1.8
from the shaded jar.
2017-10-27T07:07:34.970 [INFO] Excluding org.apache.spark:spark-unsafe_2.10:jar:1.6.3 from
the shaded jar.
2017-10-27T07:07:34.970 [INFO] Excluding net.java.dev.jets3t:jets3t:jar:0.7.1 from the shaded
jar.
2017-10-27T07:07:34.970 [INFO] Excluding commons-httpclient:commons-httpclient:jar:3.1 from
the shaded jar.
2017-10-27T07:07:34.970 [INFO] Excluding org.apache.curator:curator-recipes:jar:2.4.0 from
the shaded jar.
2017-10-27T07:07:34.971 [INFO] Excluding org.apache.curator:curator-framework:jar:2.4.0 from
the shaded jar.
2017-10-27T07:07:34.971 [INFO] Excluding org.eclipse.jetty.orbit:javax.servlet:jar:3.0.0.v201112011016
from the shaded jar.
2017-10-27T07:07:34.971 [INFO] Excluding org.apache.commons:commons-math3:jar:3.4.1 from the
shaded jar.
2017-10-27T07:07:34.971 [INFO] Excluding org.slf4j:jul-to-slf4j:jar:1.7.10 from the shaded
jar.
2017-10-27T07:07:34.971 [INFO] Excluding org.slf4j:jcl-over-slf4j:jar:1.7.10 from the shaded
jar.
2017-10-27T07:07:34.971 [INFO] Excluding log4j:log4j:jar:1.2.17 from the shaded jar.
2017-10-27T07:07:34.971 [INFO] Excluding org.slf4j:slf4j-log4j12:jar:1.7.10 from the shaded
jar.
2017-10-27T07:07:34.971 [INFO] Excluding com.ning:compress-lzf:jar:1.0.3 from the shaded jar.
2017-10-27T07:07:34.971 [INFO] Excluding net.jpountz.lz4:lz4:jar:1.3.0 from the shaded jar.
2017-10-27T07:07:34.971 [INFO] Excluding org.roaringbitmap:RoaringBitmap:jar:0.5.11 from the
shaded jar.
2017-10-27T07:07:34.972 [INFO] Excluding commons-net:commons-net:jar:2.2 from the shaded jar.
2017-10-27T07:07:34.972 [INFO] Excluding com.typesafe.akka:akka-remote_2.10:jar:2.3.11 from
the shaded jar.
2017-10-27T07:07:34.972 [INFO] Excluding com.typesafe.akka:akka-actor_2.10:jar:2.3.11 from
the shaded jar.
2017-10-27T07:07:34.972 [INFO] Excluding org.uncommons.maths:uncommons-maths:jar:1.2.2a from
the shaded jar.
2017-10-27T07:07:34.972 [INFO] Excluding com.typesafe.akka:akka-slf4j_2.10:jar:2.3.11 from
the shaded jar.
2017-10-27T07:07:34.972 [INFO] Excluding org.scala-lang:scala-library:jar:2.10.5 from the
shaded jar.
2017-10-27T07:07:34.972 [INFO] Excluding org.json4s:json4s-jackson_2.10:jar:3.2.10 from the
shaded jar.
2017-10-27T07:07:34.972 [INFO] Excluding org.json4s:json4s-core_2.10:jar:3.2.10 from the shaded
jar.
2017-10-27T07:07:34.972 [INFO] Excluding org.json4s:json4s-ast_2.10:jar:3.2.10 from the shaded
jar.
2017-10-27T07:07:34.972 [INFO] Excluding org.scala-lang:scalap:jar:2.10.0 from the shaded
jar.
2017-10-27T07:07:34.972 [INFO] Excluding org.scala-lang:scala-compiler:jar:2.10.0 from the
shaded jar.
2017-10-27T07:07:34.973 [INFO] Excluding com.sun.jersey:jersey-server:jar:1.9 from the shaded
jar.
2017-10-27T07:07:34.973 [INFO] Excluding asm:asm:jar:3.1 from the shaded jar.
2017-10-27T07:07:34.973 [INFO] Excluding com.sun.jersey:jersey-core:jar:1.9 from the shaded
jar.
2017-10-27T07:07:34.973 [INFO] Excluding org.apache.mesos:mesos:jar:shaded-protobuf:0.21.1
from the shaded jar.
2017-10-27T07:07:34.973 [INFO] Excluding io.netty:netty-all:jar:4.0.29.Final from the shaded
jar.
2017-10-27T07:07:34.973 [INFO] Excluding com.clearspring.analytics:stream:jar:2.7.0 from the
shaded jar.
2017-10-27T07:07:34.973 [INFO] Excluding io.dropwizard.metrics:metrics-jvm:jar:3.1.2 from
the shaded jar.
2017-10-27T07:07:34.973 [INFO] Excluding io.dropwizard.metrics:metrics-json:jar:3.1.2 from
the shaded jar.
2017-10-27T07:07:34.973 [INFO] Excluding io.dropwizard.metrics:metrics-graphite:jar:3.1.2
from the shaded jar.
2017-10-27T07:07:34.973 [INFO] Excluding com.fasterxml.jackson.module:jackson-module-scala_2.10:jar:2.8.9
from the shaded jar.
2017-10-27T07:07:34.974 [INFO] Excluding com.fasterxml.jackson.module:jackson-module-paranamer:jar:2.8.9
from the shaded jar.
2017-10-27T07:07:34.974 [INFO] Excluding org.apache.ivy:ivy:jar:2.4.0 from the shaded jar.
2017-10-27T07:07:34.974 [INFO] Excluding oro:oro:jar:2.0.8 from the shaded jar.
2017-10-27T07:07:34.974 [INFO] Excluding org.tachyonproject:tachyon-client:jar:0.8.2 from
the shaded jar.
2017-10-27T07:07:34.974 [INFO] Excluding org.tachyonproject:tachyon-underfs-hdfs:jar:0.8.2
from the shaded jar.
2017-10-27T07:07:34.974 [INFO] Excluding org.tachyonproject:tachyon-underfs-s3:jar:0.8.2 from
the shaded jar.
2017-10-27T07:07:34.974 [INFO] Excluding org.tachyonproject:tachyon-underfs-local:jar:0.8.2
from the shaded jar.
2017-10-27T07:07:34.974 [INFO] Excluding net.razorvine:pyrolite:jar:4.9 from the shaded jar.
2017-10-27T07:07:34.974 [INFO] Excluding net.sf.py4j:py4j:jar:0.9 from the shaded jar.
2017-10-27T07:07:34.974 [INFO] Excluding org.spark-project.spark:unused:jar:1.0.0 from the
shaded jar.
2017-10-27T07:07:34.975 [INFO] Excluding org.apache.spark:spark-streaming_2.10:jar:1.6.3 from
the shaded jar.
2017-10-27T07:07:36.760 [INFO] Replacing original artifact with shaded artifact.
2017-10-27T07:07:36.966 [INFO] 
2017-10-27T07:07:36.966 [INFO] --- maven-javadoc-plugin:3.0.0-M1:jar (attach-javadocs) @ beam-sdks-java-javadoc
---
2017-10-27T07:07:36.969 [INFO] Not executing Javadoc as the project is not a Java classpath-capable
package
2017-10-27T07:07:37.076 [INFO] 
2017-10-27T07:07:37.076 [INFO] --- maven-source-plugin:3.0.1:jar-no-fork (attach-sources)
@ beam-sdks-java-javadoc ---
2017-10-27T07:07:37.182 [INFO] 
2017-10-27T07:07:37.182 [INFO] --- maven-source-plugin:3.0.1:test-jar-no-fork (attach-test-sources)
@ beam-sdks-java-javadoc ---
2017-10-27T07:07:37.288 [INFO] 
2017-10-27T07:07:37.288 [INFO] --- reproducible-build-maven-plugin:0.3:strip-jar (default)
@ beam-sdks-java-javadoc ---
2017-10-27T07:07:37.289 [INFO] Stripping <https://builds.apache.org/job/beam_PostCommit_Java_MavenInstall/ws/src/sdks/java/javadoc/target/javadoc.jar>
2017-10-27T07:07:37.448 [INFO] 
2017-10-27T07:07:37.448 [INFO] --- maven-dependency-plugin:3.0.1:analyze-only (default) @
beam-sdks-java-javadoc ---
2017-10-27T07:07:37.449 [INFO] Skipping plugin execution
2017-10-27T07:07:37.556 [INFO] 
2017-10-27T07:07:37.556 [INFO] --- maven-install-plugin:2.5.2:install (default-install) @
beam-sdks-java-javadoc ---
2017-10-27T07:07:37.558 [INFO] Installing <https://builds.apache.org/job/beam_PostCommit_Java_MavenInstall/ws/src/sdks/java/javadoc/pom.xml>
to <https://builds.apache.org/job/beam_PostCommit_Java_MavenInstall/ws/.repository/org/apache/beam/beam-sdks-java-javadoc/2.3.0-SNAPSHOT/beam-sdks-java-javadoc-2.3.0-SNAPSHOT.pom>
2017-10-27T07:07:37.657 [INFO] Installing <https://builds.apache.org/job/beam_PostCommit_Java_MavenInstall/ws/src/sdks/java/javadoc/target/javadoc.jar>
to <https://builds.apache.org/job/beam_PostCommit_Java_MavenInstall/ws/.repository/org/apache/beam/beam-sdks-java-javadoc/2.3.0-SNAPSHOT/beam-sdks-java-javadoc-2.3.0-SNAPSHOT.jar>
[JENKINS] Archiving disabled
2017-10-27T07:07:38.958 [INFO]                                                           
             
2017-10-27T07:07:38.958 [INFO] ------------------------------------------------------------------------
2017-10-27T07:07:38.958 [INFO] Building Apache Beam :: Parent 2.3.0-SNAPSHOT
2017-10-27T07:07:38.958 [INFO] ------------------------------------------------------------------------
2017-10-27T07:07:38.992 [WARNING] The POM for org.eclipse.m2e:lifecycle-mapping:jar:1.0.0
is missing, no dependency information available
2017-10-27T07:07:39.003 [WARNING] Failed to retrieve plugin descriptor for org.eclipse.m2e:lifecycle-mapping:1.0.0:
Plugin org.eclipse.m2e:lifecycle-mapping:1.0.0 or one of its dependencies could not be resolved:
Failure to find org.eclipse.m2e:lifecycle-mapping:jar:1.0.0 in https://repo.maven.apache.org/maven2
was cached in the local repository, resolution will not be reattempted until the update interval
of central has elapsed or updates are forced
2017-10-27T07:07:39.004 [INFO] 
2017-10-27T07:07:39.004 [INFO] --- coveralls-maven-plugin:4.3.0:report (default-cli) @ beam-parent
---
2017-10-27T07:07:42.445 [INFO] Starting Coveralls job for jenkins (5116 / https://builds.apache.org/job/beam_PostCommit_Java_MavenInstall/5116/)
2017-10-27T07:07:42.445 [INFO] Using repository token <secret>
2017-10-27T07:07:42.445 [INFO] Git commit 1f68030 in master
2017-10-27T07:07:42.445 [INFO] Writing Coveralls data to <https://builds.apache.org/job/beam_PostCommit_Java_MavenInstall/ws/src/target/coveralls.json...>
2017-10-27T07:07:42.497 [INFO] Processing coverage report from <https://builds.apache.org/job/beam_PostCommit_Java_MavenInstall/ws/src/sdks/java/core/target/site/jacoco/jacoco.xml>
2017-10-27T07:07:43.202 [INFO] Processing coverage report from <https://builds.apache.org/job/beam_PostCommit_Java_MavenInstall/ws/src/sdks/java/extensions/google-cloud-platform-core/target/site/jacoco/jacoco.xml>
2017-10-27T07:07:43.269 [INFO] Processing coverage report from <https://builds.apache.org/job/beam_PostCommit_Java_MavenInstall/ws/src/sdks/java/extensions/protobuf/target/site/jacoco/jacoco.xml>
2017-10-27T07:07:43.301 [INFO] Processing coverage report from <https://builds.apache.org/job/beam_PostCommit_Java_MavenInstall/ws/src/sdks/java/java8tests/target/site/jacoco/jacoco.xml>
2017-10-27T07:07:43.301 [INFO] Processing coverage report from <https://builds.apache.org/job/beam_PostCommit_Java_MavenInstall/ws/src/runners/core-java/target/site/jacoco/jacoco.xml>
2017-10-27T07:07:43.590 [INFO] Processing coverage report from <https://builds.apache.org/job/beam_PostCommit_Java_MavenInstall/ws/src/runners/direct-java/target/site/jacoco/jacoco.xml>
2017-10-27T07:07:43.771 [INFO] Processing coverage report from <https://builds.apache.org/job/beam_PostCommit_Java_MavenInstall/ws/src/runners/google-cloud-dataflow-java/target/site/jacoco/jacoco.xml>
2017-10-27T07:07:44.051 [INFO] Processing coverage report from <https://builds.apache.org/job/beam_PostCommit_Java_MavenInstall/ws/src/examples/java/target/site/jacoco/jacoco.xml>
2017-10-27T07:07:44.285 [INFO] Processing coverage report from <https://builds.apache.org/job/beam_PostCommit_Java_MavenInstall/ws/src/examples/java8/target/site/jacoco/jacoco.xml>
[JENKINS] Archiving disabled
[JENKINS] Archiving disabled
[JENKINS] Archiving disabled
[JENKINS] Archiving disabled
[JENKINS] Archiving disabled
[JENKINS] Archiving disabled
[JENKINS] Archiving disabled
[JENKINS] Archiving disabled
[JENKINS] Archiving disabled
[JENKINS] Archiving disabled
[JENKINS] Archiving disabled
[JENKINS] Archiving disabled
[JENKINS] Archiving disabled
[JENKINS] Archiving disabled
[JENKINS] Archiving disabled
[JENKINS] Archiving disabled
[JENKINS] Archiving disabled
[JENKINS] Archiving disabled
[JENKINS] Archiving disabled
[JENKINS] Archiving disabled
[JENKINS] Archiving disabled
[JENKINS] Archiving disabled
[JENKINS] Archiving disabled
[JENKINS] Archiving disabled
[JENKINS] Archiving disabled
[JENKINS] Archiving disabled
[JENKINS] Archiving disabled
[JENKINS] Archiving disabled
[JENKINS] Archiving disabled
[JENKINS] Archiving disabled
[JENKINS] Archiving disabled
[JENKINS] Archiving disabled
[JENKINS] Archiving disabled
[JENKINS] Archiving disabled
[JENKINS] Archiving disabled
[JENKINS] Archiving disabled
[JENKINS] Archiving disabled
[JENKINS] Archiving disabled
[JENKINS] Archiving disabled
[JENKINS] Archiving disabled
[JENKINS] Archiving disabled
[JENKINS] Archiving disabled
[JENKINS] Archiving disabled
[JENKINS] Archiving disabled
[JENKINS] Archiving disabled
[JENKINS] Archiving disabled
[JENKINS] Archiving disabled
[JENKINS] Archiving disabled
[JENKINS] Archiving disabled
[JENKINS] Archiving disabled
[JENKINS] Archiving disabled
[JENKINS] Archiving disabled
[JENKINS] Archiving disabled
[JENKINS] Archiving disabled
[JENKINS] Archiving disabled
[JENKINS] Archiving disabled
[JENKINS] Archiving disabled
[JENKINS] Archiving disabled
2017-10-27T07:08:42.370 [INFO] ------------------------------------------------------------------------
2017-10-27T07:08:42.370 [INFO] Reactor Summary:
2017-10-27T07:08:42.370 [INFO] 
2017-10-27T07:08:42.370 [INFO] Apache Beam :: Parent .............................. FAILURE
[  5.706 s]
2017-10-27T07:08:42.370 [INFO] Apache Beam :: SDKs :: Java :: Build Tools ......... SUCCESS
[  8.792 s]
2017-10-27T07:08:42.370 [INFO] Apache Beam :: Model ............................... SUCCESS
[  2.138 s]
2017-10-27T07:08:42.371 [INFO] Apache Beam :: Model :: Pipeline ................... SUCCESS
[ 34.984 s]
2017-10-27T07:08:42.371 [INFO] Apache Beam :: Model :: Fn Execution ............... SUCCESS
[ 31.449 s]
2017-10-27T07:08:42.371 [INFO] Apache Beam :: SDKs ................................ SUCCESS
[  3.923 s]
2017-10-27T07:08:42.371 [INFO] Apache Beam :: SDKs :: Java ........................ SUCCESS
[  3.432 s]
2017-10-27T07:08:42.371 [INFO] Apache Beam :: SDKs :: Java :: Core ................ SUCCESS
[04:46 min]
2017-10-27T07:08:42.372 [INFO] Apache Beam :: Runners :: Core Construction Java ... SUCCESS
[ 56.180 s]
2017-10-27T07:08:42.372 [INFO] Apache Beam :: Runners :: Core Java ................ SUCCESS
[01:35 min]
2017-10-27T07:08:42.372 [INFO] Apache Beam :: Runners :: Direct Java .............. SUCCESS
[06:16 min]
2017-10-27T07:08:42.372 [INFO] Apache Beam :: SDKs :: Java :: IO :: AMQP .......... SUCCESS
[ 47.709 s]
2017-10-27T07:08:42.372 [INFO] Apache Beam :: SDKs :: Java :: IO :: Common ........ SUCCESS
[  8.840 s]
2017-10-27T07:08:42.372 [INFO] Apache Beam :: SDKs :: Java :: IO :: Cassandra ..... SUCCESS
[ 43.201 s]
2017-10-27T07:08:42.373 [INFO] Apache Beam :: SDKs :: Java :: IO :: Elasticsearch . SUCCESS
[ 22.316 s]
2017-10-27T07:08:42.373 [INFO] Apache Beam :: SDKs :: Java :: IO :: Elasticsearch-Tests SUCCESS
[  4.374 s]
2017-10-27T07:08:42.373 [INFO] Apache Beam :: SDKs :: Java :: IO :: Elasticsearch-Tests ::
Common SUCCESS [  4.777 s]
2017-10-27T07:08:42.373 [INFO] Apache Beam :: SDKs :: Java :: IO :: Elasticsearch-Tests ::
2.x SUCCESS [ 34.482 s]
2017-10-27T07:08:42.373 [INFO] Apache Beam :: SDKs :: Java :: IO :: Elasticsearch-Tests ::
5.x SUCCESS [ 40.708 s]
2017-10-27T07:08:42.374 [INFO] Apache Beam :: SDKs :: Java :: Extensions :: Google Cloud Platform
Core SUCCESS [ 43.222 s]
2017-10-27T07:08:42.374 [INFO] Apache Beam :: SDKs :: Java :: Extensions :: Protobuf SUCCESS
[ 29.315 s]
2017-10-27T07:08:42.374 [INFO] Apache Beam :: SDKs :: Java :: IO :: Google Cloud Platform
SUCCESS [01:53 min]
2017-10-27T07:08:42.374 [INFO] Apache Beam :: SDKs :: Java :: IO :: Hadoop Common . SUCCESS
[ 26.845 s]
2017-10-27T07:08:42.374 [INFO] Apache Beam :: SDKs :: Java :: IO :: Hadoop File System SUCCESS
[ 49.514 s]
2017-10-27T07:08:42.375 [INFO] Apache Beam :: SDKs :: Java :: IO :: Hadoop ........ SUCCESS
[  6.618 s]
2017-10-27T07:08:42.375 [INFO] Apache Beam :: SDKs :: Java :: IO :: Hadoop :: input-format
SUCCESS [ 32.826 s]
2017-10-27T07:08:42.375 [INFO] Apache Beam :: Runners :: Google Cloud Dataflow .... SUCCESS
[06:33 min]
2017-10-27T07:08:42.375 [INFO] Apache Beam :: SDKs :: Java :: IO :: Hadoop :: jdk1.8-tests
SUCCESS [01:54 min]
2017-10-27T07:08:42.375 [INFO] Apache Beam :: SDKs :: Java :: IO :: HBase ......... SUCCESS
[02:01 min]
2017-10-27T07:08:42.376 [INFO] Apache Beam :: SDKs :: Java :: IO :: HCatalog ...... SUCCESS
[01:23 min]
2017-10-27T07:08:42.376 [INFO] Apache Beam :: SDKs :: Java :: IO :: JDBC .......... SUCCESS
[ 59.404 s]
2017-10-27T07:08:42.376 [INFO] Apache Beam :: SDKs :: Java :: IO :: JMS ........... SUCCESS
[ 29.962 s]
2017-10-27T07:08:42.376 [INFO] Apache Beam :: SDKs :: Java :: IO :: Kafka ......... SUCCESS
[ 47.260 s]
2017-10-27T07:08:42.376 [INFO] Apache Beam :: SDKs :: Java :: IO :: Kinesis ....... SUCCESS
[ 35.943 s]
2017-10-27T07:08:42.376 [INFO] Apache Beam :: SDKs :: Java :: IO :: MongoDB ....... SUCCESS
[ 51.704 s]
2017-10-27T07:08:42.377 [INFO] Apache Beam :: SDKs :: Java :: IO :: MQTT .......... SUCCESS
[ 29.787 s]
2017-10-27T07:08:42.377 [INFO] Apache Beam :: SDKs :: Java :: IO :: Redis ......... SUCCESS
[ 27.669 s]
2017-10-27T07:08:42.377 [INFO] Apache Beam :: SDKs :: Java :: IO :: Solr .......... SUCCESS
[ 54.290 s]
2017-10-27T07:08:42.377 [INFO] Apache Beam :: SDKs :: Java :: IO :: Tika .......... SUCCESS
[ 41.192 s]
2017-10-27T07:08:42.377 [INFO] Apache Beam :: SDKs :: Java :: IO :: XML ........... SUCCESS
[ 45.326 s]
2017-10-27T07:08:42.378 [INFO] Apache Beam :: SDKs :: Java :: Maven Archetypes :: Starter
SUCCESS [ 18.734 s]
2017-10-27T07:08:42.378 [INFO] Apache Beam :: Examples :: Java .................... SUCCESS
[05:27 min]
2017-10-27T07:08:42.378 [INFO] Apache Beam :: SDKs :: Java :: Maven Archetypes :: Examples
SUCCESS [ 47.014 s]
2017-10-27T07:08:42.378 [INFO] Apache Beam :: Examples :: Java 8 .................. SUCCESS
[01:00 min]
2017-10-27T07:08:42.378 [INFO] Apache Beam :: SDKs :: Java :: Maven Archetypes :: Examples
- Java 8 SUCCESS [ 44.825 s]
2017-10-27T07:08:42.379 [INFO] Apache Beam :: SDKs :: Java :: Extensions :: Jackson SUCCESS
[ 27.448 s]
2017-10-27T07:08:42.379 [INFO] Apache Beam :: SDKs :: Java :: Extensions :: Join library SUCCESS
[ 28.864 s]
2017-10-27T07:08:42.379 [INFO] Apache Beam :: SDKs :: Java :: Extensions :: Sorter  SUCCESS
[ 43.690 s]
2017-10-27T07:08:42.379 [INFO] Apache Beam :: SDKs :: Java :: Extensions :: SQL ... SUCCESS
[01:35 min]
2017-10-27T07:08:42.379 [INFO] Apache Beam :: SDKs :: Java :: Nexmark ............. SUCCESS
[02:14 min]
2017-10-27T07:08:42.380 [INFO] Apache Beam :: SDKs :: Java :: Harness ............. SUCCESS
[01:01 min]
2017-10-27T07:08:42.380 [INFO] Apache Beam :: SDKs :: Java :: Java 8 Tests ........ SUCCESS
[ 23.869 s]
2017-10-27T07:08:42.380 [INFO] Apache Beam :: Runners :: Flink .................... SUCCESS
[ 56.330 s]
2017-10-27T07:08:42.380 [INFO] Apache Beam :: Runners :: Spark .................... SUCCESS
[02:52 min]
2017-10-27T07:08:42.380 [INFO] Apache Beam :: Runners :: Apex ..................... SUCCESS
[01:17 min]
2017-10-27T07:08:42.380 [INFO] Apache Beam :: Runners :: Gearpump ................. SUCCESS
[ 37.997 s]
2017-10-27T07:08:42.381 [INFO] Apache Beam :: SDKs :: Java :: Aggregated Javadoc .. SUCCESS
[ 52.852 s]
2017-10-27T07:08:42.381 [INFO] ------------------------------------------------------------------------
2017-10-27T07:08:42.381 [INFO] BUILD FAILURE
2017-10-27T07:08:42.381 [INFO] ------------------------------------------------------------------------
2017-10-27T07:08:42.381 [INFO] Total time: 01:07 h
2017-10-27T07:08:42.382 [INFO] Finished at: 2017-10-27T07:08:42+00:00
2017-10-27T07:08:44.594 [INFO] Final Memory: 386M/2189M
2017-10-27T07:08:44.594 [INFO] ------------------------------------------------------------------------
2017-10-27T07:08:44.607 [ERROR] Failed to execute goal org.eluder.coveralls:coveralls-maven-plugin:4.3.0:report
(default-cli) on project beam-parent: I/O operation failed: No source found for org/apache/beam/examples/Snippets.java
-> [Help 1]
2017-10-27T07:08:44.607 [ERROR] 
2017-10-27T07:08:44.607 [ERROR] To see the full stack trace of the errors, re-run Maven with
the -e switch.
2017-10-27T07:08:44.607 [ERROR] Re-run Maven using the -X switch to enable full debug logging.
2017-10-27T07:08:44.607 [ERROR] 
2017-10-27T07:08:44.608 [ERROR] For more information about the errors and possible solutions,
please read the following articles:
2017-10-27T07:08:44.608 [ERROR] [Help 1] http://cwiki.apache.org/confluence/display/MAVEN/MojoFailureException
channel stopped
Not sending mail to unregistered user herohde@google.com
Not sending mail to unregistered user kirpichov@google.com
Not sending mail to unregistered user github@nakomis.com
Not sending mail to unregistered user valentyn@google.com
Not sending mail to unregistered user ekirpichov@gmail.com
Not sending mail to unregistered user klk@google.com

Mime
View raw message