beam-commits mailing list archives

Site index · List index
Message view « Date » · « Thread »
Top « Date » · « Thread »
From Apache Jenkins Server <jenk...@builds.apache.org>
Subject Build failed in Jenkins: beam_PostCommit_Java_MavenInstall #4991
Date Mon, 09 Oct 2017 23:31:49 GMT
See <https://builds.apache.org/job/beam_PostCommit_Java_MavenInstall/4991/display/redirect?page=changes>

Changes:

[relax] Bump Python version for next release.

------------------------------------------
[...truncated 1.25 MB...]
2017-10-09T23:30:15.426 [INFO] Downloaded: https://repo.maven.apache.org/maven2/org/apache/hbase/hbase-protocol/1.2.6/hbase-protocol-1.2.6.pom
(9 KB at 245.3 KB/sec)
2017-10-09T23:30:15.435 [INFO] Downloading: https://repo.maven.apache.org/maven2/org/apache/hbase/hbase-annotations/1.2.6/hbase-annotations-1.2.6.pom
2017-10-09T23:30:15.472 [INFO] Downloaded: https://repo.maven.apache.org/maven2/org/apache/hbase/hbase-annotations/1.2.6/hbase-annotations-1.2.6.pom
(3 KB at 61.2 KB/sec)
2017-10-09T23:30:15.486 [INFO] Downloading: https://repo.maven.apache.org/maven2/org/apache/hbase/hbase-procedure/1.2.6/hbase-procedure-1.2.6.pom
2017-10-09T23:30:15.523 [INFO] Downloaded: https://repo.maven.apache.org/maven2/org/apache/hbase/hbase-procedure/1.2.6/hbase-procedure-1.2.6.pom
(6 KB at 149.1 KB/sec)
2017-10-09T23:30:15.545 [INFO] Downloading: https://repo.maven.apache.org/maven2/org/apache/hbase/hbase-client/1.2.6/hbase-client-1.2.6.pom
2017-10-09T23:30:15.578 [INFO] Downloaded: https://repo.maven.apache.org/maven2/org/apache/hbase/hbase-client/1.2.6/hbase-client-1.2.6.pom
(13 KB at 365.9 KB/sec)
2017-10-09T23:30:15.585 [INFO] Downloading: https://repo.maven.apache.org/maven2/org/jruby/jcodings/jcodings/1.0.8/jcodings-1.0.8.pom
2017-10-09T23:30:15.615 [INFO] Downloaded: https://repo.maven.apache.org/maven2/org/jruby/jcodings/jcodings/1.0.8/jcodings-1.0.8.pom
(5 KB at 140.4 KB/sec)
2017-10-09T23:30:15.618 [INFO] Downloading: https://repo.maven.apache.org/maven2/org/jruby/joni/joni/2.1.2/joni-2.1.2.pom
2017-10-09T23:30:15.645 [INFO] Downloaded: https://repo.maven.apache.org/maven2/org/jruby/joni/joni/2.1.2/joni-2.1.2.pom
(5 KB at 159.5 KB/sec)
2017-10-09T23:30:15.648 [INFO] Downloading: https://repo.maven.apache.org/maven2/com/yammer/metrics/metrics-core/2.2.0/metrics-core-2.2.0.pom
2017-10-09T23:30:15.678 [INFO] Downloaded: https://repo.maven.apache.org/maven2/com/yammer/metrics/metrics-core/2.2.0/metrics-core-2.2.0.pom
(2 KB at 40.8 KB/sec)
2017-10-09T23:30:15.679 [INFO] Downloading: https://repo.maven.apache.org/maven2/com/yammer/metrics/metrics-parent/2.2.0/metrics-parent-2.2.0.pom
2017-10-09T23:30:15.711 [INFO] Downloaded: https://repo.maven.apache.org/maven2/com/yammer/metrics/metrics-parent/2.2.0/metrics-parent-2.2.0.pom
(10 KB at 308.6 KB/sec)
2017-10-09T23:30:15.714 [INFO] Downloading: https://repo.maven.apache.org/maven2/org/apache/hadoop/hadoop-auth/2.5.1/hadoop-auth-2.5.1.pom
2017-10-09T23:30:15.742 [INFO] Downloaded: https://repo.maven.apache.org/maven2/org/apache/hadoop/hadoop-auth/2.5.1/hadoop-auth-2.5.1.pom
(7 KB at 227.7 KB/sec)
2017-10-09T23:30:15.744 [INFO] Downloading: https://repo.maven.apache.org/maven2/org/apache/hadoop/hadoop-project/2.5.1/hadoop-project-2.5.1.pom
2017-10-09T23:30:15.779 [INFO] Downloaded: https://repo.maven.apache.org/maven2/org/apache/hadoop/hadoop-project/2.5.1/hadoop-project-2.5.1.pom
(39 KB at 1087.3 KB/sec)
2017-10-09T23:30:15.782 [INFO] Downloading: https://repo.maven.apache.org/maven2/org/apache/hadoop/hadoop-main/2.5.1/hadoop-main-2.5.1.pom
2017-10-09T23:30:15.819 [INFO] Downloaded: https://repo.maven.apache.org/maven2/org/apache/hadoop/hadoop-main/2.5.1/hadoop-main-2.5.1.pom
(18 KB at 477.2 KB/sec)
2017-10-09T23:30:15.832 [INFO] Downloading: https://repo.maven.apache.org/maven2/org/apache/hbase/hbase-prefix-tree/1.2.6/hbase-prefix-tree-1.2.6.pom
2017-10-09T23:30:15.860 [INFO] Downloaded: https://repo.maven.apache.org/maven2/org/apache/hbase/hbase-prefix-tree/1.2.6/hbase-prefix-tree-1.2.6.pom
(7 KB at 247.6 KB/sec)
2017-10-09T23:30:15.867 [INFO] Downloading: https://repo.maven.apache.org/maven2/org/apache/hbase/hbase-hadoop-compat/1.2.6/hbase-hadoop-compat-1.2.6.pom
2017-10-09T23:30:15.900 [INFO] Downloaded: https://repo.maven.apache.org/maven2/org/apache/hbase/hbase-hadoop-compat/1.2.6/hbase-hadoop-compat-1.2.6.pom
(6 KB at 154.8 KB/sec)
2017-10-09T23:30:15.906 [INFO] Downloading: https://repo.maven.apache.org/maven2/org/apache/commons/commons-math/2.2/commons-math-2.2.pom
2017-10-09T23:30:15.936 [INFO] Downloaded: https://repo.maven.apache.org/maven2/org/apache/commons/commons-math/2.2/commons-math-2.2.pom
(11 KB at 363.9 KB/sec)
2017-10-09T23:30:15.938 [INFO] Downloading: https://repo.maven.apache.org/maven2/org/apache/commons/commons-parent/18/commons-parent-18.pom
2017-10-09T23:30:15.971 [INFO] Downloaded: https://repo.maven.apache.org/maven2/org/apache/commons/commons-parent/18/commons-parent-18.pom
(33 KB at 991.8 KB/sec)
2017-10-09T23:30:15.977 [INFO] Downloading: https://repo.maven.apache.org/maven2/org/apache/hbase/hbase-hadoop2-compat/1.2.6/hbase-hadoop2-compat-1.2.6.pom
2017-10-09T23:30:16.003 [INFO] Downloaded: https://repo.maven.apache.org/maven2/org/apache/hbase/hbase-hadoop2-compat/1.2.6/hbase-hadoop2-compat-1.2.6.pom
(8 KB at 285.2 KB/sec)
2017-10-09T23:30:16.011 [INFO] Downloading: https://repo.maven.apache.org/maven2/org/mortbay/jetty/jetty-sslengine/6.1.26/jetty-sslengine-6.1.26.pom
2017-10-09T23:30:16.041 [INFO] Downloaded: https://repo.maven.apache.org/maven2/org/mortbay/jetty/jetty-sslengine/6.1.26/jetty-sslengine-6.1.26.pom
(4 KB at 123.7 KB/sec)
2017-10-09T23:30:16.044 [INFO] Downloading: https://repo.maven.apache.org/maven2/tomcat/jasper-compiler/5.5.23/jasper-compiler-5.5.23.pom
2017-10-09T23:30:16.070 [INFO] Downloaded: https://repo.maven.apache.org/maven2/tomcat/jasper-compiler/5.5.23/jasper-compiler-5.5.23.pom
(919 B at 34.5 KB/sec)
2017-10-09T23:30:16.072 [INFO] Downloading: https://repo.maven.apache.org/maven2/tomcat/tomcat-parent/5.5.23/tomcat-parent-5.5.23.pom
2017-10-09T23:30:16.097 [INFO] Downloaded: https://repo.maven.apache.org/maven2/tomcat/tomcat-parent/5.5.23/tomcat-parent-5.5.23.pom
(898 B at 35.1 KB/sec)
2017-10-09T23:30:16.099 [INFO] Downloading: https://repo.maven.apache.org/maven2/tomcat/jasper-runtime/5.5.23/jasper-runtime-5.5.23.pom
2017-10-09T23:30:16.127 [INFO] Downloaded: https://repo.maven.apache.org/maven2/tomcat/jasper-runtime/5.5.23/jasper-runtime-5.5.23.pom
(934 B at 32.6 KB/sec)
2017-10-09T23:30:16.129 [INFO] Downloading: https://repo.maven.apache.org/maven2/org/jamon/jamon-runtime/2.4.1/jamon-runtime-2.4.1.pom
2017-10-09T23:30:16.159 [INFO] Downloaded: https://repo.maven.apache.org/maven2/org/jamon/jamon-runtime/2.4.1/jamon-runtime-2.4.1.pom
(2 KB at 50.0 KB/sec)
2017-10-09T23:30:16.161 [INFO] Downloading: https://repo.maven.apache.org/maven2/org/jamon/jamon-java-parent/2.4.1/jamon-java-parent-2.4.1.pom
2017-10-09T23:30:16.192 [INFO] Downloaded: https://repo.maven.apache.org/maven2/org/jamon/jamon-java-parent/2.4.1/jamon-java-parent-2.4.1.pom
(5 KB at 139.5 KB/sec)
2017-10-09T23:30:16.194 [INFO] Downloading: https://repo.maven.apache.org/maven2/org/jamon/jamon-parent/2.4.1/jamon-parent-2.4.1.pom
2017-10-09T23:30:16.221 [INFO] Downloaded: https://repo.maven.apache.org/maven2/org/jamon/jamon-parent/2.4.1/jamon-parent-2.4.1.pom
(8 KB at 278.1 KB/sec)
2017-10-09T23:30:16.223 [INFO] Downloading: https://repo.maven.apache.org/maven2/com/lmax/disruptor/3.3.0/disruptor-3.3.0.pom
2017-10-09T23:30:16.251 [INFO] Downloaded: https://repo.maven.apache.org/maven2/com/lmax/disruptor/3.3.0/disruptor-3.3.0.pom
(2 KB at 57.6 KB/sec)
2017-10-09T23:30:16.607 [INFO] Downloading: https://repo.maven.apache.org/maven2/org/apache/hbase/hbase-shaded-client/1.2.6/hbase-shaded-client-1.2.6.jar
2017-10-09T23:30:16.607 [INFO] Downloading: https://repo.maven.apache.org/maven2/org/slf4j/slf4j-log4j12/1.6.1/slf4j-log4j12-1.6.1.jar
2017-10-09T23:30:16.615 [INFO] Downloading: https://repo.maven.apache.org/maven2/com/github/stephenc/findbugs/findbugs-annotations/1.3.9-1/findbugs-annotations-1.3.9-1.jar
2017-10-09T23:30:16.619 [INFO] Downloading: https://repo.maven.apache.org/maven2/org/apache/hbase/hbase-shaded-server/1.2.6/hbase-shaded-server-1.2.6.jar
2017-10-09T23:30:16.663 [INFO] Downloading: https://repo.maven.apache.org/maven2/org/apache/hbase/hbase-server/1.2.6/hbase-server-1.2.6-tests.jar
2017-10-09T23:30:16.815 [INFO] Downloaded: https://repo.maven.apache.org/maven2/com/github/stephenc/findbugs/findbugs-annotations/1.3.9-1/findbugs-annotations-1.3.9-1.jar
(15 KB at 71.9 KB/sec)
2017-10-09T23:30:16.815 [INFO] Downloading: https://repo.maven.apache.org/maven2/org/apache/hbase/hbase-common/1.2.6/hbase-common-1.2.6.jar
[INFO] I/O exception (java.net.SocketException) caught when processing request to {s}->https://repo.maven.apache.org:443:
Connection reset
[INFO] Retrying request to {s}->https://repo.maven.apache.org:443
2017-10-09T23:30:16.963 [INFO] Downloaded: https://repo.maven.apache.org/maven2/org/slf4j/slf4j-log4j12/1.6.1/slf4j-log4j12-1.6.1.jar
(10 KB at 26.5 KB/sec)
2017-10-09T23:30:16.964 [INFO] Downloading: https://repo.maven.apache.org/maven2/org/apache/hbase/hbase-protocol/1.2.6/hbase-protocol-1.2.6.jar
2017-10-09T23:30:17.132 [INFO] Downloaded: https://repo.maven.apache.org/maven2/org/apache/hbase/hbase-common/1.2.6/hbase-common-1.2.6.jar
(568 KB at 1123.4 KB/sec)
2017-10-09T23:30:17.132 [INFO] Downloading: https://repo.maven.apache.org/maven2/org/apache/hbase/hbase-procedure/1.2.6/hbase-procedure-1.2.6.jar
2017-10-09T23:30:17.204 [INFO] Downloaded: https://repo.maven.apache.org/maven2/org/apache/hbase/hbase-procedure/1.2.6/hbase-procedure-1.2.6.jar
(121 KB at 209.0 KB/sec)
2017-10-09T23:30:17.204 [INFO] Downloading: https://repo.maven.apache.org/maven2/org/apache/hbase/hbase-common/1.2.6/hbase-common-1.2.6-tests.jar
2017-10-09T23:30:17.332 [INFO] Downloaded: https://repo.maven.apache.org/maven2/org/apache/hbase/hbase-common/1.2.6/hbase-common-1.2.6-tests.jar
(223 KB at 316.0 KB/sec)
2017-10-09T23:30:17.332 [INFO] Downloading: https://repo.maven.apache.org/maven2/org/apache/hbase/hbase-client/1.2.6/hbase-client-1.2.6.jar
2017-10-09T23:30:17.863 [INFO] Downloaded: https://repo.maven.apache.org/maven2/org/apache/hbase/hbase-client/1.2.6/hbase-client-1.2.6.jar
(1274 KB at 1030.7 KB/sec)
2017-10-09T23:30:17.864 [INFO] Downloading: https://repo.maven.apache.org/maven2/org/jruby/jcodings/jcodings/1.0.8/jcodings-1.0.8.jar
2017-10-09T23:30:18.467 [INFO] Downloaded: https://repo.maven.apache.org/maven2/org/jruby/jcodings/jcodings/1.0.8/jcodings-1.0.8.jar
(1261 KB at 685.3 KB/sec)
2017-10-09T23:30:18.468 [INFO] Downloading: https://repo.maven.apache.org/maven2/org/jruby/joni/joni/2.1.2/joni-2.1.2.jar
2017-10-09T23:30:18.570 [INFO] Downloaded: https://repo.maven.apache.org/maven2/org/jruby/joni/joni/2.1.2/joni-2.1.2.jar
(183 KB at 94.1 KB/sec)
2017-10-09T23:30:18.571 [INFO] Downloading: https://repo.maven.apache.org/maven2/org/apache/hbase/hbase-prefix-tree/1.2.6/hbase-prefix-tree-1.2.6.jar
2017-10-09T23:30:18.639 [INFO] Downloaded: https://repo.maven.apache.org/maven2/org/apache/hbase/hbase-prefix-tree/1.2.6/hbase-prefix-tree-1.2.6.jar
(100 KB at 49.5 KB/sec)
2017-10-09T23:30:18.640 [INFO] Downloading: https://repo.maven.apache.org/maven2/org/apache/hbase/hbase-hadoop-compat/1.2.6/hbase-hadoop-compat-1.2.6.jar
2017-10-09T23:30:18.687 [INFO] Downloaded: https://repo.maven.apache.org/maven2/org/apache/hbase/hbase-hadoop-compat/1.2.6/hbase-hadoop-compat-1.2.6.jar
(37 KB at 17.5 KB/sec)
2017-10-09T23:30:18.687 [INFO] Downloading: https://repo.maven.apache.org/maven2/org/apache/hbase/hbase-hadoop2-compat/1.2.6/hbase-hadoop2-compat-1.2.6.jar
2017-10-09T23:30:18.767 [INFO] Downloaded: https://repo.maven.apache.org/maven2/org/apache/hbase/hbase-hadoop2-compat/1.2.6/hbase-hadoop2-compat-1.2.6.jar
(99 KB at 46.0 KB/sec)
2017-10-09T23:30:18.768 [INFO] Downloading: https://repo.maven.apache.org/maven2/com/yammer/metrics/metrics-core/2.2.0/metrics-core-2.2.0.jar
2017-10-09T23:30:18.767 [INFO] Downloaded: https://repo.maven.apache.org/maven2/org/apache/hbase/hbase-protocol/1.2.6/hbase-protocol-1.2.6.jar
(4264 KB at 1992.3 KB/sec)
2017-10-09T23:30:18.803 [INFO] Downloading: https://repo.maven.apache.org/maven2/org/apache/commons/commons-math/2.2/commons-math-2.2.jar
2017-10-09T23:30:19.050 [INFO] Downloaded: https://repo.maven.apache.org/maven2/com/yammer/metrics/metrics-core/2.2.0/metrics-core-2.2.0.jar
(81 KB at 33.1 KB/sec)
2017-10-09T23:30:19.050 [INFO] Downloading: https://repo.maven.apache.org/maven2/org/mortbay/jetty/jetty-sslengine/6.1.26/jetty-sslengine-6.1.26.jar
2017-10-09T23:30:19.079 [INFO] Downloaded: https://repo.maven.apache.org/maven2/org/mortbay/jetty/jetty-sslengine/6.1.26/jetty-sslengine-6.1.26.jar
(19 KB at 7.5 KB/sec)
2017-10-09T23:30:19.079 [INFO] Downloading: https://repo.maven.apache.org/maven2/tomcat/jasper-compiler/5.5.23/jasper-compiler-5.5.23.jar
2017-10-09T23:30:19.291 [INFO] Downloaded: https://repo.maven.apache.org/maven2/tomcat/jasper-compiler/5.5.23/jasper-compiler-5.5.23.jar
(399 KB at 149.6 KB/sec)
2017-10-09T23:30:19.292 [INFO] Downloading: https://repo.maven.apache.org/maven2/tomcat/jasper-runtime/5.5.23/jasper-runtime-5.5.23.jar
2017-10-09T23:30:19.347 [INFO] Downloaded: https://repo.maven.apache.org/maven2/tomcat/jasper-runtime/5.5.23/jasper-runtime-5.5.23.jar
(76 KB at 27.6 KB/sec)
2017-10-09T23:30:19.347 [INFO] Downloading: https://repo.maven.apache.org/maven2/org/jamon/jamon-runtime/2.4.1/jamon-runtime-2.4.1.jar
2017-10-09T23:30:19.383 [INFO] Downloaded: https://repo.maven.apache.org/maven2/org/jamon/jamon-runtime/2.4.1/jamon-runtime-2.4.1.jar
(24 KB at 8.7 KB/sec)
2017-10-09T23:30:19.383 [INFO] Downloading: https://repo.maven.apache.org/maven2/com/lmax/disruptor/3.3.0/disruptor-3.3.0.jar
2017-10-09T23:30:19.407 [INFO] Downloaded: https://repo.maven.apache.org/maven2/org/apache/commons/commons-math/2.2/commons-math-2.2.jar
(966 KB at 347.2 KB/sec)
2017-10-09T23:30:19.408 [INFO] Downloading: https://repo.maven.apache.org/maven2/org/apache/hadoop/hadoop-auth/2.5.1/hadoop-auth-2.5.1.jar
2017-10-09T23:30:19.424 [INFO] Downloaded: https://repo.maven.apache.org/maven2/com/lmax/disruptor/3.3.0/disruptor-3.3.0.jar
(78 KB at 27.8 KB/sec)
2017-10-09T23:30:19.425 [INFO] Downloading: https://repo.maven.apache.org/maven2/org/apache/httpcomponents/httpclient/4.2.5/httpclient-4.2.5.jar
2017-10-09T23:30:19.455 [INFO] Downloaded: https://repo.maven.apache.org/maven2/org/apache/hadoop/hadoop-auth/2.5.1/hadoop-auth-2.5.1.jar
(52 KB at 18.1 KB/sec)
2017-10-09T23:30:19.455 [INFO] Downloading: https://repo.maven.apache.org/maven2/org/apache/hbase/hbase-hadoop-compat/1.2.6/hbase-hadoop-compat-1.2.6-tests.jar
2017-10-09T23:30:19.477 [INFO] Downloaded: https://repo.maven.apache.org/maven2/org/apache/hbase/hbase-server/1.2.6/hbase-server-1.2.6-tests.jar
(7413 KB at 2594.3 KB/sec)
2017-10-09T23:30:19.477 [INFO] Downloading: https://repo.maven.apache.org/maven2/org/apache/hbase/hbase-hadoop2-compat/1.2.6/hbase-hadoop2-compat-1.2.6-tests.jar
2017-10-09T23:30:19.495 [INFO] Downloaded: https://repo.maven.apache.org/maven2/org/apache/hbase/hbase-hadoop-compat/1.2.6/hbase-hadoop-compat-1.2.6-tests.jar
(20 KB at 6.7 KB/sec)
2017-10-09T23:30:19.495 [INFO] Downloading: https://repo.maven.apache.org/maven2/org/apache/hbase/hbase-annotations/1.2.6/hbase-annotations-1.2.6.jar
2017-10-09T23:30:19.515 [INFO] Downloaded: https://repo.maven.apache.org/maven2/org/apache/hbase/hbase-hadoop2-compat/1.2.6/hbase-hadoop2-compat-1.2.6-tests.jar
(30 KB at 10.1 KB/sec)
2017-10-09T23:30:19.539 [INFO] Downloaded: https://repo.maven.apache.org/maven2/org/apache/hbase/hbase-annotations/1.2.6/hbase-annotations-1.2.6.jar
(21 KB at 7.0 KB/sec)
2017-10-09T23:30:19.566 [INFO] Downloaded: https://repo.maven.apache.org/maven2/org/apache/httpcomponents/httpclient/4.2.5/httpclient-4.2.5.jar
(424 KB at 144.0 KB/sec)
2017-10-09T23:30:24.193 [INFO] Downloaded: https://repo.maven.apache.org/maven2/org/apache/hbase/hbase-shaded-client/1.2.6/hbase-shaded-client-1.2.6.jar
(29957 KB at 3943.8 KB/sec)
[JENKINS] Archiving disabled
2017-10-09T23:30:27.257 [INFO]                                                           
             
2017-10-09T23:30:27.257 [INFO] ------------------------------------------------------------------------
2017-10-09T23:30:27.257 [INFO] Skipping Apache Beam :: Parent
2017-10-09T23:30:27.258 [INFO] This project has been banned from the build due to previous
failures.
2017-10-09T23:30:27.258 [INFO] ------------------------------------------------------------------------
[JENKINS] Archiving disabled
[JENKINS] Archiving disabled
[JENKINS] Archiving disabled
[JENKINS] Archiving disabled
[JENKINS] Archiving disabled
[JENKINS] Archiving disabled
[JENKINS] Archiving disabled
[JENKINS] Archiving disabled
[JENKINS] Archiving disabled
[JENKINS] Archiving disabled
[JENKINS] Archiving disabled
[JENKINS] Archiving disabled
[JENKINS] Archiving disabled
[JENKINS] Archiving disabled
[JENKINS] Archiving disabled
[JENKINS] Archiving disabled
[JENKINS] Archiving disabled
[JENKINS] Archiving disabled
[JENKINS] Archiving disabled
[JENKINS] Archiving disabled
[JENKINS] Archiving disabled
[JENKINS] Archiving disabled
[JENKINS] Archiving disabled
[JENKINS] Archiving disabled
[JENKINS] Archiving disabled
[JENKINS] Archiving disabled
[JENKINS] Archiving disabled
[JENKINS] Archiving disabled
[JENKINS] Archiving disabled
[JENKINS] Archiving disabled
[JENKINS] Archiving disabled
[JENKINS] Archiving disabled
[JENKINS] Archiving disabled
[JENKINS] Archiving disabled
[JENKINS] Archiving disabled
[JENKINS] Archiving disabled
[JENKINS] Archiving disabled
[JENKINS] Archiving disabled
[JENKINS] Archiving disabled
[JENKINS] Archiving disabled
[JENKINS] Archiving disabled
[JENKINS] Archiving disabled
[JENKINS] Archiving disabled
[JENKINS] Archiving disabled
[JENKINS] Archiving disabled
[JENKINS] Archiving disabled
[JENKINS] Archiving disabled
[JENKINS] Archiving disabled
[JENKINS] Archiving disabled
[JENKINS] Archiving disabled
[JENKINS] Archiving disabled
[JENKINS] Archiving disabled
[JENKINS] Archiving disabled
[JENKINS] Archiving disabled
[JENKINS] Archiving disabled
2017-10-09T23:31:02.449 [INFO] ------------------------------------------------------------------------
2017-10-09T23:31:02.449 [INFO] Reactor Summary:
2017-10-09T23:31:02.449 [INFO] 
2017-10-09T23:31:02.449 [INFO] Apache Beam :: Parent .............................. SUCCESS
[ 47.444 s]
2017-10-09T23:31:02.450 [INFO] Apache Beam :: SDKs :: Java :: Build Tools ......... SUCCESS
[ 17.022 s]
2017-10-09T23:31:02.450 [INFO] Apache Beam :: SDKs ................................ SUCCESS
[  8.049 s]
2017-10-09T23:31:02.450 [INFO] Apache Beam :: SDKs :: Common ...................... SUCCESS
[  3.419 s]
2017-10-09T23:31:02.450 [INFO] Apache Beam :: SDKs :: Common :: Runner API ........ SUCCESS
[ 53.841 s]
2017-10-09T23:31:02.450 [INFO] Apache Beam :: SDKs :: Common :: Fn API ............ SUCCESS
[ 34.150 s]
2017-10-09T23:31:02.450 [INFO] Apache Beam :: SDKs :: Java ........................ SUCCESS
[  3.415 s]
2017-10-09T23:31:02.450 [INFO] Apache Beam :: SDKs :: Java :: Core ................ SUCCESS
[04:34 min]
2017-10-09T23:31:02.450 [INFO] Apache Beam :: Runners :: Core Construction Java ... SUCCESS
[01:38 min]
2017-10-09T23:31:02.450 [INFO] Apache Beam :: Runners :: Core Java ................ SUCCESS
[03:00 min]
2017-10-09T23:31:02.450 [INFO] Apache Beam :: Runners :: Direct Java .............. SUCCESS
[11:22 min]
2017-10-09T23:31:02.450 [INFO] Apache Beam :: SDKs :: Java :: IO :: AMQP .......... SUCCESS
[ 55.604 s]
2017-10-09T23:31:02.450 [INFO] Apache Beam :: SDKs :: Java :: IO :: Common ........ SUCCESS
[ 10.622 s]
2017-10-09T23:31:02.450 [INFO] Apache Beam :: SDKs :: Java :: IO :: Cassandra ..... SUCCESS
[ 50.478 s]
2017-10-09T23:31:02.450 [INFO] Apache Beam :: SDKs :: Java :: IO :: Elasticsearch . SUCCESS
[ 25.003 s]
2017-10-09T23:31:02.450 [INFO] Apache Beam :: SDKs :: Java :: IO :: Elasticsearch-Tests SUCCESS
[  5.219 s]
2017-10-09T23:31:02.450 [INFO] Apache Beam :: SDKs :: Java :: IO :: Elasticsearch-Tests ::
Common SUCCESS [  5.450 s]
2017-10-09T23:31:02.450 [INFO] Apache Beam :: SDKs :: Java :: IO :: Elasticsearch-Tests ::
2.x SUCCESS [ 42.836 s]
2017-10-09T23:31:02.450 [INFO] Apache Beam :: SDKs :: Java :: IO :: Elasticsearch-Tests ::
5.x SUCCESS [ 57.914 s]
2017-10-09T23:31:02.450 [INFO] Apache Beam :: SDKs :: Java :: Extensions :: Google Cloud Platform
Core SUCCESS [ 46.430 s]
2017-10-09T23:31:02.450 [INFO] Apache Beam :: SDKs :: Java :: Extensions :: Protobuf SUCCESS
[ 34.873 s]
2017-10-09T23:31:02.450 [INFO] Apache Beam :: SDKs :: Java :: IO :: Google Cloud Platform
SUCCESS [02:19 min]
2017-10-09T23:31:02.450 [INFO] Apache Beam :: SDKs :: Java :: IO :: Hadoop Common . SUCCESS
[ 39.179 s]
2017-10-09T23:31:02.450 [INFO] Apache Beam :: SDKs :: Java :: IO :: Hadoop File System SUCCESS
[01:22 min]
2017-10-09T23:31:02.450 [INFO] Apache Beam :: SDKs :: Java :: IO :: Hadoop ........ SUCCESS
[  8.047 s]
2017-10-09T23:31:02.450 [INFO] Apache Beam :: SDKs :: Java :: IO :: Hadoop :: input-format
SUCCESS [ 45.986 s]
2017-10-09T23:31:02.450 [INFO] Apache Beam :: Runners :: Google Cloud Dataflow .... SUCCESS
[06:15 min]
2017-10-09T23:31:02.450 [INFO] Apache Beam :: SDKs :: Java :: IO :: Hadoop :: jdk1.8-tests
SUCCESS [02:21 min]
2017-10-09T23:31:02.450 [INFO] Apache Beam :: SDKs :: Java :: IO :: HBase ......... FAILURE
[ 11.777 s]
2017-10-09T23:31:02.450 [INFO] Apache Beam :: SDKs :: Java :: IO :: HCatalog ...... SKIPPED
2017-10-09T23:31:02.450 [INFO] Apache Beam :: SDKs :: Java :: IO :: JDBC .......... SKIPPED
2017-10-09T23:31:02.450 [INFO] Apache Beam :: SDKs :: Java :: IO :: JMS ........... SKIPPED
2017-10-09T23:31:02.450 [INFO] Apache Beam :: SDKs :: Java :: IO :: Kafka ......... SKIPPED
2017-10-09T23:31:02.450 [INFO] Apache Beam :: SDKs :: Java :: IO :: Kinesis ....... SKIPPED
2017-10-09T23:31:02.450 [INFO] Apache Beam :: SDKs :: Java :: IO :: MongoDB ....... SKIPPED
2017-10-09T23:31:02.450 [INFO] Apache Beam :: SDKs :: Java :: IO :: MQTT .......... SKIPPED
2017-10-09T23:31:02.450 [INFO] Apache Beam :: SDKs :: Java :: IO :: Solr .......... SKIPPED
2017-10-09T23:31:02.450 [INFO] Apache Beam :: SDKs :: Java :: IO :: Tika .......... SKIPPED
2017-10-09T23:31:02.450 [INFO] Apache Beam :: SDKs :: Java :: IO :: XML ........... SKIPPED
2017-10-09T23:31:02.450 [INFO] Apache Beam :: SDKs :: Java :: Maven Archetypes :: Starter
SKIPPED
2017-10-09T23:31:02.450 [INFO] Apache Beam :: Examples :: Java .................... SKIPPED
2017-10-09T23:31:02.450 [INFO] Apache Beam :: SDKs :: Java :: Maven Archetypes :: Examples
SKIPPED
2017-10-09T23:31:02.450 [INFO] Apache Beam :: Examples :: Java 8 .................. SKIPPED
2017-10-09T23:31:02.450 [INFO] Apache Beam :: SDKs :: Java :: Maven Archetypes :: Examples
- Java 8 SKIPPED
2017-10-09T23:31:02.450 [INFO] Apache Beam :: SDKs :: Java :: Extensions :: Jackson SKIPPED
2017-10-09T23:31:02.450 [INFO] Apache Beam :: SDKs :: Java :: Extensions :: Join library SKIPPED
2017-10-09T23:31:02.450 [INFO] Apache Beam :: SDKs :: Java :: Extensions :: Sorter  SKIPPED
2017-10-09T23:31:02.450 [INFO] Apache Beam :: SDKs :: Java :: Extensions :: SQL ... SKIPPED
2017-10-09T23:31:02.450 [INFO] Apache Beam :: SDKs :: Java :: Nexmark ............. SKIPPED
2017-10-09T23:31:02.450 [INFO] Apache Beam :: SDKs :: Java :: Harness ............. SKIPPED
2017-10-09T23:31:02.450 [INFO] Apache Beam :: SDKs :: Java :: Java 8 Tests ........ SKIPPED
2017-10-09T23:31:02.450 [INFO] Apache Beam :: Runners :: Flink .................... SKIPPED
2017-10-09T23:31:02.450 [INFO] Apache Beam :: Runners :: Spark .................... SKIPPED
2017-10-09T23:31:02.450 [INFO] Apache Beam :: Runners :: Apex ..................... SKIPPED
2017-10-09T23:31:02.450 [INFO] Apache Beam :: Runners :: Gearpump ................. SKIPPED
2017-10-09T23:31:02.450 [INFO] Apache Beam :: SDKs :: Java :: Aggregated Javadoc .. SKIPPED
2017-10-09T23:31:02.451 [INFO] ------------------------------------------------------------------------
2017-10-09T23:31:02.451 [INFO] BUILD FAILURE
2017-10-09T23:31:02.451 [INFO] ------------------------------------------------------------------------
[JENKINS] Archiving disabled
2017-10-09T23:31:02.451 [INFO] Total time: 44:37 min
2017-10-09T23:31:02.451 [INFO] Finished at: 2017-10-09T23:31:02+00:00
2017-10-09T23:31:05.016 [INFO] Final Memory: 243M/1892M
2017-10-09T23:31:05.016 [INFO] ------------------------------------------------------------------------
2017-10-09T23:31:05.028 [ERROR] Failed to execute goal on project beam-sdks-java-io-hbase:
Could not resolve dependencies for project org.apache.beam:beam-sdks-java-io-hbase:jar:2.3.0-SNAPSHOT:
Could not transfer artifact org.apache.hbase:hbase-shaded-server:jar:1.2.6 from/to central
(https://repo.maven.apache.org/maven2): GET request of: org/apache/hbase/hbase-shaded-server/1.2.6/hbase-shaded-server-1.2.6.jar
from central failed: Connection reset -> [Help 1]
2017-10-09T23:31:05.028 [ERROR] 
2017-10-09T23:31:05.029 [ERROR] To see the full stack trace of the errors, re-run Maven with
the -e switch.
2017-10-09T23:31:05.029 [ERROR] Re-run Maven using the -X switch to enable full debug logging.
2017-10-09T23:31:05.029 [ERROR] 
2017-10-09T23:31:05.029 [ERROR] For more information about the errors and possible solutions,
please read the following articles:
2017-10-09T23:31:05.029 [ERROR] [Help 1] http://cwiki.apache.org/confluence/display/MAVEN/DependencyResolutionException
2017-10-09T23:31:05.030 [ERROR] 
2017-10-09T23:31:05.030 [ERROR] After correcting the problems, you can resume the build with
the command
2017-10-09T23:31:05.030 [ERROR]   mvn <goals> -rf :beam-sdks-java-io-hbase
channel stopped
Not sending mail to unregistered user relax@relax-macbookpro.roam.corp.google.com
Not sending mail to unregistered user kirpichov@google.com
Not sending mail to unregistered user herohde@google.com
Not sending mail to unregistered user aljoscha.krettek@gmail.com
Not sending mail to unregistered user klk@google.com
Not sending mail to unregistered user github@nakomis.com
Not sending mail to unregistered user jasonkuster@google.com
Not sending mail to unregistered user ekirpichov@gmail.com

Mime
View raw message