beam-commits mailing list archives

Site index · List index
Message view « Date » · « Thread »
Top « Date » · « Thread »
From Apache Jenkins Server <jenk...@builds.apache.org>
Subject Build failed in Jenkins: beam_PostCommit_Java_MavenInstall #5107
Date Wed, 25 Oct 2017 18:54:15 GMT
See <https://builds.apache.org/job/beam_PostCommit_Java_MavenInstall/5107/display/redirect>

------------------------------------------
[...truncated 1.50 MB...]
2017-10-25T18:44:03.391 [INFO] 
2017-10-25T18:44:03.391 [INFO] --- findbugs-maven-plugin:3.0.4:check (default) @ beam-runners-gearpump
---
2017-10-25T18:44:03.398 [INFO] BugInstance size is 1
2017-10-25T18:44:03.398 [INFO] Error size is 0
2017-10-25T18:44:03.401 [INFO] Total bugs: 1
2017-10-25T18:44:03.401 [INFO] org.apache.beam.runners.gearpump.GearpumpPipelineResult.metrics()
may return null, but is declared @Nonnull [org.apache.beam.runners.gearpump.GearpumpPipelineResult]
At GearpumpPipelineResult.java:[line 86] NP_NONNULL_RETURN_VIOLATION
2017-10-25T18:44:03.401 [INFO] 


To see bug detail using the Findbugs GUI, use the following command "mvn findbugs:gui"



[JENKINS] Archiving disabled
2017-10-25T18:44:04.364 [INFO]                                                           
             
2017-10-25T18:44:04.364 [INFO] ------------------------------------------------------------------------
2017-10-25T18:44:04.364 [INFO] Skipping Apache Beam :: SDKs :: Java :: Aggregated Javadoc
2017-10-25T18:44:04.364 [INFO] This project has been banned from the build due to previous
failures.
2017-10-25T18:44:04.364 [INFO] ------------------------------------------------------------------------
2017-10-25T18:44:04.807 [INFO]                                                           
             
2017-10-25T18:44:04.807 [INFO] ------------------------------------------------------------------------
2017-10-25T18:44:04.807 [INFO] Building Apache Beam :: Parent 2.3.0-SNAPSHOT
2017-10-25T18:44:04.807 [INFO] ------------------------------------------------------------------------
2017-10-25T18:44:04.808 [WARNING] The POM for org.eclipse.m2e:lifecycle-mapping:jar:1.0.0
is missing, no dependency information available
2017-10-25T18:44:04.808 [WARNING] Failed to retrieve plugin descriptor for org.eclipse.m2e:lifecycle-mapping:1.0.0:
Plugin org.eclipse.m2e:lifecycle-mapping:1.0.0 or one of its dependencies could not be resolved:
Failure to find org.eclipse.m2e:lifecycle-mapping:jar:1.0.0 in https://repo.maven.apache.org/maven2
was cached in the local repository, resolution will not be reattempted until the update interval
of central has elapsed or updates are forced
2017-10-25T18:44:04.809 [INFO] 
2017-10-25T18:44:04.809 [INFO] --- coveralls-maven-plugin:4.3.0:report (default-cli) @ beam-parent
---
2017-10-25T18:44:04.826 [INFO] Downloading: https://repo.maven.apache.org/maven2/org/apache/httpcomponents/httpmime/4.5.2/httpmime-4.5.2.pom
2017-10-25T18:44:04.853 [INFO] Downloaded: https://repo.maven.apache.org/maven2/org/apache/httpcomponents/httpmime/4.5.2/httpmime-4.5.2.pom
(5 KB at 173.0 KB/sec)
2017-10-25T18:44:04.857 [INFO] Downloading: https://repo.maven.apache.org/maven2/com/fasterxml/jackson/core/jackson-core/2.8.3/jackson-core-2.8.3.pom
2017-10-25T18:44:04.884 [INFO] Downloaded: https://repo.maven.apache.org/maven2/com/fasterxml/jackson/core/jackson-core/2.8.3/jackson-core-2.8.3.pom
(6 KB at 195.9 KB/sec)
2017-10-25T18:44:04.889 [INFO] Downloading: https://repo.maven.apache.org/maven2/com/fasterxml/jackson/core/jackson-annotations/2.8.3/jackson-annotations-2.8.3.pom
2017-10-25T18:44:04.915 [INFO] Downloaded: https://repo.maven.apache.org/maven2/com/fasterxml/jackson/core/jackson-annotations/2.8.3/jackson-annotations-2.8.3.pom
(2 KB at 72.2 KB/sec)
2017-10-25T18:44:04.919 [INFO] Downloading: https://repo.maven.apache.org/maven2/com/fasterxml/jackson/core/jackson-databind/2.8.3/jackson-databind-2.8.3.pom
2017-10-25T18:44:04.945 [INFO] Downloaded: https://repo.maven.apache.org/maven2/com/fasterxml/jackson/core/jackson-databind/2.8.3/jackson-databind-2.8.3.pom
(6 KB at 203.8 KB/sec)
2017-10-25T18:44:04.950 [INFO] Downloading: https://repo.maven.apache.org/maven2/org/eclipse/jgit/org.eclipse.jgit/4.5.0.201609210915-r/org.eclipse.jgit-4.5.0.201609210915-r.pom
2017-10-25T18:44:04.978 [INFO] Downloaded: https://repo.maven.apache.org/maven2/org/eclipse/jgit/org.eclipse.jgit/4.5.0.201609210915-r/org.eclipse.jgit-4.5.0.201609210915-r.pom
(10 KB at 331.4 KB/sec)
2017-10-25T18:44:04.980 [INFO] Downloading: https://repo.maven.apache.org/maven2/org/eclipse/jgit/org.eclipse.jgit-parent/4.5.0.201609210915-r/org.eclipse.jgit-parent-4.5.0.201609210915-r.pom
2017-10-25T18:44:05.009 [INFO] Downloaded: https://repo.maven.apache.org/maven2/org/eclipse/jgit/org.eclipse.jgit-parent/4.5.0.201609210915-r/org.eclipse.jgit-parent-4.5.0.201609210915-r.pom
(27 KB at 911.2 KB/sec)
2017-10-25T18:44:05.013 [INFO] Downloading: https://repo.maven.apache.org/maven2/com/jcraft/jsch/0.1.53/jsch-0.1.53.pom
2017-10-25T18:44:05.041 [INFO] Downloaded: https://repo.maven.apache.org/maven2/com/jcraft/jsch/0.1.53/jsch-0.1.53.pom
(4 KB at 112.8 KB/sec)
2017-10-25T18:44:05.043 [INFO] Downloading: https://repo.maven.apache.org/maven2/org/sonatype/oss/oss-parent/6/oss-parent-6.pom
2017-10-25T18:44:05.069 [INFO] Downloaded: https://repo.maven.apache.org/maven2/org/sonatype/oss/oss-parent/6/oss-parent-6.pom
(5 KB at 181.5 KB/sec)
2017-10-25T18:44:05.072 [INFO] Downloading: https://repo.maven.apache.org/maven2/com/googlecode/javaewah/JavaEWAH/0.7.9/JavaEWAH-0.7.9.pom
2017-10-25T18:44:05.098 [INFO] Downloaded: https://repo.maven.apache.org/maven2/com/googlecode/javaewah/JavaEWAH/0.7.9/JavaEWAH-0.7.9.pom
(5 KB at 163.2 KB/sec)
2017-10-25T18:44:05.100 [INFO] Downloading: https://repo.maven.apache.org/maven2/org/codehaus/plexus/plexus-utils/2.0.7/plexus-utils-2.0.7.pom
2017-10-25T18:44:05.127 [INFO] Downloaded: https://repo.maven.apache.org/maven2/org/codehaus/plexus/plexus-utils/2.0.7/plexus-utils-2.0.7.pom
(3 KB at 101.7 KB/sec)
2017-10-25T18:44:05.129 [INFO] Downloading: https://repo.maven.apache.org/maven2/org/sonatype/sisu/sisu-inject-plexus/1.4.3.2/sisu-inject-plexus-1.4.3.2.pom
2017-10-25T18:44:05.158 [INFO] Downloaded: https://repo.maven.apache.org/maven2/org/sonatype/sisu/sisu-inject-plexus/1.4.3.2/sisu-inject-plexus-1.4.3.2.pom
(6 KB at 175.4 KB/sec)
2017-10-25T18:44:05.160 [INFO] Downloading: https://repo.maven.apache.org/maven2/org/sonatype/sisu/inject/guice-plexus/1.4.3.2/guice-plexus-1.4.3.2.pom
2017-10-25T18:44:05.186 [INFO] Downloaded: https://repo.maven.apache.org/maven2/org/sonatype/sisu/inject/guice-plexus/1.4.3.2/guice-plexus-1.4.3.2.pom
(3 KB at 114.0 KB/sec)
2017-10-25T18:44:05.188 [INFO] Downloading: https://repo.maven.apache.org/maven2/org/sonatype/sisu/inject/guice-bean/1.4.3.2/guice-bean-1.4.3.2.pom
2017-10-25T18:44:05.214 [INFO] Downloaded: https://repo.maven.apache.org/maven2/org/sonatype/sisu/inject/guice-bean/1.4.3.2/guice-bean-1.4.3.2.pom
(3 KB at 94.9 KB/sec)
2017-10-25T18:44:05.215 [INFO] Downloading: https://repo.maven.apache.org/maven2/org/sonatype/sisu/sisu-inject/1.4.3.2/sisu-inject-1.4.3.2.pom
2017-10-25T18:44:05.242 [INFO] Downloaded: https://repo.maven.apache.org/maven2/org/sonatype/sisu/sisu-inject/1.4.3.2/sisu-inject-1.4.3.2.pom
(2 KB at 43.5 KB/sec)
2017-10-25T18:44:05.243 [INFO] Downloading: https://repo.maven.apache.org/maven2/org/sonatype/sisu/sisu-parent/1.4.3.2/sisu-parent-1.4.3.2.pom
2017-10-25T18:44:05.272 [INFO] Downloaded: https://repo.maven.apache.org/maven2/org/sonatype/sisu/sisu-parent/1.4.3.2/sisu-parent-1.4.3.2.pom
(8 KB at 272.2 KB/sec)
2017-10-25T18:44:05.275 [INFO] Downloading: https://repo.maven.apache.org/maven2/org/sonatype/sisu/sisu-inject-bean/1.4.3.2/sisu-inject-bean-1.4.3.2.pom
2017-10-25T18:44:05.302 [INFO] Downloaded: https://repo.maven.apache.org/maven2/org/sonatype/sisu/sisu-inject-bean/1.4.3.2/sisu-inject-bean-1.4.3.2.pom
(6 KB at 191.7 KB/sec)
2017-10-25T18:44:05.305 [INFO] Downloading: https://repo.maven.apache.org/maven2/org/sonatype/sisu/sisu-guice/2.9.2/sisu-guice-2.9.2.pom
2017-10-25T18:44:05.332 [INFO] Downloaded: https://repo.maven.apache.org/maven2/org/sonatype/sisu/sisu-guice/2.9.2/sisu-guice-2.9.2.pom
(8 KB at 265.8 KB/sec)
2017-10-25T18:44:05.334 [INFO] Downloading: https://repo.maven.apache.org/maven2/org/sonatype/sisu/inject/guice-parent/2.9.2/guice-parent-2.9.2.pom
2017-10-25T18:44:05.361 [INFO] Downloaded: https://repo.maven.apache.org/maven2/org/sonatype/sisu/inject/guice-parent/2.9.2/guice-parent-2.9.2.pom
(12 KB at 442.9 KB/sec)
2017-10-25T18:44:05.366 [INFO] Downloading: https://repo.maven.apache.org/maven2/org/slf4j/jcl-over-slf4j/1.7.21/jcl-over-slf4j-1.7.21.pom
2017-10-25T18:44:05.392 [INFO] Downloaded: https://repo.maven.apache.org/maven2/org/slf4j/jcl-over-slf4j/1.7.21/jcl-over-slf4j-1.7.21.pom
(963 B at 36.2 KB/sec)
2017-10-25T18:44:05.411 [INFO] Downloading: https://repo.maven.apache.org/maven2/org/apache/httpcomponents/httpmime/4.5.2/httpmime-4.5.2.jar
2017-10-25T18:44:05.411 [INFO] Downloading: https://repo.maven.apache.org/maven2/com/fasterxml/jackson/core/jackson-core/2.8.3/jackson-core-2.8.3.jar
2017-10-25T18:44:05.411 [INFO] Downloading: https://repo.maven.apache.org/maven2/com/fasterxml/jackson/core/jackson-annotations/2.8.3/jackson-annotations-2.8.3.jar
2017-10-25T18:44:05.412 [INFO] Downloading: https://repo.maven.apache.org/maven2/org/eclipse/jgit/org.eclipse.jgit/4.5.0.201609210915-r/org.eclipse.jgit-4.5.0.201609210915-r.jar
2017-10-25T18:44:05.413 [INFO] Downloading: https://repo.maven.apache.org/maven2/com/fasterxml/jackson/core/jackson-databind/2.8.3/jackson-databind-2.8.3.jar
2017-10-25T18:44:05.460 [INFO] Downloaded: https://repo.maven.apache.org/maven2/org/apache/httpcomponents/httpmime/4.5.2/httpmime-4.5.2.jar
(41 KB at 801.3 KB/sec)
2017-10-25T18:44:05.460 [INFO] Downloading: https://repo.maven.apache.org/maven2/com/jcraft/jsch/0.1.53/jsch-0.1.53.jar
2017-10-25T18:44:05.461 [INFO] Downloaded: https://repo.maven.apache.org/maven2/com/fasterxml/jackson/core/jackson-annotations/2.8.3/jackson-annotations-2.8.3.jar
(55 KB at 1086.9 KB/sec)
2017-10-25T18:44:05.461 [INFO] Downloading: https://repo.maven.apache.org/maven2/com/googlecode/javaewah/JavaEWAH/0.7.9/JavaEWAH-0.7.9.jar
2017-10-25T18:44:05.532 [INFO] Downloaded: https://repo.maven.apache.org/maven2/com/googlecode/javaewah/JavaEWAH/0.7.9/JavaEWAH-0.7.9.jar
(123 KB at 1018.4 KB/sec)
2017-10-25T18:44:05.532 [INFO] Downloading: https://repo.maven.apache.org/maven2/org/codehaus/plexus/plexus-utils/2.0.7/plexus-utils-2.0.7.jar
2017-10-25T18:44:05.532 [INFO] Downloaded: https://repo.maven.apache.org/maven2/com/fasterxml/jackson/core/jackson-core/2.8.3/jackson-core-2.8.3.jar
(275 KB at 2268.5 KB/sec)
2017-10-25T18:44:05.532 [INFO] Downloading: https://repo.maven.apache.org/maven2/org/sonatype/sisu/sisu-inject-plexus/1.4.3.2/sisu-inject-plexus-1.4.3.2.jar
2017-10-25T18:44:05.544 [INFO] Downloaded: https://repo.maven.apache.org/maven2/com/jcraft/jsch/0.1.53/jsch-0.1.53.jar
(274 KB at 2073.0 KB/sec)
2017-10-25T18:44:05.544 [INFO] Downloading: https://repo.maven.apache.org/maven2/org/sonatype/sisu/sisu-inject-bean/1.4.3.2/sisu-inject-bean-1.4.3.2.jar
2017-10-25T18:44:05.606 [INFO] Downloaded: https://repo.maven.apache.org/maven2/org/sonatype/sisu/sisu-inject-plexus/1.4.3.2/sisu-inject-plexus-1.4.3.2.jar
(201 KB at 1031.3 KB/sec)
2017-10-25T18:44:05.606 [INFO] Downloading: https://repo.maven.apache.org/maven2/org/sonatype/sisu/sisu-guice/2.9.2/sisu-guice-2.9.2-no_aop.jar
2017-10-25T18:44:05.611 [INFO] Downloaded: https://repo.maven.apache.org/maven2/org/codehaus/plexus/plexus-utils/2.0.7/plexus-utils-2.0.7.jar
(219 KB at 1099.0 KB/sec)
2017-10-25T18:44:05.611 [INFO] Downloading: https://repo.maven.apache.org/maven2/org/slf4j/slf4j-api/1.7.21/slf4j-api-1.7.21.jar
2017-10-25T18:44:05.640 [INFO] Downloaded: https://repo.maven.apache.org/maven2/org/slf4j/slf4j-api/1.7.21/slf4j-api-1.7.21.jar
(41 KB at 175.9 KB/sec)
2017-10-25T18:44:05.641 [INFO] Downloading: https://repo.maven.apache.org/maven2/org/slf4j/jcl-over-slf4j/1.7.21/jcl-over-slf4j-1.7.21.jar
2017-10-25T18:44:05.644 [INFO] Downloaded: https://repo.maven.apache.org/maven2/org/sonatype/sisu/sisu-inject-bean/1.4.3.2/sisu-inject-bean-1.4.3.2.jar
(157 KB at 675.3 KB/sec)
2017-10-25T18:44:05.668 [INFO] Downloaded: https://repo.maven.apache.org/maven2/org/slf4j/jcl-over-slf4j/1.7.21/jcl-over-slf4j-1.7.21.jar
(17 KB at 62.7 KB/sec)
2017-10-25T18:44:05.696 [INFO] Downloaded: https://repo.maven.apache.org/maven2/com/fasterxml/jackson/core/jackson-databind/2.8.3/jackson-databind-2.8.3.jar
(1205 KB at 4227.3 KB/sec)
2017-10-25T18:44:05.715 [INFO] Downloaded: https://repo.maven.apache.org/maven2/org/sonatype/sisu/sisu-guice/2.9.2/sisu-guice-2.9.2-no_aop.jar
(469 KB at 1546.5 KB/sec)
2017-10-25T18:44:05.842 [INFO] Downloaded: https://repo.maven.apache.org/maven2/org/eclipse/jgit/org.eclipse.jgit/4.5.0.201609210915-r/org.eclipse.jgit-4.5.0.201609210915-r.jar
(2324 KB at 5390.6 KB/sec)
2017-10-25T18:44:06.995 [INFO] Starting Coveralls job for jenkins (5107 / https://builds.apache.org/job/beam_PostCommit_Java_MavenInstall/5107/)
2017-10-25T18:44:06.996 [INFO] Using repository token <secret>
2017-10-25T18:44:06.996 [INFO] Git commit cf6261e in master
2017-10-25T18:44:06.996 [INFO] Writing Coveralls data to <https://builds.apache.org/job/beam_PostCommit_Java_MavenInstall/ws/src/target/coveralls.json...>
2017-10-25T18:44:07.048 [INFO] Processing coverage report from <https://builds.apache.org/job/beam_PostCommit_Java_MavenInstall/ws/src/sdks/java/core/target/site/jacoco/jacoco.xml>
2017-10-25T18:44:07.425 [INFO] Processing coverage report from <https://builds.apache.org/job/beam_PostCommit_Java_MavenInstall/ws/src/sdks/java/extensions/google-cloud-platform-core/target/site/jacoco/jacoco.xml>
2017-10-25T18:44:07.569 [INFO] Processing coverage report from <https://builds.apache.org/job/beam_PostCommit_Java_MavenInstall/ws/src/sdks/java/extensions/protobuf/target/site/jacoco/jacoco.xml>
2017-10-25T18:44:07.573 [INFO] Processing coverage report from <https://builds.apache.org/job/beam_PostCommit_Java_MavenInstall/ws/src/sdks/java/java8tests/target/site/jacoco/jacoco.xml>
2017-10-25T18:44:07.574 [INFO] Processing coverage report from <https://builds.apache.org/job/beam_PostCommit_Java_MavenInstall/ws/src/runners/core-java/target/site/jacoco/jacoco.xml>
2017-10-25T18:44:07.924 [INFO] Processing coverage report from <https://builds.apache.org/job/beam_PostCommit_Java_MavenInstall/ws/src/runners/direct-java/target/site/jacoco/jacoco.xml>
2017-10-25T18:44:08.103 [INFO] Processing coverage report from <https://builds.apache.org/job/beam_PostCommit_Java_MavenInstall/ws/src/runners/google-cloud-dataflow-java/target/site/jacoco/jacoco.xml>
2017-10-25T18:44:08.243 [INFO] Processing coverage report from <https://builds.apache.org/job/beam_PostCommit_Java_MavenInstall/ws/src/examples/java/target/site/jacoco/jacoco.xml>
2017-10-25T18:44:08.352 [INFO] Processing coverage report from <https://builds.apache.org/job/beam_PostCommit_Java_MavenInstall/ws/src/examples/java8/target/site/jacoco/jacoco.xml>
[JENKINS] Archiving disabled
[JENKINS] Archiving disabled
[JENKINS] Archiving disabled
[JENKINS] Archiving disabled
[JENKINS] Archiving disabled
[JENKINS] Archiving disabled
[JENKINS] Archiving disabled
[JENKINS] Archiving disabled
[JENKINS] Archiving disabled
[JENKINS] Archiving disabled
[JENKINS] Archiving disabled
[JENKINS] Archiving disabled
[JENKINS] Archiving disabled
[JENKINS] Archiving disabled
[JENKINS] Archiving disabled
[JENKINS] Archiving disabled
[JENKINS] Archiving disabled
[JENKINS] Archiving disabled
[JENKINS] Archiving disabled
[JENKINS] Archiving disabled
[JENKINS] Archiving disabled
[JENKINS] Archiving disabled
[JENKINS] Archiving disabled
[JENKINS] Archiving disabled
[JENKINS] Archiving disabled
[JENKINS] Archiving disabled
[JENKINS] Archiving disabled
[JENKINS] Archiving disabled
[JENKINS] Archiving disabled
[JENKINS] Archiving disabled
[JENKINS] Archiving disabled
[JENKINS] Archiving disabled
[JENKINS] Archiving disabled
[JENKINS] Archiving disabled
[JENKINS] Archiving disabled
[JENKINS] Archiving disabled
[JENKINS] Archiving disabled
[JENKINS] Archiving disabled
[JENKINS] Archiving disabled
[JENKINS] Archiving disabled
[JENKINS] Archiving disabled
[JENKINS] Archiving disabled
[JENKINS] Archiving disabled
[JENKINS] Archiving disabled
[JENKINS] Archiving disabled
[JENKINS] Archiving disabled
[JENKINS] Archiving disabled
[JENKINS] Archiving disabled
[JENKINS] Archiving disabled
[JENKINS] Archiving disabled
[JENKINS] Archiving disabled
[JENKINS] Archiving disabled
[JENKINS] Archiving disabled
[JENKINS] Archiving disabled
[JENKINS] Archiving disabled
[JENKINS] Archiving disabled
[JENKINS] Archiving disabled
[JENKINS] Archiving disabled
2017-10-25T18:50:28.389 [INFO] ------------------------------------------------------------------------
2017-10-25T18:50:28.389 [INFO] Reactor Summary:
2017-10-25T18:50:28.389 [INFO] 
2017-10-25T18:50:28.390 [INFO] Apache Beam :: Parent .............................. FAILURE
[ 17.010 s]
2017-10-25T18:50:28.390 [INFO] Apache Beam :: SDKs :: Java :: Build Tools ......... SUCCESS
[ 11.549 s]
2017-10-25T18:50:28.390 [INFO] Apache Beam :: Model ............................... SUCCESS
[  2.645 s]
2017-10-25T18:50:28.390 [INFO] Apache Beam :: Model :: Pipeline ................... SUCCESS
[ 43.491 s]
2017-10-25T18:50:28.390 [INFO] Apache Beam :: Model :: Fn Execution ............... SUCCESS
[ 29.635 s]
2017-10-25T18:50:28.390 [INFO] Apache Beam :: SDKs ................................ SUCCESS
[  3.425 s]
2017-10-25T18:50:28.390 [INFO] Apache Beam :: SDKs :: Java ........................ SUCCESS
[  3.522 s]
2017-10-25T18:50:28.391 [INFO] Apache Beam :: SDKs :: Java :: Core ................ SUCCESS
[04:42 min]
2017-10-25T18:50:28.391 [INFO] Apache Beam :: Runners :: Core Construction Java ... SUCCESS
[02:16 min]
2017-10-25T18:50:28.391 [INFO] Apache Beam :: Runners :: Core Java ................ SUCCESS
[02:32 min]
2017-10-25T18:50:28.391 [INFO] Apache Beam :: Runners :: Direct Java .............. SUCCESS
[07:13 min]
2017-10-25T18:50:28.391 [INFO] Apache Beam :: SDKs :: Java :: IO :: AMQP .......... SUCCESS
[ 40.476 s]
2017-10-25T18:50:28.391 [INFO] Apache Beam :: SDKs :: Java :: IO :: Common ........ SUCCESS
[  8.289 s]
2017-10-25T18:50:28.391 [INFO] Apache Beam :: SDKs :: Java :: IO :: Cassandra ..... SUCCESS
[ 37.940 s]
2017-10-25T18:50:28.391 [INFO] Apache Beam :: SDKs :: Java :: IO :: Elasticsearch . SUCCESS
[ 31.096 s]
2017-10-25T18:50:28.392 [INFO] Apache Beam :: SDKs :: Java :: IO :: Elasticsearch-Tests SUCCESS
[  4.558 s]
2017-10-25T18:50:28.392 [INFO] Apache Beam :: SDKs :: Java :: IO :: Elasticsearch-Tests ::
Common SUCCESS [  5.097 s]
2017-10-25T18:50:28.392 [INFO] Apache Beam :: SDKs :: Java :: IO :: Elasticsearch-Tests ::
2.x SUCCESS [ 31.178 s]
2017-10-25T18:50:28.392 [INFO] Apache Beam :: SDKs :: Java :: IO :: Elasticsearch-Tests ::
5.x SUCCESS [01:00 min]
2017-10-25T18:50:28.392 [INFO] Apache Beam :: SDKs :: Java :: Extensions :: Google Cloud Platform
Core SUCCESS [ 46.506 s]
2017-10-25T18:50:28.392 [INFO] Apache Beam :: SDKs :: Java :: Extensions :: Protobuf SUCCESS
[ 45.023 s]
2017-10-25T18:50:28.392 [INFO] Apache Beam :: SDKs :: Java :: IO :: Google Cloud Platform
SUCCESS [02:20 min]
2017-10-25T18:50:28.392 [INFO] Apache Beam :: SDKs :: Java :: IO :: Hadoop Common . SUCCESS
[01:52 min]
2017-10-25T18:50:28.392 [INFO] Apache Beam :: SDKs :: Java :: IO :: Hadoop File System SUCCESS
[02:06 min]
2017-10-25T18:50:28.393 [INFO] Apache Beam :: SDKs :: Java :: IO :: Hadoop ........ SUCCESS
[ 48.608 s]
2017-10-25T18:50:28.393 [INFO] Apache Beam :: SDKs :: Java :: IO :: Hadoop :: input-format
SUCCESS [01:52 min]
2017-10-25T18:50:28.393 [INFO] Apache Beam :: Runners :: Google Cloud Dataflow .... SUCCESS
[09:20 min]
2017-10-25T18:50:28.393 [INFO] Apache Beam :: SDKs :: Java :: IO :: Hadoop :: jdk1.8-tests
SUCCESS [02:51 min]
2017-10-25T18:50:28.393 [INFO] Apache Beam :: SDKs :: Java :: IO :: HBase ......... SUCCESS
[03:35 min]
2017-10-25T18:50:28.393 [INFO] Apache Beam :: SDKs :: Java :: IO :: HCatalog ...... SUCCESS
[02:54 min]
2017-10-25T18:50:28.393 [INFO] Apache Beam :: SDKs :: Java :: IO :: JDBC .......... SUCCESS
[01:51 min]
2017-10-25T18:50:28.393 [INFO] Apache Beam :: SDKs :: Java :: IO :: JMS ........... SUCCESS
[01:36 min]
2017-10-25T18:50:28.394 [INFO] Apache Beam :: SDKs :: Java :: IO :: Kafka ......... SUCCESS
[01:32 min]
2017-10-25T18:50:28.394 [INFO] Apache Beam :: SDKs :: Java :: IO :: Kinesis ....... SUCCESS
[01:40 min]
2017-10-25T18:50:28.394 [INFO] Apache Beam :: SDKs :: Java :: IO :: MongoDB ....... SUCCESS
[02:02 min]
2017-10-25T18:50:28.394 [INFO] Apache Beam :: SDKs :: Java :: IO :: MQTT .......... SUCCESS
[01:25 min]
2017-10-25T18:50:28.394 [INFO] Apache Beam :: SDKs :: Java :: IO :: Redis ......... SUCCESS
[01:17 min]
2017-10-25T18:50:28.394 [INFO] Apache Beam :: SDKs :: Java :: IO :: Solr .......... SUCCESS
[02:00 min]
2017-10-25T18:50:28.394 [INFO] Apache Beam :: SDKs :: Java :: IO :: Tika .......... SUCCESS
[01:37 min]
2017-10-25T18:50:28.394 [INFO] Apache Beam :: SDKs :: Java :: IO :: XML ........... SUCCESS
[ 55.651 s]
2017-10-25T18:50:28.394 [INFO] Apache Beam :: SDKs :: Java :: Maven Archetypes :: Starter
SUCCESS [ 19.718 s]
2017-10-25T18:50:28.395 [INFO] Apache Beam :: Examples :: Java .................... SUCCESS
[09:14 min]
2017-10-25T18:50:28.395 [INFO] Apache Beam :: SDKs :: Java :: Maven Archetypes :: Examples
SUCCESS [01:15 min]
2017-10-25T18:50:28.395 [INFO] Apache Beam :: Examples :: Java 8 .................. SUCCESS
[01:19 min]
2017-10-25T18:50:28.395 [INFO] Apache Beam :: SDKs :: Java :: Maven Archetypes :: Examples
- Java 8 SUCCESS [ 50.266 s]
2017-10-25T18:50:28.395 [INFO] Apache Beam :: SDKs :: Java :: Extensions :: Jackson SUCCESS
[01:03 min]
2017-10-25T18:50:28.395 [INFO] Apache Beam :: SDKs :: Java :: Extensions :: Join library SUCCESS
[ 27.949 s]
2017-10-25T18:50:28.395 [INFO] Apache Beam :: SDKs :: Java :: Extensions :: Sorter  SUCCESS
[01:03 min]
2017-10-25T18:50:28.395 [INFO] Apache Beam :: SDKs :: Java :: Extensions :: SQL ... SUCCESS
[02:22 min]
2017-10-25T18:50:28.395 [INFO] Apache Beam :: SDKs :: Java :: Nexmark ............. SUCCESS
[04:00 min]
2017-10-25T18:50:28.396 [INFO] Apache Beam :: SDKs :: Java :: Harness ............. SUCCESS
[01:56 min]
2017-10-25T18:50:28.396 [INFO] Apache Beam :: SDKs :: Java :: Java 8 Tests ........ SUCCESS
[01:32 min]
2017-10-25T18:50:28.396 [INFO] Apache Beam :: Runners :: Flink .................... FAILURE
[01:27 min]
2017-10-25T18:50:28.396 [INFO] Apache Beam :: Runners :: Spark .................... SUCCESS
[03:41 min]
2017-10-25T18:50:28.396 [INFO] Apache Beam :: Runners :: Apex ..................... FAILURE
[01:08 min]
2017-10-25T18:50:28.396 [INFO] Apache Beam :: Runners :: Gearpump ................. FAILURE
[01:09 min]
2017-10-25T18:50:28.396 [INFO] Apache Beam :: SDKs :: Java :: Aggregated Javadoc .. SKIPPED
2017-10-25T18:50:28.396 [INFO] ------------------------------------------------------------------------
2017-10-25T18:50:28.397 [INFO] BUILD FAILURE
2017-10-25T18:50:28.397 [INFO] ------------------------------------------------------------------------
2017-10-25T18:50:28.397 [INFO] Total time: 01:53 h
2017-10-25T18:50:28.397 [INFO] Finished at: 2017-10-25T18:50:28+00:00
2017-10-25T18:50:30.534 [INFO] Final Memory: 345M/1978M
2017-10-25T18:50:30.534 [INFO] ------------------------------------------------------------------------
Waiting for Jenkins to finish collecting data2017-10-25T18:50:45.981 [ERROR] Failed to execute
goal org.codehaus.mojo:findbugs-maven-plugin:3.0.4:check (default) on project beam-runners-flink_2.10:
failed with 2 bugs and 0 errors -> [Help 1]
2017-10-25T18:50:45.981 [ERROR] Failed to execute goal org.codehaus.mojo:findbugs-maven-plugin:3.0.4:check
(default) on project beam-runners-apex: failed with 2 bugs and 0 errors -> [Help 1]
2017-10-25T18:50:45.981 [ERROR] Failed to execute goal org.codehaus.mojo:findbugs-maven-plugin:3.0.4:check
(default) on project beam-runners-gearpump: failed with 1 bugs and 0 errors -> [Help 1]
2017-10-25T18:50:45.981 [ERROR] Failed to execute goal org.eluder.coveralls:coveralls-maven-plugin:4.3.0:report
(default-cli) on project beam-parent: I/O operation failed: No source found for org/apache/beam/examples/Snippets.java
-> [Help 2]
2017-10-25T18:50:45.981 [ERROR] 
2017-10-25T18:50:45.981 [ERROR] To see the full stack trace of the errors, re-run Maven with
the -e switch.
2017-10-25T18:50:45.981 [ERROR] Re-run Maven using the -X switch to enable full debug logging.
2017-10-25T18:50:45.981 [ERROR] 
2017-10-25T18:50:45.981 [ERROR] For more information about the errors and possible solutions,
please read the following articles:
2017-10-25T18:50:45.982 [ERROR] [Help 1] http://cwiki.apache.org/confluence/display/MAVEN/MojoExecutionException
2017-10-25T18:50:45.982 [ERROR] [Help 2] http://cwiki.apache.org/confluence/display/MAVEN/MojoFailureException
2017-10-25T18:50:45.982 [ERROR] 
2017-10-25T18:50:45.982 [ERROR] After correcting the problems, you can resume the build with
the command
2017-10-25T18:50:45.982 [ERROR]   mvn <goals> -rf :beam-runners-flink_2.10

channel stopped
Not sending mail to unregistered user valentyn@google.com
Not sending mail to unregistered user ekirpichov@gmail.com
Not sending mail to unregistered user github@nakomis.com
Not sending mail to unregistered user klk@google.com

Mime
View raw message