beam-commits mailing list archives

Site index · List index
Message view « Date » · « Thread »
Top « Date » · « Thread »
From Apache Jenkins Server <jenk...@builds.apache.org>
Subject Build failed in Jenkins: beam_PostCommit_Java_MavenInstall #5121
Date Sat, 28 Oct 2017 00:20:09 GMT
See <https://builds.apache.org/job/beam_PostCommit_Java_MavenInstall/5121/display/redirect?page=changes>

Changes:

[ekirpichov] Reading spanner schema transform

------------------------------------------
[...truncated 1.35 MB...]
2017-10-28T00:18:50.905 [INFO] Excluding junit:junit:jar:4.12 from the shaded jar.
2017-10-28T00:18:50.905 [INFO] Excluding org.apache.spark:spark-core_2.10:jar:1.6.3 from the
shaded jar.
2017-10-28T00:18:50.905 [INFO] Excluding org.apache.avro:avro-mapred:jar:hadoop2:1.7.7 from
the shaded jar.
2017-10-28T00:18:50.905 [INFO] Excluding org.apache.avro:avro-ipc:jar:1.7.7 from the shaded
jar.
2017-10-28T00:18:50.905 [INFO] Excluding org.apache.avro:avro-ipc:jar:tests:1.7.7 from the
shaded jar.
2017-10-28T00:18:50.905 [INFO] Excluding com.twitter:chill_2.10:jar:0.5.0 from the shaded
jar.
2017-10-28T00:18:50.905 [INFO] Excluding com.twitter:chill-java:jar:0.5.0 from the shaded
jar.
2017-10-28T00:18:50.905 [INFO] Excluding org.apache.xbean:xbean-asm5-shaded:jar:4.4 from the
shaded jar.
2017-10-28T00:18:50.905 [INFO] Excluding org.apache.hadoop:hadoop-client:jar:2.7.3 from the
shaded jar.
2017-10-28T00:18:50.905 [INFO] Excluding org.apache.hadoop:hadoop-common:jar:2.7.3 from the
shaded jar.
2017-10-28T00:18:50.905 [INFO] Excluding javax.servlet.jsp:jsp-api:jar:2.1 from the shaded
jar.
2017-10-28T00:18:50.905 [INFO] Excluding org.apache.hadoop:hadoop-auth:jar:2.7.3 from the
shaded jar.
2017-10-28T00:18:50.906 [INFO] Excluding org.apache.directory.server:apacheds-kerberos-codec:jar:2.0.0-M15
from the shaded jar.
2017-10-28T00:18:50.906 [INFO] Excluding org.apache.directory.server:apacheds-i18n:jar:2.0.0-M15
from the shaded jar.
2017-10-28T00:18:50.906 [INFO] Excluding org.apache.directory.api:api-asn1-api:jar:1.0.0-M20
from the shaded jar.
2017-10-28T00:18:50.906 [INFO] Excluding org.apache.directory.api:api-util:jar:1.0.0-M20 from
the shaded jar.
2017-10-28T00:18:50.906 [INFO] Excluding org.apache.curator:curator-client:jar:2.7.1 from
the shaded jar.
2017-10-28T00:18:50.906 [INFO] Excluding org.apache.hadoop:hadoop-mapreduce-client-app:jar:2.7.3
from the shaded jar.
2017-10-28T00:18:50.906 [INFO] Excluding org.apache.hadoop:hadoop-mapreduce-client-common:jar:2.7.3
from the shaded jar.
2017-10-28T00:18:50.906 [INFO] Excluding org.apache.hadoop:hadoop-yarn-server-common:jar:2.7.3
from the shaded jar.
2017-10-28T00:18:50.906 [INFO] Excluding org.apache.hadoop:hadoop-mapreduce-client-shuffle:jar:2.7.3
from the shaded jar.
2017-10-28T00:18:50.906 [INFO] Excluding org.apache.hadoop:hadoop-yarn-api:jar:2.7.3 from
the shaded jar.
2017-10-28T00:18:50.914 [INFO] Excluding org.apache.hadoop:hadoop-mapreduce-client-core:jar:2.7.3
from the shaded jar.
2017-10-28T00:18:50.914 [INFO] Excluding org.apache.hadoop:hadoop-mapreduce-client-jobclient:jar:2.7.3
from the shaded jar.
2017-10-28T00:18:50.914 [INFO] Excluding org.apache.hadoop:hadoop-annotations:jar:2.7.3 from
the shaded jar.
2017-10-28T00:18:50.915 [INFO] Excluding org.apache.spark:spark-launcher_2.10:jar:1.6.3 from
the shaded jar.
2017-10-28T00:18:50.915 [INFO] Excluding org.apache.spark:spark-network-common_2.10:jar:1.6.3
from the shaded jar.
2017-10-28T00:18:50.915 [INFO] Excluding org.apache.spark:spark-network-shuffle_2.10:jar:1.6.3
from the shaded jar.
2017-10-28T00:18:50.915 [INFO] Excluding org.fusesource.leveldbjni:leveldbjni-all:jar:1.8
from the shaded jar.
2017-10-28T00:18:50.915 [INFO] Excluding org.apache.spark:spark-unsafe_2.10:jar:1.6.3 from
the shaded jar.
2017-10-28T00:18:50.915 [INFO] Excluding net.java.dev.jets3t:jets3t:jar:0.7.1 from the shaded
jar.
2017-10-28T00:18:50.915 [INFO] Excluding commons-httpclient:commons-httpclient:jar:3.1 from
the shaded jar.
2017-10-28T00:18:50.915 [INFO] Excluding org.apache.curator:curator-recipes:jar:2.4.0 from
the shaded jar.
2017-10-28T00:18:50.915 [INFO] Excluding org.apache.curator:curator-framework:jar:2.4.0 from
the shaded jar.
2017-10-28T00:18:50.915 [INFO] Excluding org.eclipse.jetty.orbit:javax.servlet:jar:3.0.0.v201112011016
from the shaded jar.
2017-10-28T00:18:50.915 [INFO] Excluding org.apache.commons:commons-math3:jar:3.4.1 from the
shaded jar.
2017-10-28T00:18:50.915 [INFO] Excluding org.slf4j:jul-to-slf4j:jar:1.7.10 from the shaded
jar.
2017-10-28T00:18:50.915 [INFO] Excluding org.slf4j:jcl-over-slf4j:jar:1.7.10 from the shaded
jar.
2017-10-28T00:18:50.916 [INFO] Excluding log4j:log4j:jar:1.2.17 from the shaded jar.
2017-10-28T00:18:50.916 [INFO] Excluding org.slf4j:slf4j-log4j12:jar:1.7.10 from the shaded
jar.
2017-10-28T00:18:50.916 [INFO] Excluding com.ning:compress-lzf:jar:1.0.3 from the shaded jar.
2017-10-28T00:18:50.916 [INFO] Excluding net.jpountz.lz4:lz4:jar:1.3.0 from the shaded jar.
2017-10-28T00:18:50.916 [INFO] Excluding org.roaringbitmap:RoaringBitmap:jar:0.5.11 from the
shaded jar.
2017-10-28T00:18:50.916 [INFO] Excluding commons-net:commons-net:jar:2.2 from the shaded jar.
2017-10-28T00:18:50.916 [INFO] Excluding com.typesafe.akka:akka-remote_2.10:jar:2.3.11 from
the shaded jar.
2017-10-28T00:18:50.916 [INFO] Excluding com.typesafe.akka:akka-actor_2.10:jar:2.3.11 from
the shaded jar.
2017-10-28T00:18:50.916 [INFO] Excluding org.uncommons.maths:uncommons-maths:jar:1.2.2a from
the shaded jar.
2017-10-28T00:18:50.916 [INFO] Excluding com.typesafe.akka:akka-slf4j_2.10:jar:2.3.11 from
the shaded jar.
2017-10-28T00:18:50.916 [INFO] Excluding org.scala-lang:scala-library:jar:2.10.5 from the
shaded jar.
2017-10-28T00:18:50.916 [INFO] Excluding org.json4s:json4s-jackson_2.10:jar:3.2.10 from the
shaded jar.
2017-10-28T00:18:50.916 [INFO] Excluding org.json4s:json4s-core_2.10:jar:3.2.10 from the shaded
jar.
2017-10-28T00:18:50.916 [INFO] Excluding org.json4s:json4s-ast_2.10:jar:3.2.10 from the shaded
jar.
2017-10-28T00:18:50.917 [INFO] Excluding org.scala-lang:scalap:jar:2.10.0 from the shaded
jar.
2017-10-28T00:18:50.917 [INFO] Excluding org.scala-lang:scala-compiler:jar:2.10.0 from the
shaded jar.
2017-10-28T00:18:50.917 [INFO] Excluding com.sun.jersey:jersey-server:jar:1.9 from the shaded
jar.
2017-10-28T00:18:50.917 [INFO] Excluding asm:asm:jar:3.1 from the shaded jar.
2017-10-28T00:18:50.917 [INFO] Excluding com.sun.jersey:jersey-core:jar:1.9 from the shaded
jar.
2017-10-28T00:18:50.917 [INFO] Excluding org.apache.mesos:mesos:jar:shaded-protobuf:0.21.1
from the shaded jar.
2017-10-28T00:18:50.917 [INFO] Excluding io.netty:netty-all:jar:4.0.29.Final from the shaded
jar.
2017-10-28T00:18:50.917 [INFO] Excluding com.clearspring.analytics:stream:jar:2.7.0 from the
shaded jar.
2017-10-28T00:18:50.917 [INFO] Excluding io.dropwizard.metrics:metrics-jvm:jar:3.1.2 from
the shaded jar.
2017-10-28T00:18:50.917 [INFO] Excluding io.dropwizard.metrics:metrics-json:jar:3.1.2 from
the shaded jar.
2017-10-28T00:18:50.917 [INFO] Excluding io.dropwizard.metrics:metrics-graphite:jar:3.1.2
from the shaded jar.
2017-10-28T00:18:50.917 [INFO] Excluding com.fasterxml.jackson.module:jackson-module-scala_2.10:jar:2.8.9
from the shaded jar.
2017-10-28T00:18:50.917 [INFO] Excluding com.fasterxml.jackson.module:jackson-module-paranamer:jar:2.8.9
from the shaded jar.
2017-10-28T00:18:50.918 [INFO] Excluding org.apache.ivy:ivy:jar:2.4.0 from the shaded jar.
2017-10-28T00:18:50.918 [INFO] Excluding oro:oro:jar:2.0.8 from the shaded jar.
2017-10-28T00:18:50.918 [INFO] Excluding org.tachyonproject:tachyon-client:jar:0.8.2 from
the shaded jar.
2017-10-28T00:18:50.918 [INFO] Excluding org.tachyonproject:tachyon-underfs-hdfs:jar:0.8.2
from the shaded jar.
2017-10-28T00:18:50.918 [INFO] Excluding org.tachyonproject:tachyon-underfs-s3:jar:0.8.2 from
the shaded jar.
2017-10-28T00:18:50.918 [INFO] Excluding org.tachyonproject:tachyon-underfs-local:jar:0.8.2
from the shaded jar.
2017-10-28T00:18:50.918 [INFO] Excluding net.razorvine:pyrolite:jar:4.9 from the shaded jar.
2017-10-28T00:18:50.918 [INFO] Excluding net.sf.py4j:py4j:jar:0.9 from the shaded jar.
2017-10-28T00:18:50.918 [INFO] Excluding org.spark-project.spark:unused:jar:1.0.0 from the
shaded jar.
2017-10-28T00:18:50.918 [INFO] Excluding org.apache.spark:spark-streaming_2.10:jar:1.6.3 from
the shaded jar.
2017-10-28T00:18:54.035 [INFO] Replacing original artifact with shaded artifact.
2017-10-28T00:18:54.142 [INFO] 
2017-10-28T00:18:54.142 [INFO] --- maven-javadoc-plugin:3.0.0-M1:jar (attach-javadocs) @ beam-sdks-java-javadoc
---
2017-10-28T00:18:54.146 [INFO] Not executing Javadoc as the project is not a Java classpath-capable
package
2017-10-28T00:18:54.347 [INFO] 
2017-10-28T00:18:54.347 [INFO] --- maven-source-plugin:3.0.1:jar-no-fork (attach-sources)
@ beam-sdks-java-javadoc ---
2017-10-28T00:18:54.454 [INFO] 
2017-10-28T00:18:54.454 [INFO] --- maven-source-plugin:3.0.1:test-jar-no-fork (attach-test-sources)
@ beam-sdks-java-javadoc ---
2017-10-28T00:18:54.562 [INFO] 
2017-10-28T00:18:54.562 [INFO] --- reproducible-build-maven-plugin:0.3:strip-jar (default)
@ beam-sdks-java-javadoc ---
2017-10-28T00:18:54.562 [INFO] Stripping <https://builds.apache.org/job/beam_PostCommit_Java_MavenInstall/ws/src/sdks/java/javadoc/target/javadoc.jar>
2017-10-28T00:18:54.742 [INFO] 
2017-10-28T00:18:54.742 [INFO] --- maven-dependency-plugin:3.0.1:analyze-only (default) @
beam-sdks-java-javadoc ---
2017-10-28T00:18:54.743 [INFO] Skipping plugin execution
2017-10-28T00:18:54.850 [INFO] 
2017-10-28T00:18:54.850 [INFO] --- maven-install-plugin:2.5.2:install (default-install) @
beam-sdks-java-javadoc ---
2017-10-28T00:18:54.851 [INFO] Installing <https://builds.apache.org/job/beam_PostCommit_Java_MavenInstall/ws/src/sdks/java/javadoc/pom.xml>
to <https://builds.apache.org/job/beam_PostCommit_Java_MavenInstall/ws/.repository/org/apache/beam/beam-sdks-java-javadoc/2.3.0-SNAPSHOT/beam-sdks-java-javadoc-2.3.0-SNAPSHOT.pom>
2017-10-28T00:18:54.853 [INFO] Installing <https://builds.apache.org/job/beam_PostCommit_Java_MavenInstall/ws/src/sdks/java/javadoc/target/javadoc.jar>
to <https://builds.apache.org/job/beam_PostCommit_Java_MavenInstall/ws/.repository/org/apache/beam/beam-sdks-java-javadoc/2.3.0-SNAPSHOT/beam-sdks-java-javadoc-2.3.0-SNAPSHOT.jar>
[JENKINS] Archiving disabled
2017-10-28T00:18:56.171 [INFO]                                                           
             
2017-10-28T00:18:56.172 [INFO] ------------------------------------------------------------------------
2017-10-28T00:18:56.172 [INFO] Building Apache Beam :: Parent 2.3.0-SNAPSHOT
2017-10-28T00:18:56.172 [INFO] ------------------------------------------------------------------------
2017-10-28T00:18:56.173 [WARNING] The POM for org.eclipse.m2e:lifecycle-mapping:jar:1.0.0
is missing, no dependency information available
2017-10-28T00:18:56.174 [WARNING] Failed to retrieve plugin descriptor for org.eclipse.m2e:lifecycle-mapping:1.0.0:
Plugin org.eclipse.m2e:lifecycle-mapping:1.0.0 or one of its dependencies could not be resolved:
Failure to find org.eclipse.m2e:lifecycle-mapping:jar:1.0.0 in https://repo.maven.apache.org/maven2
was cached in the local repository, resolution will not be reattempted until the update interval
of central has elapsed or updates are forced
2017-10-28T00:18:56.175 [INFO] 
2017-10-28T00:18:56.175 [INFO] --- coveralls-maven-plugin:4.3.0:report (default-cli) @ beam-parent
---
2017-10-28T00:18:57.079 [INFO] Starting Coveralls job for jenkins (5121 / https://builds.apache.org/job/beam_PostCommit_Java_MavenInstall/5121/)
2017-10-28T00:18:57.082 [INFO] Using repository token <secret>
2017-10-28T00:18:57.082 [INFO] Git commit e686286 in master
2017-10-28T00:18:57.083 [INFO] Writing Coveralls data to <https://builds.apache.org/job/beam_PostCommit_Java_MavenInstall/ws/src/target/coveralls.json...>
2017-10-28T00:18:57.241 [INFO] Processing coverage report from <https://builds.apache.org/job/beam_PostCommit_Java_MavenInstall/ws/src/sdks/java/core/target/site/jacoco/jacoco.xml>
2017-10-28T00:18:57.801 [INFO] Processing coverage report from <https://builds.apache.org/job/beam_PostCommit_Java_MavenInstall/ws/src/sdks/java/extensions/google-cloud-platform-core/target/site/jacoco/jacoco.xml>
2017-10-28T00:18:57.831 [INFO] Processing coverage report from <https://builds.apache.org/job/beam_PostCommit_Java_MavenInstall/ws/src/sdks/java/extensions/protobuf/target/site/jacoco/jacoco.xml>
2017-10-28T00:18:57.837 [INFO] Processing coverage report from <https://builds.apache.org/job/beam_PostCommit_Java_MavenInstall/ws/src/sdks/java/java8tests/target/site/jacoco/jacoco.xml>
2017-10-28T00:18:57.838 [INFO] Processing coverage report from <https://builds.apache.org/job/beam_PostCommit_Java_MavenInstall/ws/src/runners/core-java/target/site/jacoco/jacoco.xml>
2017-10-28T00:18:58.106 [INFO] Processing coverage report from <https://builds.apache.org/job/beam_PostCommit_Java_MavenInstall/ws/src/runners/direct-java/target/site/jacoco/jacoco.xml>
2017-10-28T00:18:58.295 [INFO] Processing coverage report from <https://builds.apache.org/job/beam_PostCommit_Java_MavenInstall/ws/src/runners/google-cloud-dataflow-java/target/site/jacoco/jacoco.xml>
2017-10-28T00:18:58.505 [INFO] Processing coverage report from <https://builds.apache.org/job/beam_PostCommit_Java_MavenInstall/ws/src/examples/java/target/site/jacoco/jacoco.xml>
2017-10-28T00:18:58.582 [INFO] Processing coverage report from <https://builds.apache.org/job/beam_PostCommit_Java_MavenInstall/ws/src/examples/java8/target/site/jacoco/jacoco.xml>
[JENKINS] Archiving disabled
[JENKINS] Archiving disabled
[JENKINS] Archiving disabled
[JENKINS] Archiving disabled
[JENKINS] Archiving disabled
[JENKINS] Archiving disabled
[JENKINS] Archiving disabled
[JENKINS] Archiving disabled
[JENKINS] Archiving disabled
[JENKINS] Archiving disabled
[JENKINS] Archiving disabled
[JENKINS] Archiving disabled
[JENKINS] Archiving disabled
[JENKINS] Archiving disabled
[JENKINS] Archiving disabled
[JENKINS] Archiving disabled
[JENKINS] Archiving disabled
[JENKINS] Archiving disabled
[JENKINS] Archiving disabled
[JENKINS] Archiving disabled
[JENKINS] Archiving disabled
[JENKINS] Archiving disabled
[JENKINS] Archiving disabled
[JENKINS] Archiving disabled
[JENKINS] Archiving disabled
[JENKINS] Archiving disabled
[JENKINS] Archiving disabled
[JENKINS] Archiving disabled
[JENKINS] Archiving disabled
[JENKINS] Archiving disabled
[JENKINS] Archiving disabled
[JENKINS] Archiving disabled
[JENKINS] Archiving disabled
[JENKINS] Archiving disabled
[JENKINS] Archiving disabled
[JENKINS] Archiving disabled
[JENKINS] Archiving disabled
[JENKINS] Archiving disabled
[JENKINS] Archiving disabled
[JENKINS] Archiving disabled
[JENKINS] Archiving disabled
[JENKINS] Archiving disabled
[JENKINS] Archiving disabled
[JENKINS] Archiving disabled
[JENKINS] Archiving disabled
[JENKINS] Archiving disabled
[JENKINS] Archiving disabled
[JENKINS] Archiving disabled
[JENKINS] Archiving disabled
[JENKINS] Archiving disabled
[JENKINS] Archiving disabled
[JENKINS] Archiving disabled
[JENKINS] Archiving disabled
[JENKINS] Archiving disabled
[JENKINS] Archiving disabled
[JENKINS] Archiving disabled
[JENKINS] Archiving disabled
[JENKINS] Archiving disabled
2017-10-28T00:19:54.777 [INFO] ------------------------------------------------------------------------
2017-10-28T00:19:54.777 [INFO] Reactor Summary:
2017-10-28T00:19:54.777 [INFO] 
2017-10-28T00:19:54.778 [INFO] Apache Beam :: Parent .............................. FAILURE
[  2.787 s]
2017-10-28T00:19:54.778 [INFO] Apache Beam :: SDKs :: Java :: Build Tools ......... SUCCESS
[ 10.763 s]
2017-10-28T00:19:54.778 [INFO] Apache Beam :: Model ............................... SUCCESS
[  2.279 s]
2017-10-28T00:19:54.778 [INFO] Apache Beam :: Model :: Pipeline ................... SUCCESS
[01:12 min]
2017-10-28T00:19:54.778 [INFO] Apache Beam :: Model :: Fn Execution ............... SUCCESS
[ 47.579 s]
2017-10-28T00:19:54.778 [INFO] Apache Beam :: SDKs ................................ SUCCESS
[  3.533 s]
2017-10-28T00:19:54.778 [INFO] Apache Beam :: SDKs :: Java ........................ SUCCESS
[  4.051 s]
2017-10-28T00:19:54.778 [INFO] Apache Beam :: SDKs :: Java :: Core ................ SUCCESS
[07:18 min]
2017-10-28T00:19:54.779 [INFO] Apache Beam :: Runners :: Core Construction Java ... SUCCESS
[03:00 min]
2017-10-28T00:19:54.779 [INFO] Apache Beam :: Runners :: Core Java ................ SUCCESS
[04:18 min]
2017-10-28T00:19:54.779 [INFO] Apache Beam :: Runners :: Direct Java .............. SUCCESS
[17:57 min]
2017-10-28T00:19:54.779 [INFO] Apache Beam :: SDKs :: Java :: IO :: AMQP .......... SUCCESS
[02:25 min]
2017-10-28T00:19:54.779 [INFO] Apache Beam :: SDKs :: Java :: IO :: Common ........ SUCCESS
[ 19.634 s]
2017-10-28T00:19:54.779 [INFO] Apache Beam :: SDKs :: Java :: IO :: Cassandra ..... SUCCESS
[01:35 min]
2017-10-28T00:19:54.779 [INFO] Apache Beam :: SDKs :: Java :: IO :: Elasticsearch . SUCCESS
[02:07 min]
2017-10-28T00:19:54.779 [INFO] Apache Beam :: SDKs :: Java :: IO :: Elasticsearch-Tests SUCCESS
[  7.300 s]
2017-10-28T00:19:54.779 [INFO] Apache Beam :: SDKs :: Java :: IO :: Elasticsearch-Tests ::
Common SUCCESS [  8.588 s]
2017-10-28T00:19:54.779 [INFO] Apache Beam :: SDKs :: Java :: IO :: Elasticsearch-Tests ::
2.x SUCCESS [01:25 min]
2017-10-28T00:19:54.779 [INFO] Apache Beam :: SDKs :: Java :: IO :: Elasticsearch-Tests ::
5.x SUCCESS [02:14 min]
2017-10-28T00:19:54.780 [INFO] Apache Beam :: SDKs :: Java :: Extensions :: Google Cloud Platform
Core SUCCESS [01:44 min]
2017-10-28T00:19:54.780 [INFO] Apache Beam :: SDKs :: Java :: Extensions :: Protobuf SUCCESS
[02:43 min]
2017-10-28T00:19:54.780 [INFO] Apache Beam :: SDKs :: Java :: IO :: Google Cloud Platform
SUCCESS [06:10 min]
2017-10-28T00:19:54.780 [INFO] Apache Beam :: SDKs :: Java :: IO :: Hadoop Common . SUCCESS
[01:38 min]
2017-10-28T00:19:54.780 [INFO] Apache Beam :: SDKs :: Java :: IO :: Hadoop File System SUCCESS
[02:45 min]
2017-10-28T00:19:54.780 [INFO] Apache Beam :: SDKs :: Java :: IO :: Hadoop ........ SUCCESS
[ 15.096 s]
2017-10-28T00:19:54.780 [INFO] Apache Beam :: SDKs :: Java :: IO :: Hadoop :: input-format
SUCCESS [02:26 min]
2017-10-28T00:19:54.780 [INFO] Apache Beam :: Runners :: Google Cloud Dataflow .... SUCCESS
[11:01 min]
2017-10-28T00:19:54.780 [INFO] Apache Beam :: SDKs :: Java :: IO :: Hadoop :: jdk1.8-tests
SUCCESS [05:25 min]
2017-10-28T00:19:54.780 [INFO] Apache Beam :: SDKs :: Java :: IO :: HBase ......... SUCCESS
[10:52 min]
2017-10-28T00:19:54.780 [INFO] Apache Beam :: SDKs :: Java :: IO :: HCatalog ...... SUCCESS
[05:20 min]
2017-10-28T00:19:54.780 [INFO] Apache Beam :: SDKs :: Java :: IO :: JDBC .......... SUCCESS
[03:21 min]
2017-10-28T00:19:54.781 [INFO] Apache Beam :: SDKs :: Java :: IO :: JMS ........... SUCCESS
[02:12 min]
2017-10-28T00:19:54.781 [INFO] Apache Beam :: SDKs :: Java :: IO :: Kafka ......... SUCCESS
[03:04 min]
2017-10-28T00:19:54.781 [INFO] Apache Beam :: SDKs :: Java :: IO :: Kinesis ....... SUCCESS
[01:50 min]
2017-10-28T00:19:54.781 [INFO] Apache Beam :: SDKs :: Java :: IO :: MongoDB ....... SUCCESS
[03:35 min]
2017-10-28T00:19:54.781 [INFO] Apache Beam :: SDKs :: Java :: IO :: MQTT .......... SUCCESS
[01:43 min]
2017-10-28T00:19:54.781 [INFO] Apache Beam :: SDKs :: Java :: IO :: Redis ......... SUCCESS
[01:43 min]
2017-10-28T00:19:54.781 [INFO] Apache Beam :: SDKs :: Java :: IO :: Solr .......... SUCCESS
[01:19 min]
2017-10-28T00:19:54.781 [INFO] Apache Beam :: SDKs :: Java :: IO :: Tika .......... SUCCESS
[ 48.101 s]
2017-10-28T00:19:54.781 [INFO] Apache Beam :: SDKs :: Java :: IO :: XML ........... SUCCESS
[ 59.565 s]
2017-10-28T00:19:54.781 [INFO] Apache Beam :: SDKs :: Java :: Maven Archetypes :: Starter
SUCCESS [ 17.919 s]
2017-10-28T00:19:54.781 [INFO] Apache Beam :: Examples :: Java .................... SUCCESS
[06:23 min]
2017-10-28T00:19:54.781 [INFO] Apache Beam :: SDKs :: Java :: Maven Archetypes :: Examples
SUCCESS [ 52.323 s]
2017-10-28T00:19:54.781 [INFO] Apache Beam :: Examples :: Java 8 .................. SUCCESS
[01:26 min]
2017-10-28T00:19:54.782 [INFO] Apache Beam :: SDKs :: Java :: Maven Archetypes :: Examples
- Java 8 SUCCESS [01:04 min]
2017-10-28T00:19:54.782 [INFO] Apache Beam :: SDKs :: Java :: Extensions :: Jackson SUCCESS
[ 39.098 s]
2017-10-28T00:19:54.782 [INFO] Apache Beam :: SDKs :: Java :: Extensions :: Join library SUCCESS
[ 44.054 s]
2017-10-28T00:19:54.782 [INFO] Apache Beam :: SDKs :: Java :: Extensions :: Sorter  SUCCESS
[01:14 min]
2017-10-28T00:19:54.782 [INFO] Apache Beam :: SDKs :: Java :: Extensions :: SQL ... SUCCESS
[03:00 min]
2017-10-28T00:19:54.782 [INFO] Apache Beam :: SDKs :: Java :: Nexmark ............. SUCCESS
[03:50 min]
2017-10-28T00:19:54.782 [INFO] Apache Beam :: SDKs :: Java :: Harness ............. SUCCESS
[01:26 min]
2017-10-28T00:19:54.782 [INFO] Apache Beam :: SDKs :: Java :: Java 8 Tests ........ SUCCESS
[ 37.627 s]
2017-10-28T00:19:54.782 [INFO] Apache Beam :: Runners :: Flink .................... SUCCESS
[01:33 min]
2017-10-28T00:19:54.782 [INFO] Apache Beam :: Runners :: Spark .................... SUCCESS
[04:27 min]
2017-10-28T00:19:54.782 [INFO] Apache Beam :: Runners :: Apex ..................... SUCCESS
[01:41 min]
2017-10-28T00:19:54.782 [INFO] Apache Beam :: Runners :: Gearpump ................. SUCCESS
[01:01 min]
2017-10-28T00:19:54.783 [INFO] Apache Beam :: SDKs :: Java :: Aggregated Javadoc .. SUCCESS
[01:03 min]
2017-10-28T00:19:54.783 [INFO] ------------------------------------------------------------------------
2017-10-28T00:19:54.783 [INFO] BUILD FAILURE
2017-10-28T00:19:54.783 [INFO] ------------------------------------------------------------------------
2017-10-28T00:19:54.783 [INFO] Total time: 02:30 h
2017-10-28T00:19:54.783 [INFO] Finished at: 2017-10-28T00:19:54+00:00
2017-10-28T00:19:57.798 [INFO] Final Memory: 355M/2086M
2017-10-28T00:19:57.798 [INFO] ------------------------------------------------------------------------
2017-10-28T00:19:57.814 [ERROR] Failed to execute goal org.eluder.coveralls:coveralls-maven-plugin:4.3.0:report
(default-cli) on project beam-parent: I/O operation failed: No source found for org/apache/beam/examples/Snippets.java
-> [Help 1]
2017-10-28T00:19:57.814 [ERROR] 
2017-10-28T00:19:57.815 [ERROR] To see the full stack trace of the errors, re-run Maven with
the -e switch.
2017-10-28T00:19:57.815 [ERROR] Re-run Maven using the -X switch to enable full debug logging.
2017-10-28T00:19:57.815 [ERROR] 
2017-10-28T00:19:57.815 [ERROR] For more information about the errors and possible solutions,
please read the following articles:
2017-10-28T00:19:57.815 [ERROR] [Help 1] http://cwiki.apache.org/confluence/display/MAVEN/MojoFailureException
channel stopped
Not sending mail to unregistered user ekirpichov@gmail.com

Mime
View raw message