beam-commits mailing list archives

Site index · List index
Message view « Date » · « Thread »
Top « Date » · « Thread »
From Apache Jenkins Server <jenk...@builds.apache.org>
Subject Build failed in Jenkins: beam_PostCommit_Java_ValidatesRunner_Flink #4025
Date Sun, 08 Oct 2017 18:02:35 GMT
See <https://builds.apache.org/job/beam_PostCommit_Java_ValidatesRunner_Flink/4025/display/redirect>

------------------------------------------
[...truncated 229.86 KB...]
2017-10-08T18:02:18.181 [INFO] Downloaded: https://repo.maven.apache.org/maven2/io/takari/takari/14/takari-14.pom
(14 KB at 482.3 KB/sec)
2017-10-08T18:02:18.185 [INFO] Downloading: https://repo.maven.apache.org/maven2/net/revelc/code/formatter/formatter-maven-plugin/2.0.1/formatter-maven-plugin-2.0.1.jar
2017-10-08T18:02:18.214 [INFO] Downloaded: https://repo.maven.apache.org/maven2/net/revelc/code/formatter/formatter-maven-plugin/2.0.1/formatter-maven-plugin-2.0.1.jar
(32 KB at 1092.3 KB/sec)
2017-10-08T18:02:18.219 [INFO] Downloading: https://repo.maven.apache.org/maven2/org/apache/maven/plugins/maven-checkstyle-plugin/2.17/maven-checkstyle-plugin-2.17.pom
2017-10-08T18:02:18.248 [INFO] Downloaded: https://repo.maven.apache.org/maven2/org/apache/maven/plugins/maven-checkstyle-plugin/2.17/maven-checkstyle-plugin-2.17.pom
(14 KB at 449.5 KB/sec)
2017-10-08T18:02:18.253 [INFO] Downloading: https://repo.maven.apache.org/maven2/org/apache/maven/plugins/maven-checkstyle-plugin/2.17/maven-checkstyle-plugin-2.17.jar
2017-10-08T18:02:18.295 [INFO] Downloaded: https://repo.maven.apache.org/maven2/org/apache/maven/plugins/maven-checkstyle-plugin/2.17/maven-checkstyle-plugin-2.17.jar
(107 KB at 2586.1 KB/sec)
2017-10-08T18:02:18.301 [INFO] Downloading: https://repo.maven.apache.org/maven2/org/apache/maven/plugins/maven-surefire-plugin/2.20/maven-surefire-plugin-2.20.pom
2017-10-08T18:02:18.328 [INFO] Downloaded: https://repo.maven.apache.org/maven2/org/apache/maven/plugins/maven-surefire-plugin/2.20/maven-surefire-plugin-2.20.pom
(7 KB at 234.3 KB/sec)
2017-10-08T18:02:18.330 [INFO] Downloading: https://repo.maven.apache.org/maven2/org/apache/maven/surefire/surefire/2.20/surefire-2.20.pom
2017-10-08T18:02:18.360 [INFO] Downloaded: https://repo.maven.apache.org/maven2/org/apache/maven/surefire/surefire/2.20/surefire-2.20.pom
(21 KB at 677.1 KB/sec)
2017-10-08T18:02:18.365 [INFO] Downloading: https://repo.maven.apache.org/maven2/org/apache/maven/plugins/maven-surefire-plugin/2.20/maven-surefire-plugin-2.20.jar
2017-10-08T18:02:18.399 [INFO] Downloaded: https://repo.maven.apache.org/maven2/org/apache/maven/plugins/maven-surefire-plugin/2.20/maven-surefire-plugin-2.20.jar
(52 KB at 1528.7 KB/sec)
2017-10-08T18:02:18.408 [INFO] 
2017-10-08T18:02:18.408 [INFO] --- maven-clean-plugin:3.0.0:clean (default-clean) @ beam-sdks-java-build-tools
---
2017-10-08T18:02:18.411 [INFO] Deleting <https://builds.apache.org/job/beam_PostCommit_Java_ValidatesRunner_Flink/ws/sdks/java/build-tools>
(includes = [**/*.pyc, **/*.egg-info/, **/sdks/python/LICENSE, **/sdks/python/NOTICE, **/sdks/python/README.md],
excludes = [])
2017-10-08T18:02:18.521 [INFO] 
2017-10-08T18:02:18.521 [INFO] --- maven-enforcer-plugin:3.0.0-M1:enforce (enforce) @ beam-sdks-java-build-tools
---
2017-10-08T18:02:18.634 [INFO] 
2017-10-08T18:02:18.635 [INFO] --- maven-enforcer-plugin:3.0.0-M1:enforce (enforce-banned-dependencies)
@ beam-sdks-java-build-tools ---
2017-10-08T18:02:18.745 [INFO] 
2017-10-08T18:02:18.745 [INFO] --- maven-remote-resources-plugin:1.5:process (process-resource-bundles)
@ beam-sdks-java-build-tools ---
2017-10-08T18:02:18.870 [INFO] 
2017-10-08T18:02:18.871 [INFO] --- maven-resources-plugin:3.0.2:resources (default-resources)
@ beam-sdks-java-build-tools ---
2017-10-08T18:02:18.873 [INFO] Using 'UTF-8' encoding to copy filtered resources.
2017-10-08T18:02:18.874 [INFO] Copying 11 resources
2017-10-08T18:02:18.878 [INFO] Copying 3 resources
2017-10-08T18:02:18.986 [INFO] 
2017-10-08T18:02:18.986 [INFO] --- maven-compiler-plugin:3.6.2:compile (default-compile) @
beam-sdks-java-build-tools ---
2017-10-08T18:02:18.992 [INFO] Downloading: https://repo.maven.apache.org/maven2/org/apache/maven/shared/maven-shared-incremental/1.1/maven-shared-incremental-1.1.pom
2017-10-08T18:02:19.020 [INFO] Downloaded: https://repo.maven.apache.org/maven2/org/apache/maven/shared/maven-shared-incremental/1.1/maven-shared-incremental-1.1.pom
(5 KB at 165.4 KB/sec)
2017-10-08T18:02:19.024 [INFO] Downloading: https://repo.maven.apache.org/maven2/org/apache/maven/shared/maven-shared-utils/0.1/maven-shared-utils-0.1.pom
2017-10-08T18:02:19.051 [INFO] Downloaded: https://repo.maven.apache.org/maven2/org/apache/maven/shared/maven-shared-utils/0.1/maven-shared-utils-0.1.pom
(4 KB at 146.4 KB/sec)
2017-10-08T18:02:19.055 [INFO] Downloading: https://repo.maven.apache.org/maven2/org/ow2/asm/asm/6.0_ALPHA/asm-6.0_ALPHA.pom
2017-10-08T18:02:19.081 [INFO] Downloaded: https://repo.maven.apache.org/maven2/org/ow2/asm/asm/6.0_ALPHA/asm-6.0_ALPHA.pom
(2 KB at 72.8 KB/sec)
2017-10-08T18:02:19.083 [INFO] Downloading: https://repo.maven.apache.org/maven2/org/ow2/asm/asm-parent/6.0_ALPHA/asm-parent-6.0_ALPHA.pom
2017-10-08T18:02:19.110 [INFO] Downloaded: https://repo.maven.apache.org/maven2/org/ow2/asm/asm-parent/6.0_ALPHA/asm-parent-6.0_ALPHA.pom
(6 KB at 206.5 KB/sec)
2017-10-08T18:02:19.113 [INFO] Downloading: https://repo.maven.apache.org/maven2/com/thoughtworks/qdox/qdox/2.0-M6/qdox-2.0-M6.pom
2017-10-08T18:02:19.141 [INFO] Downloaded: https://repo.maven.apache.org/maven2/com/thoughtworks/qdox/qdox/2.0-M6/qdox-2.0-M6.pom
(16 KB at 563.8 KB/sec)
2017-10-08T18:02:19.145 [INFO] Downloading: https://repo.maven.apache.org/maven2/org/codehaus/plexus/plexus-compiler-api/2.8.2/plexus-compiler-api-2.8.2.pom
2017-10-08T18:02:19.170 [INFO] Downloaded: https://repo.maven.apache.org/maven2/org/codehaus/plexus/plexus-compiler-api/2.8.2/plexus-compiler-api-2.8.2.pom
(867 B at 33.9 KB/sec)
2017-10-08T18:02:19.172 [INFO] Downloading: https://repo.maven.apache.org/maven2/org/codehaus/plexus/plexus-compiler/2.8.2/plexus-compiler-2.8.2.pom
2017-10-08T18:02:19.199 [INFO] Downloaded: https://repo.maven.apache.org/maven2/org/codehaus/plexus/plexus-compiler/2.8.2/plexus-compiler-2.8.2.pom
(5 KB at 176.6 KB/sec)
2017-10-08T18:02:19.203 [INFO] Downloading: https://repo.maven.apache.org/maven2/org/codehaus/plexus/plexus-compiler-manager/2.8.2/plexus-compiler-manager-2.8.2.pom
2017-10-08T18:02:19.229 [INFO] Downloaded: https://repo.maven.apache.org/maven2/org/codehaus/plexus/plexus-compiler-manager/2.8.2/plexus-compiler-manager-2.8.2.pom
(692 B at 26.0 KB/sec)
2017-10-08T18:02:19.232 [INFO] Downloading: https://repo.maven.apache.org/maven2/org/codehaus/plexus/plexus-compiler-javac/2.8.2/plexus-compiler-javac-2.8.2.pom
2017-10-08T18:02:19.259 [INFO] Downloaded: https://repo.maven.apache.org/maven2/org/codehaus/plexus/plexus-compiler-javac/2.8.2/plexus-compiler-javac-2.8.2.pom
(771 B at 27.9 KB/sec)
2017-10-08T18:02:19.261 [INFO] Downloading: https://repo.maven.apache.org/maven2/org/codehaus/plexus/plexus-compilers/2.8.2/plexus-compilers-2.8.2.pom
2017-10-08T18:02:19.287 [INFO] Downloaded: https://repo.maven.apache.org/maven2/org/codehaus/plexus/plexus-compilers/2.8.2/plexus-compilers-2.8.2.pom
(2 KB at 50.4 KB/sec)
2017-10-08T18:02:19.294 [INFO] Downloading: https://repo.maven.apache.org/maven2/org/apache/maven/shared/maven-shared-incremental/1.1/maven-shared-incremental-1.1.jar
2017-10-08T18:02:19.295 [INFO] Downloading: https://repo.maven.apache.org/maven2/org/ow2/asm/asm/6.0_ALPHA/asm-6.0_ALPHA.jar
2017-10-08T18:02:19.295 [INFO] Downloading: https://repo.maven.apache.org/maven2/com/thoughtworks/qdox/qdox/2.0-M6/qdox-2.0-M6.jar
2017-10-08T18:02:19.295 [INFO] Downloading: https://repo.maven.apache.org/maven2/org/codehaus/plexus/plexus-compiler-api/2.8.2/plexus-compiler-api-2.8.2.jar
2017-10-08T18:02:19.297 [INFO] Downloading: https://repo.maven.apache.org/maven2/org/codehaus/plexus/plexus-compiler-manager/2.8.2/plexus-compiler-manager-2.8.2.jar
[INFO] I/O exception (java.net.SocketException) caught when processing request to {s}->https://repo.maven.apache.org:443:
Connection reset
[INFO] Retrying request to {s}->https://repo.maven.apache.org:443
[INFO] I/O exception (java.net.SocketException) caught when processing request to {s}->https://repo.maven.apache.org:443:
Connection reset
[INFO] I/O exception (java.net.SocketException) caught when processing request to {s}->https://repo.maven.apache.org:443:
Connection reset
[INFO] Retrying request to {s}->https://repo.maven.apache.org:443
[INFO] Retrying request to {s}->https://repo.maven.apache.org:443
2017-10-08T18:02:19.343 [INFO] Downloaded: https://repo.maven.apache.org/maven2/org/ow2/asm/asm/6.0_ALPHA/asm-6.0_ALPHA.jar
(55 KB at 1112.5 KB/sec)
2017-10-08T18:02:19.343 [INFO] Downloading: https://repo.maven.apache.org/maven2/org/codehaus/plexus/plexus-compiler-javac/2.8.2/plexus-compiler-javac-2.8.2.jar
2017-10-08T18:02:19.372 [INFO] Downloaded: https://repo.maven.apache.org/maven2/org/codehaus/plexus/plexus-compiler-javac/2.8.2/plexus-compiler-javac-2.8.2.jar
(20 KB at 257.9 KB/sec)
2017-10-08T18:02:19.380 [INFO] Downloaded: https://repo.maven.apache.org/maven2/com/thoughtworks/qdox/qdox/2.0-M6/qdox-2.0-M6.jar
(307 KB at 3562.6 KB/sec)
2017-10-08T18:02:19.430 [INFO] Downloaded: https://repo.maven.apache.org/maven2/org/codehaus/plexus/plexus-compiler-manager/2.8.2/plexus-compiler-manager-2.8.2.jar
(5 KB at 33.9 KB/sec)
2017-10-08T18:02:19.442 [INFO] Downloaded: https://repo.maven.apache.org/maven2/org/codehaus/plexus/plexus-compiler-api/2.8.2/plexus-compiler-api-2.8.2.jar
(26 KB at 176.5 KB/sec)
2017-10-08T18:02:19.446 [INFO] Downloaded: https://repo.maven.apache.org/maven2/org/apache/maven/shared/maven-shared-incremental/1.1/maven-shared-incremental-1.1.jar
(14 KB at 87.0 KB/sec)
2017-10-08T18:02:19.613 [INFO] No sources to compile
2017-10-08T18:02:19.802 [INFO] 
2017-10-08T18:02:19.803 [INFO] --- formatter-maven-plugin:2.0.1:format (test-code-style) @
beam-sdks-java-build-tools ---
2017-10-08T18:02:19.807 [INFO] Downloading: https://repo.maven.apache.org/maven2/com/google/guava/guava/20.0/guava-20.0.pom
2017-10-08T18:02:19.837 [INFO] Downloaded: https://repo.maven.apache.org/maven2/com/google/guava/guava/20.0/guava-20.0.pom
(7 KB at 222.5 KB/sec)
2017-10-08T18:02:19.839 [INFO] Downloading: https://repo.maven.apache.org/maven2/com/google/guava/guava-parent/20.0/guava-parent-20.0.pom
2017-10-08T18:02:19.867 [INFO] Downloaded: https://repo.maven.apache.org/maven2/com/google/guava/guava-parent/20.0/guava-parent-20.0.pom
(10 KB at 345.1 KB/sec)
2017-10-08T18:02:19.870 [INFO] Downloading: https://repo.maven.apache.org/maven2/net/revelc/code/formatter/jdt-core/2.0.1/jdt-core-2.0.1.pom
2017-10-08T18:02:19.897 [INFO] Downloaded: https://repo.maven.apache.org/maven2/net/revelc/code/formatter/jdt-core/2.0.1/jdt-core-2.0.1.pom
(2 KB at 45.1 KB/sec)
2017-10-08T18:02:19.899 [INFO] Downloading: https://repo.maven.apache.org/maven2/net/revelc/code/formatter/formatters/2.0.1/formatters-2.0.1.pom
2017-10-08T18:02:19.927 [INFO] Downloaded: https://repo.maven.apache.org/maven2/net/revelc/code/formatter/formatters/2.0.1/formatters-2.0.1.pom
(4 KB at 138.1 KB/sec)
2017-10-08T18:02:19.931 [INFO] Downloading: https://repo.maven.apache.org/maven2/net/revelc/code/formatter/jsdt-core/2.0.1/jsdt-core-2.0.1.pom
2017-10-08T18:02:19.957 [INFO] Downloaded: https://repo.maven.apache.org/maven2/net/revelc/code/formatter/jsdt-core/2.0.1/jsdt-core-2.0.1.pom
(2 KB at 46.8 KB/sec)
2017-10-08T18:02:19.965 [INFO] Downloading: https://repo.maven.apache.org/maven2/org/apache/commons/commons-digester3/3.2/commons-digester3-3.2.pom
2017-10-08T18:02:19.996 [INFO] Downloaded: https://repo.maven.apache.org/maven2/org/apache/commons/commons-digester3/3.2/commons-digester3-3.2.pom
(18 KB at 554.1 KB/sec)
2017-10-08T18:02:20.002 [INFO] Downloading: https://repo.maven.apache.org/maven2/cglib/cglib/2.2.2/cglib-2.2.2.pom
2017-10-08T18:02:20.029 [INFO] Downloaded: https://repo.maven.apache.org/maven2/cglib/cglib/2.2.2/cglib-2.2.2.pom
(2 KB at 53.3 KB/sec)
2017-10-08T18:02:20.031 [INFO] Downloading: https://repo.maven.apache.org/maven2/asm/asm/3.3.1/asm-3.3.1.pom
2017-10-08T18:02:20.057 [INFO] Downloaded: https://repo.maven.apache.org/maven2/asm/asm/3.3.1/asm-3.3.1.pom
(266 B at 10.0 KB/sec)
2017-10-08T18:02:20.059 [INFO] Downloading: https://repo.maven.apache.org/maven2/asm/asm-parent/3.3.1/asm-parent-3.3.1.pom
2017-10-08T18:02:20.086 [INFO] Downloaded: https://repo.maven.apache.org/maven2/asm/asm-parent/3.3.1/asm-parent-3.3.1.pom
(5 KB at 162.7 KB/sec)
2017-10-08T18:02:20.088 [INFO] Downloading: https://repo.maven.apache.org/maven2/commons-beanutils/commons-beanutils/1.8.3/commons-beanutils-1.8.3.pom
2017-10-08T18:02:20.116 [INFO] Downloaded: https://repo.maven.apache.org/maven2/commons-beanutils/commons-beanutils/1.8.3/commons-beanutils-1.8.3.pom
(11 KB at 390.6 KB/sec)
2017-10-08T18:02:20.118 [INFO] Downloading: https://repo.maven.apache.org/maven2/org/apache/commons/commons-parent/14/commons-parent-14.pom
2017-10-08T18:02:20.149 [INFO] Downloaded: https://repo.maven.apache.org/maven2/org/apache/commons/commons-parent/14/commons-parent-14.pom
(31 KB at 988.8 KB/sec)
2017-10-08T18:02:20.154 [INFO] Downloading: https://repo.maven.apache.org/maven2/org/apache/maven/plugin-tools/maven-plugin-annotations/3.5/maven-plugin-annotations-3.5.pom
2017-10-08T18:02:20.182 [INFO] Downloaded: https://repo.maven.apache.org/maven2/org/apache/maven/plugin-tools/maven-plugin-annotations/3.5/maven-plugin-annotations-3.5.pom
(2 KB at 58.2 KB/sec)
2017-10-08T18:02:20.184 [INFO] Downloading: https://repo.maven.apache.org/maven2/org/apache/maven/plugin-tools/maven-plugin-tools/3.5/maven-plugin-tools-3.5.pom
2017-10-08T18:02:20.212 [INFO] Downloaded: https://repo.maven.apache.org/maven2/org/apache/maven/plugin-tools/maven-plugin-tools/3.5/maven-plugin-tools-3.5.pom
(16 KB at 545.2 KB/sec)
2017-10-08T18:02:20.218 [INFO] Downloading: https://repo.maven.apache.org/maven2/org/codehaus/plexus/plexus-resources/1.0.1/plexus-resources-1.0.1.pom
2017-10-08T18:02:20.244 [INFO] Downloaded: https://repo.maven.apache.org/maven2/org/codehaus/plexus/plexus-resources/1.0.1/plexus-resources-1.0.1.pom
(2 KB at 49.5 KB/sec)
2017-10-08T18:02:20.247 [INFO] Downloading: https://repo.maven.apache.org/maven2/org/codehaus/plexus/plexus-utils/3.0.8/plexus-utils-3.0.8.pom
2017-10-08T18:02:20.275 [INFO] Downloaded: https://repo.maven.apache.org/maven2/org/codehaus/plexus/plexus-utils/3.0.8/plexus-utils-3.0.8.pom
(4 KB at 109.6 KB/sec)
2017-10-08T18:02:20.280 [INFO] Downloading: https://repo.maven.apache.org/maven2/com/google/guava/guava/20.0/guava-20.0.jar
2017-10-08T18:02:20.281 [INFO] Downloading: https://repo.maven.apache.org/maven2/net/revelc/code/formatter/jsdt-core/2.0.1/jsdt-core-2.0.1.jar
2017-10-08T18:02:20.281 [INFO] Downloading: https://repo.maven.apache.org/maven2/net/revelc/code/formatter/jdt-core/2.0.1/jdt-core-2.0.1.jar
2017-10-08T18:02:20.281 [INFO] Downloading: https://repo.maven.apache.org/maven2/cglib/cglib/2.2.2/cglib-2.2.2.jar
2017-10-08T18:02:20.281 [INFO] Downloading: https://repo.maven.apache.org/maven2/org/apache/commons/commons-digester3/3.2/commons-digester3-3.2.jar
2017-10-08T18:02:20.376 [INFO] Downloaded: https://repo.maven.apache.org/maven2/org/apache/commons/commons-digester3/3.2/commons-digester3-3.2.jar
(236 KB at 2457.8 KB/sec)
2017-10-08T18:02:20.376 [INFO] Downloading: https://repo.maven.apache.org/maven2/asm/asm/3.3.1/asm-3.3.1.jar
2017-10-08T18:02:20.407 [INFO] Downloaded: https://repo.maven.apache.org/maven2/asm/asm/3.3.1/asm-3.3.1.jar
(43 KB at 337.8 KB/sec)
2017-10-08T18:02:20.407 [INFO] Downloading: https://repo.maven.apache.org/maven2/commons-beanutils/commons-beanutils/1.8.3/commons-beanutils-1.8.3.jar
2017-10-08T18:02:20.415 [INFO] Downloaded: https://repo.maven.apache.org/maven2/cglib/cglib/2.2.2/cglib-2.2.2.jar
(281 KB at 2093.0 KB/sec)
2017-10-08T18:02:20.415 [INFO] Downloading: https://repo.maven.apache.org/maven2/org/apache/maven/plugin-tools/maven-plugin-annotations/3.5/maven-plugin-annotations-3.5.jar
2017-10-08T18:02:20.444 [INFO] Downloaded: https://repo.maven.apache.org/maven2/org/apache/maven/plugin-tools/maven-plugin-annotations/3.5/maven-plugin-annotations-3.5.jar
(14 KB at 85.7 KB/sec)
2017-10-08T18:02:20.444 [INFO] Downloading: https://repo.maven.apache.org/maven2/commons-io/commons-io/2.2/commons-io-2.2.jar
2017-10-08T18:02:20.508 [INFO] Downloaded: https://repo.maven.apache.org/maven2/commons-beanutils/commons-beanutils/1.8.3/commons-beanutils-1.8.3.jar
(227 KB at 998.2 KB/sec)
2017-10-08T18:02:20.508 [INFO] Downloading: https://repo.maven.apache.org/maven2/org/codehaus/plexus/plexus-resources/1.0.1/plexus-resources-1.0.1.jar
2017-10-08T18:02:20.523 [INFO] Downloaded: https://repo.maven.apache.org/maven2/commons-io/commons-io/2.2/commons-io-2.2.jar
(170 KB at 700.5 KB/sec)
2017-10-08T18:02:20.536 [INFO] Downloaded: https://repo.maven.apache.org/maven2/org/codehaus/plexus/plexus-resources/1.0.1/plexus-resources-1.0.1.jar
(22 KB at 83.8 KB/sec)
2017-10-08T18:02:20.706 [INFO] Downloaded: https://repo.maven.apache.org/maven2/com/google/guava/guava/20.0/guava-20.0.jar
(2386 KB at 5599.5 KB/sec)
[WARNING] Failed to getClass for net.revelc.code.formatter.FormatterMojo
[JENKINS] Archiving disabled
[JENKINS] Archiving disabled
[JENKINS] Archiving disabled
[JENKINS] Archiving disabled
[JENKINS] Archiving disabled
[JENKINS] Archiving disabled
[JENKINS] Archiving disabled
[JENKINS] Archiving disabled
[JENKINS] Archiving disabled
[JENKINS] Archiving disabled
[JENKINS] Archiving disabled
[JENKINS] Archiving disabled
[JENKINS] Archiving disabled
2017-10-08T18:02:25.941 [INFO] ------------------------------------------------------------------------
2017-10-08T18:02:25.941 [INFO] Reactor Summary:
2017-10-08T18:02:25.941 [INFO] 
2017-10-08T18:02:25.941 [INFO] Apache Beam :: Parent .............................. SUCCESS
[ 23.002 s]
2017-10-08T18:02:25.941 [INFO] Apache Beam :: SDKs :: Java :: Build Tools ......... FAILURE
[  3.150 s]
2017-10-08T18:02:25.941 [INFO] Apache Beam :: SDKs ................................ SKIPPED
2017-10-08T18:02:25.942 [INFO] Apache Beam :: SDKs :: Common ...................... SKIPPED
2017-10-08T18:02:25.942 [INFO] Apache Beam :: SDKs :: Common :: Runner API ........ SKIPPED
2017-10-08T18:02:25.942 [INFO] Apache Beam :: SDKs :: Common :: Fn API ............ SKIPPED
2017-10-08T18:02:25.942 [INFO] Apache Beam :: SDKs :: Java ........................ SKIPPED
2017-10-08T18:02:25.942 [INFO] Apache Beam :: SDKs :: Java :: Core ................ SKIPPED
2017-10-08T18:02:25.942 [INFO] Apache Beam :: Runners ............................. SKIPPED
2017-10-08T18:02:25.942 [INFO] Apache Beam :: Runners :: Core Construction Java ... SKIPPED
2017-10-08T18:02:25.942 [INFO] Apache Beam :: Runners :: Core Java ................ SKIPPED
2017-10-08T18:02:25.942 [INFO] Apache Beam :: Runners :: Flink .................... SKIPPED
2017-10-08T18:02:25.942 [INFO] ------------------------------------------------------------------------
2017-10-08T18:02:25.942 [INFO] BUILD FAILURE
2017-10-08T18:02:25.942 [INFO] ------------------------------------------------------------------------
2017-10-08T18:02:25.942 [INFO] Total time: 01:18 min
2017-10-08T18:02:25.943 [INFO] Finished at: 2017-10-08T18:02:25+00:00
2017-10-08T18:02:26.424 [INFO] Final Memory: 63M/597M
2017-10-08T18:02:26.424 [INFO] ------------------------------------------------------------------------
2017-10-08T18:02:26.424 [WARNING] The requested profile "validates-runner-tests" could not
be activated because it does not exist.
2017-10-08T18:02:26.428 [ERROR] Failed to execute goal net.revelc.code.formatter:formatter-maven-plugin:2.0.1:format
(test-code-style) on project beam-sdks-java-build-tools: Execution test-code-style of goal
net.revelc.code.formatter:formatter-maven-plugin:2.0.1:format failed: Plugin net.revelc.code.formatter:formatter-maven-plugin:2.0.1
or one of its dependencies could not be resolved: The following artifacts could not be resolved:
net.revelc.code.formatter:jdt-core:jar:2.0.1, net.revelc.code.formatter:jsdt-core:jar:2.0.1:
Could not transfer artifact net.revelc.code.formatter:jdt-core:jar:2.0.1 from/to central (https://repo.maven.apache.org/maven2):
GET request of: net/revelc/code/formatter/jdt-core/2.0.1/jdt-core-2.0.1.jar from central failed:
Connection reset -> [Help 1]
org.apache.maven.lifecycle.LifecycleExecutionException: Failed to execute goal net.revelc.code.formatter:formatter-maven-plugin:2.0.1:format
(test-code-style) on project beam-sdks-java-build-tools: Execution test-code-style of goal
net.revelc.code.formatter:formatter-maven-plugin:2.0.1:format failed: Plugin net.revelc.code.formatter:formatter-maven-plugin:2.0.1
or one of its dependencies could not be resolved: The following artifacts could not be resolved:
net.revelc.code.formatter:jdt-core:jar:2.0.1, net.revelc.code.formatter:jsdt-core:jar:2.0.1:
Could not transfer artifact net.revelc.code.formatter:jdt-core:jar:2.0.1 from/to central (https://repo.maven.apache.org/maven2):
GET request of: net/revelc/code/formatter/jdt-core/2.0.1/jdt-core-2.0.1.jar from central failed
	at org.apache.maven.lifecycle.internal.MojoExecutor.execute(MojoExecutor.java:224)
	at org.apache.maven.lifecycle.internal.MojoExecutor.execute(MojoExecutor.java:153)
	at org.apache.maven.lifecycle.internal.MojoExecutor.execute(MojoExecutor.java:145)
	at org.apache.maven.lifecycle.internal.LifecycleModuleBuilder.buildProject(LifecycleModuleBuilder.java:116)
	at org.apache.maven.lifecycle.internal.LifecycleModuleBuilder.buildProject(LifecycleModuleBuilder.java:80)
	at org.apache.maven.lifecycle.internal.builder.singlethreaded.SingleThreadedBuilder.build(SingleThreadedBuilder.java:51)
	at org.apache.maven.lifecycle.internal.LifecycleStarter.execute(LifecycleStarter.java:128)
	at org.apache.maven.DefaultMaven.doExecute(DefaultMaven.java:307)
	at org.apache.maven.DefaultMaven.doExecute(DefaultMaven.java:193)
	at org.apache.maven.DefaultMaven.execute(DefaultMaven.java:106)
	at org.jvnet.hudson.maven3.launcher.Maven33Launcher.main(Maven33Launcher.java:129)
	at sun.reflect.NativeMethodAccessorImpl.invoke0(Native Method)
	at sun.reflect.NativeMethodAccessorImpl.invoke(NativeMethodAccessorImpl.java:62)
	at sun.reflect.DelegatingMethodAccessorImpl.invoke(DelegatingMethodAccessorImpl.java:43)
	at java.lang.reflect.Method.invoke(Method.java:498)
	at org.codehaus.plexus.classworlds.launcher.Launcher.launchStandard(Launcher.java:330)
	at org.codehaus.plexus.classworlds.launcher.Launcher.launch(Launcher.java:238)
	at jenkins.maven3.agent.Maven33Main.launch(Maven33Main.java:176)
	at sun.reflect.NativeMethodAccessorImpl.invoke0(Native Method)
	at sun.reflect.NativeMethodAccessorImpl.invoke(NativeMethodAccessorImpl.java:62)
	at sun.reflect.DelegatingMethodAccessorImpl.invoke(DelegatingMethodAccessorImpl.java:43)
	at java.lang.reflect.Method.invoke(Method.java:498)
	at hudson.maven.Maven3Builder.call(Maven3Builder.java:139)
	at hudson.maven.Maven3Builder.call(Maven3Builder.java:70)
	at hudson.remoting.UserRequest.perform(UserRequest.java:181)
	at hudson.remoting.UserRequest.perform(UserRequest.java:52)
	at hudson.remoting.Request$2.run(Request.java:336)
	at hudson.remoting.InterceptingExecutorService$1.call(InterceptingExecutorService.java:68)
	at java.util.concurrent.FutureTask.run(FutureTask.java:266)
	at java.util.concurrent.ThreadPoolExecutor.runWorker(ThreadPoolExecutor.java:1149)
	at java.util.concurrent.ThreadPoolExecutor$Worker.run(ThreadPoolExecutor.java:624)
	at java.lang.Thread.run(Thread.java:748)
Caused by: org.apache.maven.plugin.PluginExecutionException: Execution test-code-style of
goal net.revelc.code.formatter:formatter-maven-plugin:2.0.1:format failed: Plugin net.revelc.code.formatter:formatter-maven-plugin:2.0.1
or one of its dependencies could not be resolved: The following artifacts could not be resolved:
net.revelc.code.formatter:jdt-core:jar:2.0.1, net.revelc.code.formatter:jsdt-core:jar:2.0.1:
Could not transfer artifact net.revelc.code.formatter:jdt-core:jar:2.0.1 from/to central (https://repo.maven.apache.org/maven2):
GET request of: net/revelc/code/formatter/jdt-core/2.0.1/jdt-core-2.0.1.jar from central failed
	at org.apache.maven.plugin.DefaultBuildPluginManager.executeMojo(DefaultBuildPluginManager.java:106)
	at org.apache.maven.lifecycle.internal.MojoExecutor.execute(MojoExecutor.java:208)
	... 31 more
Caused by: org.apache.maven.plugin.PluginResolutionException: Plugin net.revelc.code.formatter:formatter-maven-plugin:2.0.1
or one of its dependencies could not be resolved: The following artifacts could not be resolved:
net.revelc.code.formatter:jdt-core:jar:2.0.1, net.revelc.code.formatter:jsdt-core:jar:2.0.1:
Could not transfer artifact net.revelc.code.formatter:jdt-core:jar:2.0.1 from/to central (https://repo.maven.apache.org/maven2):
GET request of: net/revelc/code/formatter/jdt-core/2.0.1/jdt-core-2.0.1.jar from central failed
	at org.apache.maven.plugin.internal.DefaultPluginDependenciesResolver.resolveInternal(DefaultPluginDependenciesResolver.java:218)
	at org.apache.maven.plugin.internal.DefaultPluginDependenciesResolver.resolve(DefaultPluginDependenciesResolver.java:149)
	at org.apache.maven.plugin.internal.DefaultMavenPluginManager.createPluginRealm(DefaultMavenPluginManager.java:422)
	at org.apache.maven.plugin.internal.DefaultMavenPluginManager.setupPluginRealm(DefaultMavenPluginManager.java:385)
	at org.apache.maven.plugin.DefaultBuildPluginManager.getPluginRealm(DefaultBuildPluginManager.java:231)
	at org.apache.maven.plugin.DefaultBuildPluginManager.executeMojo(DefaultBuildPluginManager.java:102)
	... 32 more
Caused by: org.eclipse.aether.resolution.ArtifactResolutionException: The following artifacts
could not be resolved: net.revelc.code.formatter:jdt-core:jar:2.0.1, net.revelc.code.formatter:jsdt-core:jar:2.0.1:
Could not transfer artifact net.revelc.code.formatter:jdt-core:jar:2.0.1 from/to central (https://repo.maven.apache.org/maven2):
GET request of: net/revelc/code/formatter/jdt-core/2.0.1/jdt-core-2.0.1.jar from central failed
	at org.eclipse.aether.internal.impl.DefaultArtifactResolver.resolve(DefaultArtifactResolver.java:444)
	at org.eclipse.aether.internal.impl.DefaultArtifactResolver.resolveArtifacts(DefaultArtifactResolver.java:246)
	at org.eclipse.aether.internal.impl.DefaultRepositorySystem.resolveDependencies(DefaultRepositorySystem.java:367)
	at org.apache.maven.plugin.internal.DefaultPluginDependenciesResolver.resolveInternal(DefaultPluginDependenciesResolver.java:210)
	... 37 more
Caused by: org.eclipse.aether.transfer.ArtifactTransferException: Could not transfer artifact
net.revelc.code.formatter:jdt-core:jar:2.0.1 from/to central (https://repo.maven.apache.org/maven2):
GET request of: net/revelc/code/formatter/jdt-core/2.0.1/jdt-core-2.0.1.jar from central failed
	at org.eclipse.aether.connector.basic.ArtifactTransportListener.transferFailed(ArtifactTransportListener.java:43)
	at org.eclipse.aether.connector.basic.BasicRepositoryConnector$TaskRunner.run(BasicRepositoryConnector.java:355)
	at org.eclipse.aether.util.concurrency.RunnableErrorForwarder$1.run(RunnableErrorForwarder.java:67)
	... 3 more
Caused by: org.apache.maven.wagon.TransferFailedException: GET request of: net/revelc/code/formatter/jdt-core/2.0.1/jdt-core-2.0.1.jar
from central failed
	at org.apache.maven.wagon.AbstractWagon.getTransfer(AbstractWagon.java:363)
	at org.apache.maven.wagon.AbstractWagon.getTransfer(AbstractWagon.java:316)
	at org.apache.maven.wagon.AbstractWagon.getTransfer(AbstractWagon.java:285)
	at org.apache.maven.wagon.StreamWagon.getIfNewer(StreamWagon.java:97)
	at org.apache.maven.wagon.StreamWagon.get(StreamWagon.java:61)
	at org.eclipse.aether.transport.wagon.WagonTransporter$GetTaskRunner.run(WagonTransporter.java:560)
	at org.eclipse.aether.transport.wagon.WagonTransporter.execute(WagonTransporter.java:427)
	at org.eclipse.aether.transport.wagon.WagonTransporter.get(WagonTransporter.java:404)
	at org.eclipse.aether.connector.basic.BasicRepositoryConnector$GetTaskRunner.runTask(BasicRepositoryConnector.java:447)
	at org.eclipse.aether.connector.basic.BasicRepositoryConnector$TaskRunner.run(BasicRepositoryConnector.java:350)
	... 4 more
Caused by: java.net.SocketException: Connection reset
	at java.net.SocketInputStream.read(SocketInputStream.java:210)
	at java.net.SocketInputStream.read(SocketInputStream.java:141)
	at sun.security.ssl.InputRecord.readFully(InputRecord.java:465)
	at sun.security.ssl.InputRecord.readV3Record(InputRecord.java:593)
	at sun.security.ssl.InputRecord.read(InputRecord.java:532)
	at sun.security.ssl.SSLSocketImpl.readRecord(SSLSocketImpl.java:983)
	at sun.security.ssl.SSLSocketImpl.readDataRecord(SSLSocketImpl.java:940)
	at sun.security.ssl.AppInputStream.read(AppInputStream.java:105)
	at org.apache.maven.wagon.providers.http.httpclient.impl.io.SessionInputBufferImpl.streamRead(SessionInputBufferImpl.java:136)
	at org.apache.maven.wagon.providers.http.httpclient.impl.io.SessionInputBufferImpl.read(SessionInputBufferImpl.java:195)
	at org.apache.maven.wagon.providers.http.httpclient.impl.io.ContentLengthInputStream.read(ContentLengthInputStream.java:178)
	at org.apache.maven.wagon.providers.http.httpclient.conn.EofSensorInputStream.read(EofSensorInputStream.java:137)
	at org.apache.maven.wagon.AbstractWagon.transfer(AbstractWagon.java:531)
	at org.apache.maven.wagon.AbstractWagon.getTransfer(AbstractWagon.java:353)
	... 13 more
2017-10-08T18:02:26.436 [ERROR] 
2017-10-08T18:02:26.436 [ERROR] Re-run Maven using the -X switch to enable full debug logging.
2017-10-08T18:02:26.436 [ERROR] 
2017-10-08T18:02:26.436 [ERROR] For more information about the errors and possible solutions,
please read the following articles:
2017-10-08T18:02:26.437 [ERROR] [Help 1] http://cwiki.apache.org/confluence/display/MAVEN/PluginResolutionException
2017-10-08T18:02:26.437 [ERROR] 
2017-10-08T18:02:26.437 [ERROR] After correcting the problems, you can resume the build with
the command
2017-10-08T18:02:26.437 [ERROR]   mvn <goals> -rf :beam-sdks-java-build-tools
channel stopped

Mime
View raw message