beam-commits mailing list archives

Site index · List index
Message view « Date » · « Thread »
Top « Date » · « Thread »
From Apache Jenkins Server <jenk...@builds.apache.org>
Subject Build failed in Jenkins: beam_PostCommit_Java_ValidatesRunner_Dataflow #4085
Date Mon, 02 Oct 2017 19:54:41 GMT
See <https://builds.apache.org/job/beam_PostCommit_Java_ValidatesRunner_Dataflow/4085/display/redirect>

------------------------------------------
[...truncated 345.41 KB...]
2017-10-02T19:54:06.470 [INFO] Downloaded: https://repo.maven.apache.org/maven2/org/jacoco/org.jacoco.agent/0.7.8/org.jacoco.agent-0.7.8.pom
(3 KB at 100.3 KB/sec)
2017-10-02T19:54:06.474 [INFO] Downloading: https://repo.maven.apache.org/maven2/org/jacoco/org.jacoco.core/0.7.8/org.jacoco.core-0.7.8.pom
2017-10-02T19:54:06.501 [INFO] Downloaded: https://repo.maven.apache.org/maven2/org/jacoco/org.jacoco.core/0.7.8/org.jacoco.core-0.7.8.pom
(2 KB at 43.8 KB/sec)
2017-10-02T19:54:06.505 [INFO] Downloading: https://repo.maven.apache.org/maven2/org/ow2/asm/asm-debug-all/5.1/asm-debug-all-5.1.pom
2017-10-02T19:54:06.533 [INFO] Downloaded: https://repo.maven.apache.org/maven2/org/ow2/asm/asm-debug-all/5.1/asm-debug-all-5.1.pom
(2 KB at 71.7 KB/sec)
2017-10-02T19:54:06.535 [INFO] Downloading: https://repo.maven.apache.org/maven2/org/jacoco/org.jacoco.report/0.7.8/org.jacoco.report-0.7.8.pom
2017-10-02T19:54:06.561 [INFO] Downloaded: https://repo.maven.apache.org/maven2/org/jacoco/org.jacoco.report/0.7.8/org.jacoco.report-0.7.8.pom
(2 KB at 50.6 KB/sec)
2017-10-02T19:54:06.573 [INFO] Downloading: https://repo.maven.apache.org/maven2/junit/junit/4.8.2/junit-4.8.2.jar
2017-10-02T19:54:06.582 [INFO] Downloading: https://repo.maven.apache.org/maven2/xerces/xercesImpl/2.8.1/xercesImpl-2.8.1.jar
2017-10-02T19:54:06.582 [INFO] Downloading: https://repo.maven.apache.org/maven2/commons-httpclient/commons-httpclient/3.1/commons-httpclient-3.1.jar
2017-10-02T19:54:06.584 [INFO] Downloading: https://repo.maven.apache.org/maven2/org/apache/maven/doxia/doxia-core/1.1.2/doxia-core-1.1.2.jar
2017-10-02T19:54:06.610 [INFO] Downloading: https://repo.maven.apache.org/maven2/commons-codec/commons-codec/1.2/commons-codec-1.2.jar
2017-10-02T19:54:06.643 [INFO] Downloaded: https://repo.maven.apache.org/maven2/commons-codec/commons-codec/1.2/commons-codec-1.2.jar
(30 KB at 481.6 KB/sec)
2017-10-02T19:54:06.643 [INFO] Downloading: https://repo.maven.apache.org/maven2/org/apache/maven/doxia/doxia-site-renderer/1.1.2/doxia-site-renderer-1.1.2.jar
2017-10-02T19:54:06.662 [INFO] Downloaded: https://repo.maven.apache.org/maven2/org/apache/maven/doxia/doxia-core/1.1.2/doxia-core-1.1.2.jar
(155 KB at 1737.0 KB/sec)
2017-10-02T19:54:06.662 [INFO] Downloading: https://repo.maven.apache.org/maven2/org/apache/maven/doxia/doxia-decoration-model/1.1.2/doxia-decoration-model-1.1.2.jar
2017-10-02T19:54:06.686 [INFO] Downloaded: https://repo.maven.apache.org/maven2/org/apache/maven/doxia/doxia-site-renderer/1.1.2/doxia-site-renderer-1.1.2.jar
(50 KB at 483.0 KB/sec)
2017-10-02T19:54:06.686 [INFO] Downloading: https://repo.maven.apache.org/maven2/org/apache/maven/doxia/doxia-module-xhtml/1.1.2/doxia-module-xhtml-1.1.2.jar
2017-10-02T19:54:06.694 [INFO] Downloaded: https://repo.maven.apache.org/maven2/junit/junit/4.8.2/junit-4.8.2.jar
(232 KB at 1869.2 KB/sec)
2017-10-02T19:54:06.694 [INFO] Downloading: https://repo.maven.apache.org/maven2/org/apache/maven/doxia/doxia-module-fml/1.1.2/doxia-module-fml-1.1.2.jar
2017-10-02T19:54:06.698 [INFO] Downloaded: https://repo.maven.apache.org/maven2/commons-httpclient/commons-httpclient/3.1/commons-httpclient-3.1.jar
(298 KB at 2567.7 KB/sec)
2017-10-02T19:54:06.698 [INFO] Downloading: https://repo.maven.apache.org/maven2/commons-collections/commons-collections/3.2/commons-collections-3.2.jar
2017-10-02T19:54:06.709 [INFO] Downloaded: https://repo.maven.apache.org/maven2/org/apache/maven/doxia/doxia-decoration-model/1.1.2/doxia-decoration-model-1.1.2.jar
(52 KB at 411.9 KB/sec)
2017-10-02T19:54:06.709 [INFO] Downloading: https://repo.maven.apache.org/maven2/org/jacoco/org.jacoco.agent/0.7.8/org.jacoco.agent-0.7.8-runtime.jar
2017-10-02T19:54:06.723 [INFO] Downloaded: https://repo.maven.apache.org/maven2/org/apache/maven/doxia/doxia-module-xhtml/1.1.2/doxia-module-xhtml-1.1.2.jar
(15 KB at 105.4 KB/sec)
2017-10-02T19:54:06.734 [INFO] Downloading: https://repo.maven.apache.org/maven2/org/jacoco/org.jacoco.core/0.7.8/org.jacoco.core-0.7.8.jar
2017-10-02T19:54:06.734 [INFO] Downloaded: https://repo.maven.apache.org/maven2/org/apache/maven/doxia/doxia-module-fml/1.1.2/doxia-module-fml-1.1.2.jar
(37 KB at 243.5 KB/sec)
2017-10-02T19:54:06.734 [INFO] Downloading: https://repo.maven.apache.org/maven2/org/ow2/asm/asm-debug-all/5.1/asm-debug-all-5.1.jar
2017-10-02T19:54:06.798 [INFO] Downloaded: https://repo.maven.apache.org/maven2/org/jacoco/org.jacoco.core/0.7.8/org.jacoco.core-0.7.8.jar
(122 KB at 567.7 KB/sec)
2017-10-02T19:54:06.798 [INFO] Downloading: https://repo.maven.apache.org/maven2/org/jacoco/org.jacoco.report/0.7.8/org.jacoco.report-0.7.8.jar
2017-10-02T19:54:06.866 [INFO] Downloaded: https://repo.maven.apache.org/maven2/org/jacoco/org.jacoco.report/0.7.8/org.jacoco.report-0.7.8.jar
(125 KB at 441.2 KB/sec)
2017-10-02T19:54:06.878 [INFO] Downloaded: https://repo.maven.apache.org/maven2/commons-collections/commons-collections/3.2/commons-collections-3.2.jar
(558 KB at 1897.5 KB/sec)
2017-10-02T19:54:06.886 [INFO] Downloaded: https://repo.maven.apache.org/maven2/org/ow2/asm/asm-debug-all/5.1/asm-debug-all-5.1.jar
(379 KB at 1253.8 KB/sec)
2017-10-02T19:54:06.923 [INFO] Downloaded: https://repo.maven.apache.org/maven2/xerces/xercesImpl/2.8.1/xercesImpl-2.8.1.jar
(1185 KB at 3403.8 KB/sec)
2017-10-02T19:54:07.110 [INFO] Downloaded: https://repo.maven.apache.org/maven2/org/jacoco/org.jacoco.agent/0.7.8/org.jacoco.agent-0.7.8-runtime.jar
(252 KB at 477.7 KB/sec)
2017-10-02T19:54:07.258 [INFO] argLine set to -javaagent:<https://builds.apache.org/job/beam_PostCommit_Java_ValidatesRunner_Dataflow/ws/.repository/org/jacoco/org.jacoco.agent/0.7.8/org.jacoco.agent-0.7.8-runtime.jar=destfile=/home/jenkins/jenkins-slave/workspace/beam_PostCommit_Java_ValidatesRunner_Dataflow/sdks/java/core/target/jacoco.exec,excludes=**/AutoValue_*.class,dumponexit=true,output=file>
2017-10-02T19:54:07.365 [INFO] 
2017-10-02T19:54:07.365 [INFO] --- avro-maven-plugin:1.8.2:schema (schemas) @ beam-sdks-java-core
---
2017-10-02T19:54:07.370 [INFO] Downloading: https://repo.maven.apache.org/maven2/org/apache/avro/avro-compiler/1.8.2/avro-compiler-1.8.2.pom
2017-10-02T19:54:07.408 [INFO] Downloaded: https://repo.maven.apache.org/maven2/org/apache/avro/avro-compiler/1.8.2/avro-compiler-1.8.2.pom
(5 KB at 126.8 KB/sec)
2017-10-02T19:54:07.413 [INFO] Downloading: https://repo.maven.apache.org/maven2/org/xerial/snappy/snappy-java/1.1.1.3/snappy-java-1.1.1.3.pom
2017-10-02T19:54:07.441 [INFO] Downloaded: https://repo.maven.apache.org/maven2/org/xerial/snappy/snappy-java/1.1.1.3/snappy-java-1.1.1.3.pom
(4 KB at 114.7 KB/sec)
2017-10-02T19:54:07.444 [INFO] Downloading: https://repo.maven.apache.org/maven2/org/apache/commons/commons-compress/1.8.1/commons-compress-1.8.1.pom
2017-10-02T19:54:07.472 [INFO] Downloaded: https://repo.maven.apache.org/maven2/org/apache/commons/commons-compress/1.8.1/commons-compress-1.8.1.pom
(12 KB at 385.0 KB/sec)
2017-10-02T19:54:07.478 [INFO] Downloading: https://repo.maven.apache.org/maven2/org/slf4j/slf4j-api/1.7.7/slf4j-api-1.7.7.pom
2017-10-02T19:54:07.506 [INFO] Downloaded: https://repo.maven.apache.org/maven2/org/slf4j/slf4j-api/1.7.7/slf4j-api-1.7.7.pom
(3 KB at 90.6 KB/sec)
2017-10-02T19:54:07.508 [INFO] Downloading: https://repo.maven.apache.org/maven2/org/slf4j/slf4j-parent/1.7.7/slf4j-parent-1.7.7.pom
2017-10-02T19:54:07.536 [INFO] Downloaded: https://repo.maven.apache.org/maven2/org/slf4j/slf4j-parent/1.7.7/slf4j-parent-1.7.7.pom
(12 KB at 415.3 KB/sec)
2017-10-02T19:54:07.540 [INFO] Downloading: https://repo.maven.apache.org/maven2/joda-time/joda-time/2.7/joda-time-2.7.pom
2017-10-02T19:54:07.570 [INFO] Downloaded: https://repo.maven.apache.org/maven2/joda-time/joda-time/2.7/joda-time-2.7.pom
(28 KB at 930.8 KB/sec)
2017-10-02T19:54:07.574 [INFO] Downloading: https://repo.maven.apache.org/maven2/org/slf4j/slf4j-simple/1.7.7/slf4j-simple-1.7.7.pom
2017-10-02T19:54:07.602 [INFO] Downloaded: https://repo.maven.apache.org/maven2/org/slf4j/slf4j-simple/1.7.7/slf4j-simple-1.7.7.pom
(2 KB at 51.3 KB/sec)
2017-10-02T19:54:07.613 [INFO] Downloading: https://repo.maven.apache.org/maven2/org/apache/maven/maven-plugin-api/2.0.10/maven-plugin-api-2.0.10.jar
2017-10-02T19:54:07.613 [INFO] Downloading: https://repo.maven.apache.org/maven2/org/apache/maven/maven-model/2.0.10/maven-model-2.0.10.jar
2017-10-02T19:54:07.622 [INFO] Downloading: https://repo.maven.apache.org/maven2/org/apache/maven/maven-artifact-manager/2.0.10/maven-artifact-manager-2.0.10.jar
2017-10-02T19:54:07.624 [INFO] Downloading: https://repo.maven.apache.org/maven2/org/apache/maven/maven-repository-metadata/2.0.10/maven-repository-metadata-2.0.10.jar
2017-10-02T19:54:07.626 [INFO] Downloading: https://repo.maven.apache.org/maven2/org/codehaus/plexus/plexus-utils/1.5.5/plexus-utils-1.5.5.jar
2017-10-02T19:54:07.658 [INFO] Downloaded: https://repo.maven.apache.org/maven2/org/apache/maven/maven-plugin-api/2.0.10/maven-plugin-api-2.0.10.jar
(13 KB at 257.0 KB/sec)
2017-10-02T19:54:07.658 [INFO] Downloading: https://repo.maven.apache.org/maven2/org/apache/maven/maven-artifact/2.0.10/maven-artifact-2.0.10.jar
2017-10-02T19:54:07.662 [INFO] Downloaded: https://repo.maven.apache.org/maven2/org/apache/maven/maven-repository-metadata/2.0.10/maven-repository-metadata-2.0.10.jar
(26 KB at 635.3 KB/sec)
2017-10-02T19:54:07.662 [INFO] Downloading: https://repo.maven.apache.org/maven2/org/apache/avro/avro-compiler/1.8.2/avro-compiler-1.8.2.jar
2017-10-02T19:54:07.670 [INFO] Downloaded: https://repo.maven.apache.org/maven2/org/apache/maven/maven-artifact-manager/2.0.10/maven-artifact-manager-2.0.10.jar
(57 KB at 995.9 KB/sec)
2017-10-02T19:54:07.670 [INFO] Downloading: https://repo.maven.apache.org/maven2/org/xerial/snappy/snappy-java/1.1.1.3/snappy-java-1.1.1.3.jar
2017-10-02T19:54:07.682 [INFO] Downloaded: https://repo.maven.apache.org/maven2/org/apache/maven/maven-model/2.0.10/maven-model-2.0.10.jar
(94 KB at 1361.4 KB/sec)
2017-10-02T19:54:07.682 [INFO] Downloading: https://repo.maven.apache.org/maven2/org/apache/commons/commons-compress/1.8.1/commons-compress-1.8.1.jar
2017-10-02T19:54:07.722 [INFO] Downloaded: https://repo.maven.apache.org/maven2/org/apache/avro/avro-compiler/1.8.2/avro-compiler-1.8.2.jar
(81 KB at 831.7 KB/sec)
2017-10-02T19:54:07.722 [INFO] Downloading: https://repo.maven.apache.org/maven2/joda-time/joda-time/2.7/joda-time-2.7.jar
2017-10-02T19:54:07.725 [INFO] Downloaded: https://repo.maven.apache.org/maven2/org/apache/maven/maven-artifact/2.0.10/maven-artifact-2.0.10.jar
(88 KB at 872.3 KB/sec)
2017-10-02T19:54:07.725 [INFO] Downloading: https://repo.maven.apache.org/maven2/org/slf4j/slf4j-api/1.7.7/slf4j-api-1.7.7.jar
2017-10-02T19:54:07.726 [INFO] Downloaded: https://repo.maven.apache.org/maven2/org/codehaus/plexus/plexus-utils/1.5.5/plexus-utils-1.5.5.jar
(246 KB at 2359.5 KB/sec)
2017-10-02T19:54:07.726 [INFO] Downloading: https://repo.maven.apache.org/maven2/org/slf4j/slf4j-simple/1.7.7/slf4j-simple-1.7.7.jar
2017-10-02T19:54:07.758 [INFO] Downloaded: https://repo.maven.apache.org/maven2/org/slf4j/slf4j-simple/1.7.7/slf4j-simple-1.7.7.jar
(11 KB at 78.4 KB/sec)
2017-10-02T19:54:07.774 [INFO] Downloaded: https://repo.maven.apache.org/maven2/org/slf4j/slf4j-api/1.7.7/slf4j-api-1.7.7.jar
(29 KB at 191.8 KB/sec)
2017-10-02T19:54:07.802 [INFO] Downloaded: https://repo.maven.apache.org/maven2/org/apache/commons/commons-compress/1.8.1/commons-compress-1.8.1.jar
(357 KB at 2016.9 KB/sec)
2017-10-02T19:54:07.826 [INFO] Downloaded: https://repo.maven.apache.org/maven2/org/xerial/snappy/snappy-java/1.1.1.3/snappy-java-1.1.1.3.jar
(576 KB at 2861.9 KB/sec)
2017-10-02T19:54:07.885 [INFO] Downloaded: https://repo.maven.apache.org/maven2/joda-time/joda-time/2.7/joda-time-2.7.jar
(576 KB at 2213.4 KB/sec)
2017-10-02T19:54:08.705 [INFO] 
2017-10-02T19:54:08.705 [INFO] --- maven-remote-resources-plugin:1.5:process (process-resource-bundles)
@ beam-sdks-java-core ---
2017-10-02T19:54:09.009 [INFO] 
2017-10-02T19:54:09.010 [INFO] --- maven-resources-plugin:3.0.2:resources (default-resources)
@ beam-sdks-java-core ---
2017-10-02T19:54:09.011 [INFO] Using 'UTF-8' encoding to copy filtered resources.
2017-10-02T19:54:09.011 [INFO] Copying 1 resource
2017-10-02T19:54:09.037 [INFO] Copying 3 resources
2017-10-02T19:54:09.144 [INFO] 
2017-10-02T19:54:09.145 [INFO] --- maven-compiler-plugin:3.6.2:compile (default-compile) @
beam-sdks-java-core ---
2017-10-02T19:54:09.235 [INFO] Changes detected - recompiling the module!
2017-10-02T19:54:09.237 [INFO] Compiling 395 source files to <https://builds.apache.org/job/beam_PostCommit_Java_ValidatesRunner_Dataflow/ws/sdks/java/core/target/classes>
2017-10-02T19:54:17.136 [WARNING] bootstrap class path not set in conjunction with -source
1.7
2017-10-02T19:54:17.137 [WARNING] <https://builds.apache.org/job/beam_PostCommit_Java_ValidatesRunner_Dataflow/ws/sdks/java/core/src/main/java/org/apache/beam/sdk/io/TextIO.java>:[276,31]
An @AutoValue property that is a primitive array returns the original array, which can therefore
be modified by the caller. If this OK, you can suppress this warning with @SuppressWarnings("mutable").
Otherwise, you should replace the property with an immutable type, perhaps a simple wrapper
around the original array.
2017-10-02T19:54:17.137 [WARNING] <https://builds.apache.org/job/beam_PostCommit_Java_ValidatesRunner_Dataflow/ws/sdks/java/core/src/main/java/org/apache/beam/sdk/io/TextIO.java>:[434,31]
An @AutoValue property that is a primitive array returns the original array, which can therefore
be modified by the caller. If this OK, you can suppress this warning with @SuppressWarnings("mutable").
Otherwise, you should replace the property with an immutable type, perhaps a simple wrapper
around the original array.
2017-10-02T19:54:17.137 [WARNING] <https://builds.apache.org/job/beam_PostCommit_Java_ValidatesRunner_Dataflow/ws/sdks/java/core/src/main/java/org/apache/beam/sdk/io/TextIO.java>:[515,31]
An @AutoValue property that is a primitive array returns the original array, which can therefore
be modified by the caller. If this OK, you can suppress this warning with @SuppressWarnings("mutable").
Otherwise, you should replace the property with an immutable type, perhaps a simple wrapper
around the original array.
2017-10-02T19:54:17.137 [INFO] <https://builds.apache.org/job/beam_PostCommit_Java_ValidatesRunner_Dataflow/ws/sdks/java/core/src/main/java/org/apache/beam/sdk/io/FileIO.java>:
Some input files use or override a deprecated API.
2017-10-02T19:54:17.141 [INFO] <https://builds.apache.org/job/beam_PostCommit_Java_ValidatesRunner_Dataflow/ws/sdks/java/core/src/main/java/org/apache/beam/sdk/io/FileIO.java>:
Recompile with -Xlint:deprecation for details.
2017-10-02T19:54:17.142 [INFO] <https://builds.apache.org/job/beam_PostCommit_Java_ValidatesRunner_Dataflow/ws/sdks/java/core/src/main/java/org/apache/beam/sdk/coders/Coder.java>:
Some input files use unchecked or unsafe operations.
2017-10-02T19:54:17.142 [INFO] <https://builds.apache.org/job/beam_PostCommit_Java_ValidatesRunner_Dataflow/ws/sdks/java/core/src/main/java/org/apache/beam/sdk/coders/Coder.java>:
Recompile with -Xlint:unchecked for details.
2017-10-02T19:54:17.345 [INFO] 
2017-10-02T19:54:17.345 [INFO] --- build-helper-maven-plugin:3.0.0:add-test-source (add-test-source)
@ beam-sdks-java-core ---
2017-10-02T19:54:17.347 [INFO] Test Source directory: <https://builds.apache.org/job/beam_PostCommit_Java_ValidatesRunner_Dataflow/ws/sdks/java/core/target/generated-test-sources/java>
added.
2017-10-02T19:54:17.455 [INFO] 
2017-10-02T19:54:17.455 [INFO] --- maven-resources-plugin:3.0.2:testResources (default-testResources)
@ beam-sdks-java-core ---
2017-10-02T19:54:17.457 [INFO] Using 'UTF-8' encoding to copy filtered resources.
2017-10-02T19:54:17.457 [INFO] skip non existing resourceDirectory <https://builds.apache.org/job/beam_PostCommit_Java_ValidatesRunner_Dataflow/ws/sdks/java/core/src/test/resources>
2017-10-02T19:54:17.457 [INFO] Copying 3 resources
2017-10-02T19:54:17.568 [INFO] 
2017-10-02T19:54:17.568 [INFO] --- maven-compiler-plugin:3.6.2:testCompile (default-testCompile)
@ beam-sdks-java-core ---
2017-10-02T19:54:17.663 [INFO] Changes detected - recompiling the module!
2017-10-02T19:54:17.664 [INFO] Compiling 227 source files to <https://builds.apache.org/job/beam_PostCommit_Java_ValidatesRunner_Dataflow/ws/sdks/java/core/target/test-classes>
2017-10-02T19:54:23.538 [INFO] <https://builds.apache.org/job/beam_PostCommit_Java_ValidatesRunner_Dataflow/ws/sdks/java/core/src/test/java/org/apache/beam/sdk/coders/CommonCoderTest.java>:
Some input files use or override a deprecated API.
2017-10-02T19:54:23.538 [INFO] <https://builds.apache.org/job/beam_PostCommit_Java_ValidatesRunner_Dataflow/ws/sdks/java/core/src/test/java/org/apache/beam/sdk/coders/CommonCoderTest.java>:
Recompile with -Xlint:deprecation for details.
2017-10-02T19:54:23.538 [INFO] <https://builds.apache.org/job/beam_PostCommit_Java_ValidatesRunner_Dataflow/ws/sdks/java/core/src/test/java/org/apache/beam/sdk/io/SimpleSink.java>:
Some input files use unchecked or unsafe operations.
2017-10-02T19:54:23.538 [INFO] <https://builds.apache.org/job/beam_PostCommit_Java_ValidatesRunner_Dataflow/ws/sdks/java/core/src/test/java/org/apache/beam/sdk/io/SimpleSink.java>:
Recompile with -Xlint:unchecked for details.
2017-10-02T19:54:23.538 [INFO] -------------------------------------------------------------
2017-10-02T19:54:23.538 [ERROR] COMPILATION ERROR : 
2017-10-02T19:54:23.538 [INFO] -------------------------------------------------------------
2017-10-02T19:54:23.538 [ERROR] <https://builds.apache.org/job/beam_PostCommit_Java_ValidatesRunner_Dataflow/ws/sdks/java/core/src/test/java/org/apache/beam/sdk/transforms/FlattenTest.java>:[322,11]
cannot find symbol
  symbol:   class TupleTag
  location: class org.apache.beam.sdk.transforms.FlattenTest
2017-10-02T19:54:23.538 [ERROR] <https://builds.apache.org/job/beam_PostCommit_Java_ValidatesRunner_Dataflow/ws/sdks/java/core/src/test/java/org/apache/beam/sdk/transforms/FlattenTest.java>:[322,54]
cannot find symbol
  symbol:   class TupleTag
  location: class org.apache.beam.sdk.transforms.FlattenTest
2017-10-02T19:54:23.538 [ERROR] <https://builds.apache.org/job/beam_PostCommit_Java_ValidatesRunner_Dataflow/ws/sdks/java/core/src/test/java/org/apache/beam/sdk/transforms/FlattenTest.java>:[323,11]
cannot find symbol
  symbol:   class TupleTag
  location: class org.apache.beam.sdk.transforms.FlattenTest
2017-10-02T19:54:23.538 [ERROR] <https://builds.apache.org/job/beam_PostCommit_Java_ValidatesRunner_Dataflow/ws/sdks/java/core/src/test/java/org/apache/beam/sdk/transforms/FlattenTest.java>:[323,53]
cannot find symbol
  symbol:   class TupleTag
  location: class org.apache.beam.sdk.transforms.FlattenTest
2017-10-02T19:54:23.538 [ERROR] <https://builds.apache.org/job/beam_PostCommit_Java_ValidatesRunner_Dataflow/ws/sdks/java/core/src/test/java/org/apache/beam/sdk/transforms/FlattenTest.java>:[325,5]
cannot find symbol
  symbol:   class PCollectionTuple
  location: class org.apache.beam.sdk.transforms.FlattenTest
2017-10-02T19:54:23.538 [ERROR] <https://builds.apache.org/job/beam_PostCommit_Java_ValidatesRunner_Dataflow/ws/sdks/java/core/src/test/java/org/apache/beam/sdk/transforms/FlattenTest.java>:[334,44]
cannot find symbol
  symbol:   variable TupleTagList
  location: class org.apache.beam.sdk.transforms.FlattenTest
2017-10-02T19:54:23.538 [INFO] 6 errors 
2017-10-02T19:54:23.538 [INFO] -------------------------------------------------------------
[JENKINS] Archiving disabled
[JENKINS] Archiving disabled
[JENKINS] Archiving disabled
[JENKINS] Archiving disabled
[JENKINS] Archiving disabled
[JENKINS] Archiving disabled
[JENKINS] Archiving disabled
[JENKINS] Archiving disabled
[JENKINS] Archiving disabled
[JENKINS] Archiving disabled
[JENKINS] Archiving disabled
[JENKINS] Archiving disabled
[JENKINS] Archiving disabled
[JENKINS] Archiving disabled
[JENKINS] Archiving disabled
[JENKINS] Archiving disabled
[JENKINS] Archiving disabled
[JENKINS] Archiving disabled
[JENKINS] Archiving disabled
2017-10-02T19:54:32.438 [INFO] ------------------------------------------------------------------------
2017-10-02T19:54:32.438 [INFO] Reactor Summary:
2017-10-02T19:54:32.438 [INFO] 
2017-10-02T19:54:32.438 [INFO] Apache Beam :: Parent .............................. SUCCESS
[ 29.554 s]
2017-10-02T19:54:32.438 [INFO] Apache Beam :: SDKs :: Java :: Build Tools ......... SUCCESS
[ 14.462 s]
2017-10-02T19:54:32.438 [INFO] Apache Beam :: SDKs ................................ SUCCESS
[  2.537 s]
2017-10-02T19:54:32.438 [INFO] Apache Beam :: SDKs :: Common ...................... SUCCESS
[  2.471 s]
2017-10-02T19:54:32.438 [INFO] Apache Beam :: SDKs :: Common :: Runner API ........ SUCCESS
[ 37.534 s]
2017-10-02T19:54:32.438 [INFO] Apache Beam :: SDKs :: Common :: Fn API ............ SUCCESS
[ 10.972 s]
2017-10-02T19:54:32.438 [INFO] Apache Beam :: SDKs :: Java ........................ SUCCESS
[  2.372 s]
2017-10-02T19:54:32.439 [INFO] Apache Beam :: SDKs :: Java :: Core ................ FAILURE
[ 21.896 s]
2017-10-02T19:54:32.439 [INFO] Apache Beam :: Runners ............................. SKIPPED
2017-10-02T19:54:32.439 [INFO] Apache Beam :: Runners :: Core Construction Java ... SKIPPED
2017-10-02T19:54:32.439 [INFO] Apache Beam :: Runners :: Core Java ................ SKIPPED
2017-10-02T19:54:32.439 [INFO] Apache Beam :: Runners :: Direct Java .............. SKIPPED
2017-10-02T19:54:32.439 [INFO] Apache Beam :: SDKs :: Java :: IO .................. SKIPPED
2017-10-02T19:54:32.439 [INFO] Apache Beam :: SDKs :: Java :: Extensions .......... SKIPPED
2017-10-02T19:54:32.439 [INFO] Apache Beam :: SDKs :: Java :: Extensions :: Google Cloud Platform
Core SKIPPED
2017-10-02T19:54:32.439 [INFO] Apache Beam :: SDKs :: Java :: Extensions :: Protobuf SKIPPED
2017-10-02T19:54:32.439 [INFO] Apache Beam :: SDKs :: Java :: IO :: Google Cloud Platform
SKIPPED
2017-10-02T19:54:32.439 [INFO] Apache Beam :: Runners :: Google Cloud Dataflow .... SKIPPED
2017-10-02T19:54:32.439 [INFO] ------------------------------------------------------------------------
2017-10-02T19:54:32.439 [INFO] BUILD FAILURE
2017-10-02T19:54:32.439 [INFO] ------------------------------------------------------------------------
2017-10-02T19:54:32.439 [INFO] Total time: 02:54 min
2017-10-02T19:54:32.439 [INFO] Finished at: 2017-10-02T19:54:32+00:00
2017-10-02T19:54:33.475 [INFO] Final Memory: 110M/1363M
2017-10-02T19:54:33.475 [INFO] ------------------------------------------------------------------------
2017-10-02T19:54:33.482 [ERROR] Failed to execute goal org.apache.maven.plugins:maven-compiler-plugin:3.6.2:testCompile
(default-testCompile) on project beam-sdks-java-core: Compilation failure: Compilation failure:
2017-10-02T19:54:33.482 [ERROR] <https://builds.apache.org/job/beam_PostCommit_Java_ValidatesRunner_Dataflow/ws/sdks/java/core/src/test/java/org/apache/beam/sdk/transforms/FlattenTest.java>:[322,11]
cannot find symbol
2017-10-02T19:54:33.482 [ERROR] symbol:   class TupleTag
2017-10-02T19:54:33.482 [ERROR] location: class org.apache.beam.sdk.transforms.FlattenTest
2017-10-02T19:54:33.482 [ERROR] <https://builds.apache.org/job/beam_PostCommit_Java_ValidatesRunner_Dataflow/ws/sdks/java/core/src/test/java/org/apache/beam/sdk/transforms/FlattenTest.java>:[322,54]
cannot find symbol
2017-10-02T19:54:33.483 [ERROR] symbol:   class TupleTag
2017-10-02T19:54:33.483 [ERROR] location: class org.apache.beam.sdk.transforms.FlattenTest
2017-10-02T19:54:33.483 [ERROR] <https://builds.apache.org/job/beam_PostCommit_Java_ValidatesRunner_Dataflow/ws/sdks/java/core/src/test/java/org/apache/beam/sdk/transforms/FlattenTest.java>:[323,11]
cannot find symbol
2017-10-02T19:54:33.485 [ERROR] symbol:   class TupleTag
2017-10-02T19:54:33.485 [ERROR] location: class org.apache.beam.sdk.transforms.FlattenTest
2017-10-02T19:54:33.486 [ERROR] <https://builds.apache.org/job/beam_PostCommit_Java_ValidatesRunner_Dataflow/ws/sdks/java/core/src/test/java/org/apache/beam/sdk/transforms/FlattenTest.java>:[323,53]
cannot find symbol
2017-10-02T19:54:33.486 [ERROR] symbol:   class TupleTag
2017-10-02T19:54:33.486 [ERROR] location: class org.apache.beam.sdk.transforms.FlattenTest
2017-10-02T19:54:33.486 [ERROR] <https://builds.apache.org/job/beam_PostCommit_Java_ValidatesRunner_Dataflow/ws/sdks/java/core/src/test/java/org/apache/beam/sdk/transforms/FlattenTest.java>:[325,5]
cannot find symbol
2017-10-02T19:54:33.486 [ERROR] symbol:   class PCollectionTuple
2017-10-02T19:54:33.486 [ERROR] location: class org.apache.beam.sdk.transforms.FlattenTest
2017-10-02T19:54:33.486 [ERROR] <https://builds.apache.org/job/beam_PostCommit_Java_ValidatesRunner_Dataflow/ws/sdks/java/core/src/test/java/org/apache/beam/sdk/transforms/FlattenTest.java>:[334,44]
cannot find symbol
2017-10-02T19:54:33.486 [ERROR] symbol:   variable TupleTagList
2017-10-02T19:54:33.486 [ERROR] location: class org.apache.beam.sdk.transforms.FlattenTest
2017-10-02T19:54:33.486 [ERROR] -> [Help 1]
org.apache.maven.lifecycle.LifecycleExecutionException: Failed to execute goal org.apache.maven.plugins:maven-compiler-plugin:3.6.2:testCompile
(default-testCompile) on project beam-sdks-java-core: Compilation failure
	at org.apache.maven.lifecycle.internal.MojoExecutor.execute(MojoExecutor.java:212)
	at org.apache.maven.lifecycle.internal.MojoExecutor.execute(MojoExecutor.java:153)
	at org.apache.maven.lifecycle.internal.MojoExecutor.execute(MojoExecutor.java:145)
	at org.apache.maven.lifecycle.internal.LifecycleModuleBuilder.buildProject(LifecycleModuleBuilder.java:116)
	at org.apache.maven.lifecycle.internal.LifecycleModuleBuilder.buildProject(LifecycleModuleBuilder.java:80)
	at org.apache.maven.lifecycle.internal.builder.singlethreaded.SingleThreadedBuilder.build(SingleThreadedBuilder.java:51)
	at org.apache.maven.lifecycle.internal.LifecycleStarter.execute(LifecycleStarter.java:128)
	at org.apache.maven.DefaultMaven.doExecute(DefaultMaven.java:307)
	at org.apache.maven.DefaultMaven.doExecute(DefaultMaven.java:193)
	at org.apache.maven.DefaultMaven.execute(DefaultMaven.java:106)
	at org.jvnet.hudson.maven3.launcher.Maven33Launcher.main(Maven33Launcher.java:129)
	at sun.reflect.NativeMethodAccessorImpl.invoke0(Native Method)
	at sun.reflect.NativeMethodAccessorImpl.invoke(NativeMethodAccessorImpl.java:62)
	at sun.reflect.DelegatingMethodAccessorImpl.invoke(DelegatingMethodAccessorImpl.java:43)
	at java.lang.reflect.Method.invoke(Method.java:498)
	at org.codehaus.plexus.classworlds.launcher.Launcher.launchStandard(Launcher.java:330)
	at org.codehaus.plexus.classworlds.launcher.Launcher.launch(Launcher.java:238)
	at jenkins.maven3.agent.Maven33Main.launch(Maven33Main.java:176)
	at sun.reflect.NativeMethodAccessorImpl.invoke0(Native Method)
	at sun.reflect.NativeMethodAccessorImpl.invoke(NativeMethodAccessorImpl.java:62)
	at sun.reflect.DelegatingMethodAccessorImpl.invoke(DelegatingMethodAccessorImpl.java:43)
	at java.lang.reflect.Method.invoke(Method.java:498)
	at hudson.maven.Maven3Builder.call(Maven3Builder.java:139)
	at hudson.maven.Maven3Builder.call(Maven3Builder.java:70)
	at hudson.remoting.UserRequest.perform(UserRequest.java:181)
	at hudson.remoting.UserRequest.perform(UserRequest.java:52)
	at hudson.remoting.Request$2.run(Request.java:336)
	at hudson.remoting.InterceptingExecutorService$1.call(InterceptingExecutorService.java:68)
	at java.util.concurrent.FutureTask.run(FutureTask.java:266)
	at java.util.concurrent.ThreadPoolExecutor.runWorker(ThreadPoolExecutor.java:1149)
	at java.util.concurrent.ThreadPoolExecutor$Worker.run(ThreadPoolExecutor.java:624)
	at java.lang.Thread.run(Thread.java:748)
Caused by: org.apache.maven.plugin.compiler.CompilationFailureException: Compilation failure
	at org.apache.maven.plugin.compiler.AbstractCompilerMojo.execute(AbstractCompilerMojo.java:1038)
	at org.apache.maven.plugin.compiler.TestCompilerMojo.execute(TestCompilerMojo.java:172)
	at org.apache.maven.plugin.DefaultBuildPluginManager.executeMojo(DefaultBuildPluginManager.java:134)
	at org.apache.maven.lifecycle.internal.MojoExecutor.execute(MojoExecutor.java:208)
	... 31 more
2017-10-02T19:54:33.491 [ERROR] 
2017-10-02T19:54:33.491 [ERROR] Re-run Maven using the -X switch to enable full debug logging.
2017-10-02T19:54:33.491 [ERROR] 
2017-10-02T19:54:33.491 [ERROR] For more information about the errors and possible solutions,
please read the following articles:
2017-10-02T19:54:33.491 [ERROR] [Help 1] http://cwiki.apache.org/confluence/display/MAVEN/MojoFailureException
2017-10-02T19:54:33.492 [ERROR] 
2017-10-02T19:54:33.492 [ERROR] After correcting the problems, you can resume the build with
the command
2017-10-02T19:54:33.492 [ERROR]   mvn <goals> -rf :beam-sdks-java-core
channel stopped

Mime
View raw message