beam-commits mailing list archives

Site index · List index
Message view « Date » · « Thread »
Top « Date » · « Thread »
From Apache Jenkins Server <jenk...@builds.apache.org>
Subject Build failed in Jenkins: beam_PostCommit_Java_ValidatesRunner_Spark #3051
Date Tue, 12 Sep 2017 07:53:37 GMT
See <https://builds.apache.org/job/beam_PostCommit_Java_ValidatesRunner_Spark/3051/display/redirect>

------------------------------------------
[...truncated 598.48 KB...]
2017-09-12T07:53:09.061 [INFO] Downloading: https://repo.maven.apache.org/maven2/org/tachyonproject/tachyon-client/0.8.2/tachyon-client-0.8.2.jar
2017-09-12T07:53:09.091 [INFO] Downloaded: https://repo.maven.apache.org/maven2/io/netty/netty-all/4.0.29.Final/netty-all-4.0.29.Final.jar
(2007 KB at 2058.2 KB/sec)
2017-09-12T07:53:09.091 [INFO] Downloading: https://repo.maven.apache.org/maven2/org/tachyonproject/tachyon-underfs-hdfs/0.8.2/tachyon-underfs-hdfs-0.8.2.jar
2017-09-12T07:53:09.117 [INFO] Downloaded: https://repo.maven.apache.org/maven2/org/tachyonproject/tachyon-underfs-hdfs/0.8.2/tachyon-underfs-hdfs-0.8.2.jar
(11 KB at 10.8 KB/sec)
2017-09-12T07:53:09.117 [INFO] Downloading: https://repo.maven.apache.org/maven2/org/tachyonproject/tachyon-underfs-s3/0.8.2/tachyon-underfs-s3-0.8.2.jar
2017-09-12T07:53:09.164 [INFO] Downloaded: https://repo.maven.apache.org/maven2/org/apache/ivy/ivy/2.4.0/ivy-2.4.0.jar
(1253 KB at 1195.0 KB/sec)
2017-09-12T07:53:09.164 [INFO] Downloading: https://repo.maven.apache.org/maven2/org/tachyonproject/tachyon-underfs-local/0.8.2/tachyon-underfs-local-0.8.2.jar
2017-09-12T07:53:09.181 [INFO] Downloaded: https://repo.maven.apache.org/maven2/org/tachyonproject/tachyon-underfs-s3/0.8.2/tachyon-underfs-s3-0.8.2.jar
(494 KB at 463.4 KB/sec)
2017-09-12T07:53:09.182 [INFO] Downloading: https://repo.maven.apache.org/maven2/net/razorvine/pyrolite/4.9/pyrolite-4.9.jar
2017-09-12T07:53:09.190 [INFO] Downloaded: https://repo.maven.apache.org/maven2/org/tachyonproject/tachyon-underfs-local/0.8.2/tachyon-underfs-local-0.8.2.jar
(8 KB at 6.6 KB/sec)
2017-09-12T07:53:09.190 [INFO] Downloading: https://repo.maven.apache.org/maven2/net/sf/py4j/py4j/0.9/py4j-0.9.jar
2017-09-12T07:53:09.220 [INFO] Downloaded: https://repo.maven.apache.org/maven2/net/razorvine/pyrolite/4.9/pyrolite-4.9.jar
(92 KB at 82.6 KB/sec)
2017-09-12T07:53:09.220 [INFO] Downloading: https://repo.maven.apache.org/maven2/org/spark-project/spark/unused/1.0.0/unused-1.0.0.jar
2017-09-12T07:53:09.221 [INFO] Downloaded: https://repo.maven.apache.org/maven2/net/sf/py4j/py4j/0.9/py4j-0.9.jar
(83 KB at 74.6 KB/sec)
2017-09-12T07:53:09.221 [INFO] Downloading: https://repo.maven.apache.org/maven2/org/apache/spark/spark-streaming_2.10/1.6.3/spark-streaming_2.10-1.6.3.jar
2017-09-12T07:53:09.250 [INFO] Downloaded: https://repo.maven.apache.org/maven2/org/spark-project/spark/unused/1.0.0/unused-1.0.0.jar
(3 KB at 2.4 KB/sec)
2017-09-12T07:53:09.250 [INFO] Downloaded: https://repo.maven.apache.org/maven2/org/tachyonproject/tachyon-client/0.8.2/tachyon-client-0.8.2.jar
(2238 KB at 1973.1 KB/sec)
2017-09-12T07:53:09.250 [INFO] Downloading: https://repo.maven.apache.org/maven2/org/apache/spark/spark-network-common_2.10/1.6.3/spark-network-common_2.10-1.6.3.jar
2017-09-12T07:53:09.251 [INFO] Downloading: https://repo.maven.apache.org/maven2/org/apache/hadoop/hadoop-common/2.7.3/hadoop-common-2.7.3.jar
2017-09-12T07:53:09.289 [INFO] Downloaded: https://repo.maven.apache.org/maven2/org/scala-lang/scala-reflect/2.10.6/scala-reflect-2.10.6.jar
(3132 KB at 2669.3 KB/sec)
2017-09-12T07:53:09.289 [INFO] Downloading: https://repo.maven.apache.org/maven2/org/apache/hadoop/hadoop-annotations/2.7.3/hadoop-annotations-2.7.3.jar
2017-09-12T07:53:09.318 [INFO] Downloaded: https://repo.maven.apache.org/maven2/org/apache/hadoop/hadoop-annotations/2.7.3/hadoop-annotations-2.7.3.jar
(40 KB at 33.2 KB/sec)
2017-09-12T07:53:09.318 [INFO] Downloading: https://repo.maven.apache.org/maven2/xmlenc/xmlenc/0.52/xmlenc-0.52.jar
2017-09-12T07:53:09.343 [INFO] Downloaded: https://repo.maven.apache.org/maven2/xmlenc/xmlenc/0.52/xmlenc-0.52.jar
(15 KB at 11.9 KB/sec)
2017-09-12T07:53:09.343 [INFO] Downloading: https://repo.maven.apache.org/maven2/commons-codec/commons-codec/1.4/commons-codec-1.4.jar
2017-09-12T07:53:09.373 [INFO] Downloaded: https://repo.maven.apache.org/maven2/commons-codec/commons-codec/1.4/commons-codec-1.4.jar
(57 KB at 45.2 KB/sec)
2017-09-12T07:53:09.373 [INFO] Downloading: https://repo.maven.apache.org/maven2/org/mortbay/jetty/jetty/6.1.26/jetty-6.1.26.jar
2017-09-12T07:53:09.421 [INFO] Downloaded: https://repo.maven.apache.org/maven2/org/apache/spark/spark-streaming_2.10/1.6.3/spark-streaming_2.10-1.6.3.jar
(2005 KB at 1535.9 KB/sec)
2017-09-12T07:53:09.421 [INFO] Downloading: https://repo.maven.apache.org/maven2/org/mortbay/jetty/jetty-util/6.1.26/jetty-util-6.1.26.jar
2017-09-12T07:53:09.445 [INFO] Downloaded: https://repo.maven.apache.org/maven2/org/mortbay/jetty/jetty/6.1.26/jetty-6.1.26.jar
(528 KB at 396.7 KB/sec)
2017-09-12T07:53:09.445 [INFO] Downloading: https://repo.maven.apache.org/maven2/javax/servlet/jsp/jsp-api/2.1/jsp-api-2.1.jar
2017-09-12T07:53:09.459 [INFO] Downloaded: https://repo.maven.apache.org/maven2/org/mortbay/jetty/jetty-util/6.1.26/jetty-util-6.1.26.jar
(173 KB at 128.8 KB/sec)
2017-09-12T07:53:09.459 [INFO] Downloading: https://repo.maven.apache.org/maven2/com/sun/jersey/jersey-json/1.9/jersey-json-1.9.jar
2017-09-12T07:53:09.476 [INFO] Downloaded: https://repo.maven.apache.org/maven2/org/apache/spark/spark-network-common_2.10/1.6.3/spark-network-common_2.10-1.6.3.jar
(2298 KB at 1689.3 KB/sec)
2017-09-12T07:53:09.476 [INFO] Downloading: https://repo.maven.apache.org/maven2/org/codehaus/jettison/jettison/1.1/jettison-1.1.jar
2017-09-12T07:53:09.481 [INFO] Downloaded: https://repo.maven.apache.org/maven2/javax/servlet/jsp/jsp-api/2.1/jsp-api-2.1.jar
(99 KB at 72.1 KB/sec)
2017-09-12T07:53:09.482 [INFO] Downloading: https://repo.maven.apache.org/maven2/com/sun/xml/bind/jaxb-impl/2.2.3-1/jaxb-impl-2.2.3-1.jar
2017-09-12T07:53:09.494 [INFO] Downloaded: https://repo.maven.apache.org/maven2/com/sun/jersey/jersey-json/1.9/jersey-json-1.9.jar
(145 KB at 104.9 KB/sec)
2017-09-12T07:53:09.494 [INFO] Downloading: https://repo.maven.apache.org/maven2/org/codehaus/jackson/jackson-jaxrs/1.8.3/jackson-jaxrs-1.8.3.jar
2017-09-12T07:53:09.507 [INFO] Downloaded: https://repo.maven.apache.org/maven2/org/codehaus/jettison/jettison/1.1/jettison-1.1.jar
(67 KB at 47.6 KB/sec)
2017-09-12T07:53:09.507 [INFO] Downloading: https://repo.maven.apache.org/maven2/org/codehaus/jackson/jackson-xc/1.8.3/jackson-xc-1.8.3.jar
2017-09-12T07:53:09.520 [INFO] Downloaded: https://repo.maven.apache.org/maven2/org/codehaus/jackson/jackson-jaxrs/1.8.3/jackson-jaxrs-1.8.3.jar
(18 KB at 12.4 KB/sec)
2017-09-12T07:53:09.520 [INFO] Downloading: https://repo.maven.apache.org/maven2/commons-logging/commons-logging/1.1.3/commons-logging-1.1.3.jar
2017-09-12T07:53:09.534 [INFO] Downloaded: https://repo.maven.apache.org/maven2/org/apache/hadoop/hadoop-common/2.7.3/hadoop-common-2.7.3.jar
(3398 KB at 2396.2 KB/sec)
2017-09-12T07:53:09.535 [INFO] Downloading: https://repo.maven.apache.org/maven2/commons-configuration/commons-configuration/1.6/commons-configuration-1.6.jar
2017-09-12T07:53:09.535 [INFO] Downloaded: https://repo.maven.apache.org/maven2/org/codehaus/jackson/jackson-xc/1.8.3/jackson-xc-1.8.3.jar
(32 KB at 22.3 KB/sec)
2017-09-12T07:53:09.536 [INFO] Downloading: https://repo.maven.apache.org/maven2/commons-beanutils/commons-beanutils-core/1.8.0/commons-beanutils-core-1.8.0.jar
2017-09-12T07:53:09.549 [INFO] Downloaded: https://repo.maven.apache.org/maven2/commons-logging/commons-logging/1.1.3/commons-logging-1.1.3.jar
(61 KB at 42.3 KB/sec)
2017-09-12T07:53:09.550 [INFO] Downloading: https://repo.maven.apache.org/maven2/com/google/code/gson/gson/2.2.4/gson-2.2.4.jar
2017-09-12T07:53:09.576 [INFO] Downloaded: https://repo.maven.apache.org/maven2/com/sun/xml/bind/jaxb-impl/2.2.3-1/jaxb-impl-2.2.3-1.jar
(870 KB at 595.8 KB/sec)
2017-09-12T07:53:09.577 [INFO] Downloading: https://repo.maven.apache.org/maven2/org/apache/hadoop/hadoop-auth/2.7.3/hadoop-auth-2.7.3.jar
2017-09-12T07:53:09.576 [INFO] Downloaded: https://repo.maven.apache.org/maven2/commons-beanutils/commons-beanutils-core/1.8.0/commons-beanutils-core-1.8.0.jar
(202 KB at 137.9 KB/sec)
2017-09-12T07:53:09.577 [INFO] Downloading: https://repo.maven.apache.org/maven2/org/apache/httpcomponents/httpclient/4.2.5/httpclient-4.2.5.jar
2017-09-12T07:53:09.581 [INFO] Downloaded: https://repo.maven.apache.org/maven2/commons-configuration/commons-configuration/1.6/commons-configuration-1.6.jar
(292 KB at 199.3 KB/sec)
2017-09-12T07:53:09.581 [INFO] Downloading: https://repo.maven.apache.org/maven2/org/apache/httpcomponents/httpcore/4.2.4/httpcore-4.2.4.jar
2017-09-12T07:53:09.596 [INFO] Downloaded: https://repo.maven.apache.org/maven2/com/google/code/gson/gson/2.2.4/gson-2.2.4.jar
(186 KB at 125.7 KB/sec)
2017-09-12T07:53:09.596 [INFO] Downloading: https://repo.maven.apache.org/maven2/org/apache/directory/server/apacheds-kerberos-codec/2.0.0-M15/apacheds-kerberos-codec-2.0.0-M15.jar
2017-09-12T07:53:09.610 [INFO] Downloaded: https://repo.maven.apache.org/maven2/org/apache/hadoop/hadoop-auth/2.7.3/hadoop-auth-2.7.3.jar
(92 KB at 61.6 KB/sec)
2017-09-12T07:53:09.610 [INFO] Downloading: https://repo.maven.apache.org/maven2/org/apache/directory/server/apacheds-i18n/2.0.0-M15/apacheds-i18n-2.0.0-M15.jar
2017-09-12T07:53:09.623 [INFO] Downloaded: https://repo.maven.apache.org/maven2/org/apache/httpcomponents/httpcore/4.2.4/httpcore-4.2.4.jar
(222 KB at 147.4 KB/sec)
2017-09-12T07:53:09.623 [INFO] Downloading: https://repo.maven.apache.org/maven2/org/apache/directory/api/api-asn1-api/1.0.0-M20/api-asn1-api-1.0.0-M20.jar
2017-09-12T07:53:09.638 [INFO] Downloaded: https://repo.maven.apache.org/maven2/org/apache/directory/server/apacheds-i18n/2.0.0-M15/apacheds-i18n-2.0.0-M15.jar
(44 KB at 28.8 KB/sec)
2017-09-12T07:53:09.638 [INFO] Downloading: https://repo.maven.apache.org/maven2/org/apache/directory/api/api-util/1.0.0-M20/api-util-1.0.0-M20.jar
2017-09-12T07:53:09.638 [INFO] Downloaded: https://repo.maven.apache.org/maven2/org/apache/httpcomponents/httpclient/4.2.5/httpclient-4.2.5.jar
(424 KB at 278.2 KB/sec)
2017-09-12T07:53:09.638 [INFO] Downloading: https://repo.maven.apache.org/maven2/com/jcraft/jsch/0.1.42/jsch-0.1.42.jar
2017-09-12T07:53:09.649 [INFO] Downloaded: https://repo.maven.apache.org/maven2/org/apache/directory/api/api-asn1-api/1.0.0-M20/api-asn1-api-1.0.0-M20.jar
(17 KB at 10.6 KB/sec)
2017-09-12T07:53:09.649 [INFO] Downloading: https://repo.maven.apache.org/maven2/org/apache/curator/curator-client/2.7.1/curator-client-2.7.1.jar
2017-09-12T07:53:09.668 [INFO] Downloaded: https://repo.maven.apache.org/maven2/org/apache/directory/api/api-util/1.0.0-M20/api-util-1.0.0-M20.jar
(79 KB at 50.3 KB/sec)
2017-09-12T07:53:09.668 [INFO] Downloading: https://repo.maven.apache.org/maven2/org/apache/htrace/htrace-core/3.1.0-incubating/htrace-core-3.1.0-incubating.jar
2017-09-12T07:53:09.670 [INFO] Downloaded: https://repo.maven.apache.org/maven2/org/apache/directory/server/apacheds-kerberos-codec/2.0.0-M15/apacheds-kerberos-codec-2.0.0-M15.jar
(676 KB at 434.8 KB/sec)
2017-09-12T07:53:09.670 [INFO] Downloading: https://repo.maven.apache.org/maven2/org/apache/hadoop/hadoop-mapreduce-client-core/2.7.3/hadoop-mapreduce-client-core-2.7.3.jar
2017-09-12T07:53:09.677 [INFO] Downloaded: https://repo.maven.apache.org/maven2/com/jcraft/jsch/0.1.42/jsch-0.1.42.jar
(182 KB at 116.3 KB/sec)
2017-09-12T07:53:09.677 [INFO] Downloading: https://repo.maven.apache.org/maven2/org/apache/hadoop/hadoop-yarn-common/2.7.3/hadoop-yarn-common-2.7.3.jar
2017-09-12T07:53:09.680 [INFO] Downloaded: https://repo.maven.apache.org/maven2/org/apache/curator/curator-client/2.7.1/curator-client-2.7.1.jar
(68 KB at 43.4 KB/sec)
2017-09-12T07:53:09.680 [INFO] Downloading: https://repo.maven.apache.org/maven2/javax/xml/bind/jaxb-api/2.2.2/jaxb-api-2.2.2.jar
2017-09-12T07:53:09.712 [INFO] Downloaded: https://repo.maven.apache.org/maven2/javax/xml/bind/jaxb-api/2.2.2/jaxb-api-2.2.2.jar
(103 KB at 64.4 KB/sec)
2017-09-12T07:53:09.712 [INFO] Downloading: https://repo.maven.apache.org/maven2/javax/xml/stream/stax-api/1.0-2/stax-api-1.0-2.jar
2017-09-12T07:53:09.737 [INFO] Downloaded: https://repo.maven.apache.org/maven2/javax/xml/stream/stax-api/1.0-2/stax-api-1.0-2.jar
(23 KB at 14.1 KB/sec)
2017-09-12T07:53:09.737 [INFO] Downloading: https://repo.maven.apache.org/maven2/javax/activation/activation/1.1/activation-1.1.jar
2017-09-12T07:53:09.766 [INFO] Downloaded: https://repo.maven.apache.org/maven2/javax/activation/activation/1.1/activation-1.1.jar
(62 KB at 37.3 KB/sec)
2017-09-12T07:53:09.766 [INFO] Downloading: https://repo.maven.apache.org/maven2/com/sun/jersey/jersey-client/1.9/jersey-client-1.9.jar
2017-09-12T07:53:09.800 [INFO] Downloaded: https://repo.maven.apache.org/maven2/com/sun/jersey/jersey-client/1.9/jersey-client-1.9.jar
(128 KB at 75.7 KB/sec)
2017-09-12T07:53:09.800 [INFO] Downloading: https://repo.maven.apache.org/maven2/com/google/inject/guice/3.0/guice-3.0.jar
2017-09-12T07:53:09.803 [INFO] Downloaded: https://repo.maven.apache.org/maven2/org/apache/hadoop/hadoop-mapreduce-client-core/2.7.3/hadoop-mapreduce-client-core-2.7.3.jar
(1521 KB at 901.6 KB/sec)
2017-09-12T07:53:09.803 [INFO] Downloading: https://repo.maven.apache.org/maven2/com/sun/jersey/contribs/jersey-guice/1.9/jersey-guice-1.9.jar
2017-09-12T07:53:09.820 [INFO] Downloaded: https://repo.maven.apache.org/maven2/org/apache/hadoop/hadoop-yarn-common/2.7.3/hadoop-yarn-common-2.7.3.jar
(1640 KB at 962.6 KB/sec)
2017-09-12T07:53:09.820 [INFO] Downloading: https://repo.maven.apache.org/maven2/com/google/inject/extensions/guice-servlet/3.0/guice-servlet-3.0.jar
2017-09-12T07:53:09.821 [INFO] Downloaded: https://repo.maven.apache.org/maven2/org/scala-lang/scala-compiler/2.10.0/scala-compiler-2.10.0.jar
(13818 KB at 8104.3 KB/sec)
2017-09-12T07:53:09.821 [INFO] Downloading: https://repo.maven.apache.org/maven2/io/netty/netty/3.6.2.Final/netty-3.6.2.Final.jar
2017-09-12T07:53:09.823 [INFO] Downloaded: https://repo.maven.apache.org/maven2/org/apache/htrace/htrace-core/3.1.0-incubating/htrace-core-3.1.0-incubating.jar
(1442 KB at 844.9 KB/sec)
2017-09-12T07:53:09.823 [INFO] Downloading: https://repo.maven.apache.org/maven2/org/apache/commons/commons-text/1.1/commons-text-1.1.jar
2017-09-12T07:53:09.829 [INFO] Downloaded: https://repo.maven.apache.org/maven2/com/sun/jersey/contribs/jersey-guice/1.9/jersey-guice-1.9.jar
(15 KB at 8.4 KB/sec)
2017-09-12T07:53:09.830 [INFO] Downloading: https://repo.maven.apache.org/maven2/org/apache/zookeeper/zookeeper/3.4.6/zookeeper-3.4.6.jar
2017-09-12T07:53:09.850 [INFO] Downloaded: https://repo.maven.apache.org/maven2/com/google/inject/extensions/guice-servlet/3.0/guice-servlet-3.0.jar
(64 KB at 36.6 KB/sec)
2017-09-12T07:53:09.850 [INFO] Downloading: https://repo.maven.apache.org/maven2/jline/jline/0.9.94/jline-0.9.94.jar
2017-09-12T07:53:09.857 [INFO] Downloaded: https://repo.maven.apache.org/maven2/org/apache/commons/commons-text/1.1/commons-text-1.1.jar
(127 KB at 72.5 KB/sec)
2017-09-12T07:53:09.858 [INFO] Downloading: https://repo.maven.apache.org/maven2/org/scala-lang/scala-library/2.10.5/scala-library-2.10.5.jar
2017-09-12T07:53:09.873 [INFO] Downloaded: https://repo.maven.apache.org/maven2/com/google/inject/guice/3.0/guice-3.0.jar
(694 KB at 395.1 KB/sec)
2017-09-12T07:53:09.873 [INFO] Downloading: https://repo.maven.apache.org/maven2/io/dropwizard/metrics/metrics-core/3.1.2/metrics-core-3.1.2.jar
2017-09-12T07:53:09.881 [INFO] Downloaded: https://repo.maven.apache.org/maven2/jline/jline/0.9.94/jline-0.9.94.jar
(86 KB at 48.3 KB/sec)
2017-09-12T07:53:09.881 [INFO] Downloading: https://repo.maven.apache.org/maven2/org/apache/kafka/kafka-clients/0.9.0.1/kafka-clients-0.9.0.1.jar
2017-09-12T07:53:09.906 [INFO] Downloaded: https://repo.maven.apache.org/maven2/io/dropwizard/metrics/metrics-core/3.1.2/metrics-core-3.1.2.jar
(110 KB at 61.4 KB/sec)
2017-09-12T07:53:09.906 [INFO] Downloading: https://repo.maven.apache.org/maven2/org/apache/kafka/kafka_2.10/0.9.0.1/kafka_2.10-0.9.0.1.jar
2017-09-12T07:53:09.912 [INFO] Downloaded: https://repo.maven.apache.org/maven2/org/apache/zookeeper/zookeeper/3.4.6/zookeeper-3.4.6.jar
(775 KB at 431.4 KB/sec)
2017-09-12T07:53:09.912 [INFO] Downloading: https://repo.maven.apache.org/maven2/com/101tec/zkclient/0.7/zkclient-0.7.jar
2017-09-12T07:53:09.931 [INFO] Downloaded: https://repo.maven.apache.org/maven2/io/netty/netty/3.6.2.Final/netty-3.6.2.Final.jar
(1172 KB at 645.8 KB/sec)
2017-09-12T07:53:09.931 [INFO] Downloading: https://repo.maven.apache.org/maven2/com/yammer/metrics/metrics-core/2.2.0/metrics-core-2.2.0.jar
2017-09-12T07:53:09.943 [INFO] Downloaded: https://repo.maven.apache.org/maven2/com/101tec/zkclient/0.7/zkclient-0.7.jar
(73 KB at 39.4 KB/sec)
2017-09-12T07:53:09.943 [INFO] Downloading: https://repo.maven.apache.org/maven2/net/sf/jopt-simple/jopt-simple/3.2/jopt-simple-3.2.jar
2017-09-12T07:53:09.951 [INFO] Downloaded: https://repo.maven.apache.org/maven2/org/apache/kafka/kafka-clients/0.9.0.1/kafka-clients-0.9.0.1.jar
(627 KB at 341.5 KB/sec)
2017-09-12T07:53:09.961 [INFO] Downloaded: https://repo.maven.apache.org/maven2/com/yammer/metrics/metrics-core/2.2.0/metrics-core-2.2.0.jar
(81 KB at 43.5 KB/sec)
2017-09-12T07:53:09.972 [INFO] Downloaded: https://repo.maven.apache.org/maven2/net/sf/jopt-simple/jopt-simple/3.2/jopt-simple-3.2.jar
(52 KB at 28.0 KB/sec)
2017-09-12T07:53:10.271 [INFO] Downloaded: https://repo.maven.apache.org/maven2/org/apache/kafka/kafka_2.10/0.9.0.1/kafka_2.10-0.9.0.1.jar
(4859 KB at 2255.4 KB/sec)
2017-09-12T07:53:10.368 [INFO] Downloaded: https://repo.maven.apache.org/maven2/org/scala-lang/scala-library/2.10.5/scala-library-2.10.5.jar
(6964 KB at 3093.6 KB/sec)
2017-09-12T07:53:10.394 [INFO] 
2017-09-12T07:53:10.394 [INFO] --- maven-clean-plugin:3.0.0:clean (default-clean) @ beam-runners-spark
---
2017-09-12T07:53:10.395 [INFO] Deleting <https://builds.apache.org/job/beam_PostCommit_Java_ValidatesRunner_Spark/ws/runners/spark>
(includes = [**/*.pyc, **/*.egg-info/, **/sdks/python/LICENSE, **/sdks/python/NOTICE, **/sdks/python/README.md],
excludes = [])
2017-09-12T07:53:10.504 [INFO] 
2017-09-12T07:53:10.504 [INFO] --- maven-enforcer-plugin:3.0.0-M1:enforce (enforce) @ beam-runners-spark
---
2017-09-12T07:53:14.806 [INFO] 
2017-09-12T07:53:14.806 [INFO] --- maven-enforcer-plugin:3.0.0-M1:enforce (enforce-banned-dependencies)
@ beam-runners-spark ---
2017-09-12T07:53:14.954 [INFO] 
2017-09-12T07:53:14.954 [INFO] --- maven-remote-resources-plugin:1.5:process (process-resource-bundles)
@ beam-runners-spark ---
2017-09-12T07:53:17.055 [INFO] 
2017-09-12T07:53:17.055 [INFO] --- maven-resources-plugin:3.0.2:resources (default-resources)
@ beam-runners-spark ---
2017-09-12T07:53:17.057 [INFO] Using 'UTF-8' encoding to copy filtered resources.
2017-09-12T07:53:17.058 [INFO] skip non existing resourceDirectory <https://builds.apache.org/job/beam_PostCommit_Java_ValidatesRunner_Spark/ws/runners/spark/src/main/resources>
2017-09-12T07:53:17.059 [INFO] Copying 3 resources
2017-09-12T07:53:17.167 [INFO] 
2017-09-12T07:53:17.167 [INFO] --- maven-compiler-plugin:3.6.2:compile (default-compile) @
beam-runners-spark ---
2017-09-12T07:53:17.180 [INFO] Changes detected - recompiling the module!
2017-09-12T07:53:17.181 [INFO] Compiling 77 source files to <https://builds.apache.org/job/beam_PostCommit_Java_ValidatesRunner_Spark/ws/runners/spark/target/classes>
2017-09-12T07:53:18.156 [WARNING] bootstrap class path not set in conjunction with -source
1.7
2017-09-12T07:53:18.156 [INFO] <https://builds.apache.org/job/beam_PostCommit_Java_ValidatesRunner_Spark/ws/runners/spark/src/main/java/org/apache/beam/runners/spark/translation/TransformTranslator.java>:
Some input files use or override a deprecated API.
2017-09-12T07:53:18.156 [INFO] <https://builds.apache.org/job/beam_PostCommit_Java_ValidatesRunner_Spark/ws/runners/spark/src/main/java/org/apache/beam/runners/spark/translation/TransformTranslator.java>:
Recompile with -Xlint:deprecation for details.
2017-09-12T07:53:18.156 [INFO] <https://builds.apache.org/job/beam_PostCommit_Java_ValidatesRunner_Spark/ws/runners/spark/src/main/java/org/apache/beam/runners/spark/util/GlobalWatermarkHolder.java>:
Some input files use unchecked or unsafe operations.
2017-09-12T07:53:18.156 [INFO] <https://builds.apache.org/job/beam_PostCommit_Java_ValidatesRunner_Spark/ws/runners/spark/src/main/java/org/apache/beam/runners/spark/util/GlobalWatermarkHolder.java>:
Recompile with -Xlint:unchecked for details.
2017-09-12T07:53:18.262 [INFO] 
2017-09-12T07:53:18.263 [INFO] --- maven-resources-plugin:3.0.2:testResources (default-testResources)
@ beam-runners-spark ---
2017-09-12T07:53:18.264 [INFO] Using 'UTF-8' encoding to copy filtered resources.
2017-09-12T07:53:18.264 [INFO] Copying 3 resources
2017-09-12T07:53:18.265 [INFO] Copying 3 resources
2017-09-12T07:53:18.372 [INFO] 
2017-09-12T07:53:18.372 [INFO] --- maven-compiler-plugin:3.6.2:testCompile (default-testCompile)
@ beam-runners-spark ---
2017-09-12T07:53:18.383 [INFO] Changes detected - recompiling the module!
2017-09-12T07:53:18.383 [INFO] Compiling 25 source files to <https://builds.apache.org/job/beam_PostCommit_Java_ValidatesRunner_Spark/ws/runners/spark/target/test-classes>
2017-09-12T07:53:18.895 [INFO] <https://builds.apache.org/job/beam_PostCommit_Java_ValidatesRunner_Spark/ws/runners/spark/src/test/java/org/apache/beam/runners/spark/ForceStreamingTest.java>:
<https://builds.apache.org/job/beam_PostCommit_Java_ValidatesRunner_Spark/ws/runners/spark/src/test/java/org/apache/beam/runners/spark/ForceStreamingTest.java>
uses or overrides a deprecated API.
2017-09-12T07:53:18.895 [INFO] <https://builds.apache.org/job/beam_PostCommit_Java_ValidatesRunner_Spark/ws/runners/spark/src/test/java/org/apache/beam/runners/spark/ForceStreamingTest.java>:
Recompile with -Xlint:deprecation for details.
2017-09-12T07:53:18.895 [INFO] <https://builds.apache.org/job/beam_PostCommit_Java_ValidatesRunner_Spark/ws/runners/spark/src/test/java/org/apache/beam/runners/spark/translation/streaming/TrackStreamingSourcesTest.java>:
Some input files use unchecked or unsafe operations.
2017-09-12T07:53:18.895 [INFO] <https://builds.apache.org/job/beam_PostCommit_Java_ValidatesRunner_Spark/ws/runners/spark/src/test/java/org/apache/beam/runners/spark/translation/streaming/TrackStreamingSourcesTest.java>:
Recompile with -Xlint:unchecked for details.
2017-09-12T07:53:19.004 [INFO] 
2017-09-12T07:53:19.004 [INFO] --- maven-checkstyle-plugin:2.17:check (default) @ beam-runners-spark
---
2017-09-12T07:53:20.749 [INFO] Starting audit...
[ERROR] <https://builds.apache.org/job/beam_PostCommit_Java_ValidatesRunner_Spark/ws/runners/spark/src/main/java/org/apache/beam/runners/spark/stateful/SparkGroupAlsoByWindowViaWindowSet.java>:345:
Line is longer than 100 characters (found 107). [LineLength]
[ERROR] <https://builds.apache.org/job/beam_PostCommit_Java_ValidatesRunner_Spark/ws/runners/spark/src/main/java/org/apache/beam/runners/spark/stateful/SparkGroupAlsoByWindowViaWindowSet.java>:347:
Line is longer than 100 characters (found 103). [LineLength]
Audit done.
2017-09-12T07:53:20.750 [INFO] There are 2 errors reported by Checkstyle 6.19 with beam/checkstyle.xml
ruleset.
2017-09-12T07:53:20.751 [ERROR] src/main/java/org/apache/beam/runners/spark/stateful/SparkGroupAlsoByWindowViaWindowSet.java:[345]
(sizes) LineLength: Line is longer than 100 characters (found 107).
2017-09-12T07:53:20.751 [ERROR] src/main/java/org/apache/beam/runners/spark/stateful/SparkGroupAlsoByWindowViaWindowSet.java:[347]
(sizes) LineLength: Line is longer than 100 characters (found 103).
[JENKINS] Archiving disabled
[JENKINS] Archiving disabled
[JENKINS] Archiving disabled
[JENKINS] Archiving disabled
[JENKINS] Archiving disabled
[JENKINS] Archiving disabled
[JENKINS] Archiving disabled
[JENKINS] Archiving disabled
[JENKINS] Archiving disabled
[JENKINS] Archiving disabled
[JENKINS] Archiving disabled
[JENKINS] Archiving disabled
[JENKINS] Archiving disabled
[JENKINS] Archiving disabled
[JENKINS] Archiving disabled
[JENKINS] Archiving disabled
2017-09-12T07:53:30.355 [INFO] ------------------------------------------------------------------------
2017-09-12T07:53:30.355 [INFO] Reactor Summary:
2017-09-12T07:53:30.355 [INFO] 
2017-09-12T07:53:30.355 [INFO] Apache Beam :: Parent .............................. SUCCESS
[ 25.359 s]
2017-09-12T07:53:30.356 [INFO] Apache Beam :: SDKs :: Java :: Build Tools ......... SUCCESS
[ 11.450 s]
2017-09-12T07:53:30.356 [INFO] Apache Beam :: SDKs ................................ SUCCESS
[  2.924 s]
2017-09-12T07:53:30.356 [INFO] Apache Beam :: SDKs :: Common ...................... SUCCESS
[  4.389 s]
2017-09-12T07:53:30.356 [INFO] Apache Beam :: SDKs :: Common :: Runner API ........ SUCCESS
[ 36.165 s]
2017-09-12T07:53:30.356 [INFO] Apache Beam :: SDKs :: Common :: Fn API ............ SUCCESS
[  7.470 s]
2017-09-12T07:53:30.356 [INFO] Apache Beam :: SDKs :: Java ........................ SUCCESS
[  2.095 s]
2017-09-12T07:53:30.356 [INFO] Apache Beam :: SDKs :: Java :: Core ................ SUCCESS
[01:46 min]
2017-09-12T07:53:30.356 [INFO] Apache Beam :: Runners ............................. SUCCESS
[  2.171 s]
2017-09-12T07:53:30.356 [INFO] Apache Beam :: Runners :: Core Construction Java ... SUCCESS
[ 19.607 s]
2017-09-12T07:53:30.356 [INFO] Apache Beam :: Runners :: Core Java ................ SUCCESS
[ 31.785 s]
2017-09-12T07:53:30.356 [INFO] Apache Beam :: Runners :: Direct Java .............. SUCCESS
[05:00 min]
2017-09-12T07:53:30.356 [INFO] Apache Beam :: SDKs :: Java :: IO .................. SUCCESS
[  2.320 s]
2017-09-12T07:53:30.356 [INFO] Apache Beam :: SDKs :: Java :: IO :: Kafka ......... SUCCESS
[ 38.941 s]
2017-09-12T07:53:30.356 [INFO] Apache Beam :: Runners :: Spark .................... FAILURE
[ 18.684 s]
2017-09-12T07:53:30.356 [INFO] ------------------------------------------------------------------------
2017-09-12T07:53:30.356 [INFO] BUILD FAILURE
2017-09-12T07:53:30.356 [INFO] ------------------------------------------------------------------------
2017-09-12T07:53:30.356 [INFO] Total time: 11:08 min
2017-09-12T07:53:30.356 [INFO] Finished at: 2017-09-12T07:53:30+00:00
2017-09-12T07:53:30.886 [INFO] Final Memory: 146M/1770M
2017-09-12T07:53:30.886 [INFO] ------------------------------------------------------------------------
2017-09-12T07:53:30.887 [WARNING] The requested profile "validates-runner-tests" could not
be activated because it does not exist.
2017-09-12T07:53:30.891 [ERROR] Failed to execute goal org.apache.maven.plugins:maven-checkstyle-plugin:2.17:check
(default) on project beam-runners-spark: You have 2 Checkstyle violations. -> [Help 1]
org.apache.maven.lifecycle.LifecycleExecutionException: Failed to execute goal org.apache.maven.plugins:maven-checkstyle-plugin:2.17:check
(default) on project beam-runners-spark: You have 2 Checkstyle violations.
	at org.apache.maven.lifecycle.internal.MojoExecutor.execute(MojoExecutor.java:212)
	at org.apache.maven.lifecycle.internal.MojoExecutor.execute(MojoExecutor.java:153)
	at org.apache.maven.lifecycle.internal.MojoExecutor.execute(MojoExecutor.java:145)
	at org.apache.maven.lifecycle.internal.LifecycleModuleBuilder.buildProject(LifecycleModuleBuilder.java:116)
	at org.apache.maven.lifecycle.internal.LifecycleModuleBuilder.buildProject(LifecycleModuleBuilder.java:80)
	at org.apache.maven.lifecycle.internal.builder.singlethreaded.SingleThreadedBuilder.build(SingleThreadedBuilder.java:51)
	at org.apache.maven.lifecycle.internal.LifecycleStarter.execute(LifecycleStarter.java:128)
	at org.apache.maven.DefaultMaven.doExecute(DefaultMaven.java:307)
	at org.apache.maven.DefaultMaven.doExecute(DefaultMaven.java:193)
	at org.apache.maven.DefaultMaven.execute(DefaultMaven.java:106)
	at org.jvnet.hudson.maven3.launcher.Maven33Launcher.main(Maven33Launcher.java:129)
	at sun.reflect.NativeMethodAccessorImpl.invoke0(Native Method)
	at sun.reflect.NativeMethodAccessorImpl.invoke(NativeMethodAccessorImpl.java:62)
	at sun.reflect.DelegatingMethodAccessorImpl.invoke(DelegatingMethodAccessorImpl.java:43)
	at java.lang.reflect.Method.invoke(Method.java:498)
	at org.codehaus.plexus.classworlds.launcher.Launcher.launchStandard(Launcher.java:330)
	at org.codehaus.plexus.classworlds.launcher.Launcher.launch(Launcher.java:238)
	at jenkins.maven3.agent.Maven33Main.launch(Maven33Main.java:176)
	at sun.reflect.NativeMethodAccessorImpl.invoke0(Native Method)
	at sun.reflect.NativeMethodAccessorImpl.invoke(NativeMethodAccessorImpl.java:62)
	at sun.reflect.DelegatingMethodAccessorImpl.invoke(DelegatingMethodAccessorImpl.java:43)
	at java.lang.reflect.Method.invoke(Method.java:498)
	at hudson.maven.Maven3Builder.call(Maven3Builder.java:139)
	at hudson.maven.Maven3Builder.call(Maven3Builder.java:70)
	at hudson.remoting.UserRequest.perform(UserRequest.java:153)
	at hudson.remoting.UserRequest.perform(UserRequest.java:50)
	at hudson.remoting.Request$2.run(Request.java:336)
	at hudson.remoting.InterceptingExecutorService$1.call(InterceptingExecutorService.java:68)
	at java.util.concurrent.FutureTask.run(FutureTask.java:266)
	at java.util.concurrent.ThreadPoolExecutor.runWorker(ThreadPoolExecutor.java:1149)
	at java.util.concurrent.ThreadPoolExecutor$Worker.run(ThreadPoolExecutor.java:624)
	at java.lang.Thread.run(Thread.java:748)
Caused by: org.apache.maven.plugin.MojoFailureException: You have 2 Checkstyle violations.
	at org.apache.maven.plugin.checkstyle.CheckstyleViolationCheckMojo.execute(CheckstyleViolationCheckMojo.java:588)
	at org.apache.maven.plugin.DefaultBuildPluginManager.executeMojo(DefaultBuildPluginManager.java:134)
	at org.apache.maven.lifecycle.internal.MojoExecutor.execute(MojoExecutor.java:208)
	... 31 more
2017-09-12T07:53:30.891 [ERROR] 
2017-09-12T07:53:30.891 [ERROR] Re-run Maven using the -X switch to enable full debug logging.
2017-09-12T07:53:30.892 [ERROR] 
2017-09-12T07:53:30.892 [ERROR] For more information about the errors and possible solutions,
please read the following articles:
2017-09-12T07:53:30.892 [ERROR] [Help 1] http://cwiki.apache.org/confluence/display/MAVEN/MojoFailureException
2017-09-12T07:53:30.892 [ERROR] 
2017-09-12T07:53:30.892 [ERROR] After correcting the problems, you can resume the build with
the command
2017-09-12T07:53:30.892 [ERROR]   mvn <goals> -rf :beam-runners-spark
channel stopped

Mime
View raw message