beam-commits mailing list archives

Site index · List index
Message view « Date » · « Thread »
Top « Date » · « Thread »
From Apache Jenkins Server <jenk...@builds.apache.org>
Subject Build failed in Jenkins: beam_PostCommit_Java_MavenInstall #4699
Date Fri, 01 Sep 2017 19:39:07 GMT
See <https://builds.apache.org/job/beam_PostCommit_Java_MavenInstall/4699/display/redirect?page=changes>

Changes:

[ekirpichov] [BEAM-2802] Support multi-byte custom separator in TextIO

------------------------------------------
[...truncated 1.12 MB...]
2017-09-01T19:38:21.532 [INFO] Downloading: https://repo.maven.apache.org/maven2/org/fusesource/sigar/1.6.4/sigar-1.6.4.jar
2017-09-01T19:38:21.548 [INFO] Downloaded: https://repo.maven.apache.org/maven2/com/github/jbellis/jamm/0.3.0/jamm-0.3.0.jar
(21 KB at 3.7 KB/sec)
2017-09-01T19:38:21.548 [INFO] Downloading: https://repo.maven.apache.org/maven2/org/eclipse/jdt/core/compiler/ecj/4.4.2/ecj-4.4.2.jar
2017-09-01T19:38:21.616 [INFO] Downloaded: https://repo.maven.apache.org/maven2/org/fusesource/sigar/1.6.4/sigar-1.6.4.jar
(419 KB at 73.8 KB/sec)
2017-09-01T19:38:21.616 [INFO] Downloading: https://repo.maven.apache.org/maven2/org/caffinitas/ohc/ohc-core/0.4.3/ohc-core-0.4.3.jar
2017-09-01T19:38:21.676 [INFO] Downloaded: https://repo.maven.apache.org/maven2/org/caffinitas/ohc/ohc-core/0.4.3/ohc-core-0.4.3.jar
(125 KB at 21.6 KB/sec)
2017-09-01T19:38:21.676 [INFO] Downloading: https://repo.maven.apache.org/maven2/com/github/ben-manes/caffeine/caffeine/2.2.6/caffeine-2.2.6.jar
2017-09-01T19:38:21.884 [INFO] Downloaded: https://repo.maven.apache.org/maven2/org/eclipse/jdt/core/compiler/ecj/4.4.2/ecj-4.4.2.jar
(2257 KB at 379.7 KB/sec)
2017-09-01T19:38:21.884 [INFO] Downloading: https://repo.maven.apache.org/maven2/com/datastax/cassandra/cassandra-driver-core/3.1.1/cassandra-driver-core-3.1.1.jar
2017-09-01T19:38:21.921 [INFO] Downloaded: https://repo.maven.apache.org/maven2/com/github/ben-manes/caffeine/caffeine/2.2.6/caffeine-2.2.6.jar
(926 KB at 154.8 KB/sec)
2017-09-01T19:38:21.934 [INFO] Downloaded: https://repo.maven.apache.org/maven2/io/netty/netty-all/4.0.39.Final/netty-all-4.0.39.Final.jar
(2219 KB at 370.2 KB/sec)
2017-09-01T19:38:22.058 [INFO] Downloaded: https://repo.maven.apache.org/maven2/com/datastax/cassandra/cassandra-driver-core/3.1.1/cassandra-driver-core-3.1.1.jar
(1029 KB at 168.1 KB/sec)
2017-09-01T19:38:22.546 [INFO] Downloaded: https://repo.maven.apache.org/maven2/org/apache/storm/storm-core/1.0.1/storm-core-1.0.1.jar
(19650 KB at 2975.4 KB/sec)
2017-09-01T19:38:22.597 [INFO] Downloaded: https://repo.maven.apache.org/maven2/it/unimi/dsi/fastutil/6.5.7/fastutil-6.5.7.jar
(16508 KB at 2480.5 KB/sec)
2017-09-01T19:38:22.638 [INFO] Downloading: http://conjars.org/repo/org/pentaho/pentaho-aggdesigner-algorithm/5.1.5-jhyde/pentaho-aggdesigner-algorithm-5.1.5-jhyde.jar
2017-09-01T19:38:22.638 [INFO] Downloading: http://conjars.org/repo/cascading/cascading-core/2.6.3/cascading-core-2.6.3.jar
2017-09-01T19:38:22.638 [INFO] Downloading: http://conjars.org/repo/cascading/cascading-hadoop/2.6.3/cascading-hadoop-2.6.3.jar
2017-09-01T19:38:22.638 [INFO] Downloading: http://conjars.org/repo/org/apache/spark/spark-sql_2.10/2.0.0/spark-sql_2.10-2.0.0.jar
2017-09-01T19:38:22.639 [INFO] Downloading: http://conjars.org/repo/riffle/riffle/0.1-dev/riffle-0.1-dev.jar
2017-09-01T19:38:22.697 [INFO] Downloading: http://conjars.org/repo/thirdparty/jgrapht-jdk1.6/0.8.1/jgrapht-jdk1.6-0.8.1.jar
2017-09-01T19:38:22.753 [INFO] Downloaded: http://conjars.org/repo/riffle/riffle/0.1-dev/riffle-0.1-dev.jar
(12 KB at 96.4 KB/sec)
2017-09-01T19:38:22.753 [INFO] Downloading: http://conjars.org/repo/cascading/cascading-local/2.6.3/cascading-local-2.6.3.jar
2017-09-01T19:38:22.809 [INFO] Downloaded: http://conjars.org/repo/org/pentaho/pentaho-aggdesigner-algorithm/5.1.5-jhyde/pentaho-aggdesigner-algorithm-5.1.5-jhyde.jar
(48 KB at 277.3 KB/sec)
2017-09-01T19:38:22.919 [INFO] Downloaded: http://conjars.org/repo/cascading/cascading-local/2.6.3/cascading-local-2.6.3.jar
(43 KB at 151.2 KB/sec)
2017-09-01T19:38:22.997 [INFO] Downloaded: http://conjars.org/repo/cascading/cascading-hadoop/2.6.3/cascading-hadoop-2.6.3.jar
(246 KB at 684.9 KB/sec)
2017-09-01T19:38:23.084 [INFO] Downloaded: http://conjars.org/repo/thirdparty/jgrapht-jdk1.6/0.8.1/jgrapht-jdk1.6-0.8.1.jar
(230 KB at 515.2 KB/sec)
2017-09-01T19:38:23.247 [INFO] Downloaded: http://conjars.org/repo/cascading/cascading-core/2.6.3/cascading-core-2.6.3.jar
(680 KB at 1115.7 KB/sec)
2017-09-01T19:38:23.250 [INFO] Downloading: http://clojars.org/repo/org/apache/spark/spark-sql_2.10/2.0.0/spark-sql_2.10-2.0.0.jar
[JENKINS] Archiving disabled
2017-09-01T19:38:24.045 [INFO]                                                           
             
2017-09-01T19:38:24.045 [INFO] ------------------------------------------------------------------------
2017-09-01T19:38:24.045 [INFO] Skipping Apache Beam :: Parent
2017-09-01T19:38:24.045 [INFO] This project has been banned from the build due to previous
failures.
2017-09-01T19:38:24.045 [INFO] ------------------------------------------------------------------------
[JENKINS] Archiving disabled
[JENKINS] Archiving disabled
[JENKINS] Archiving disabled
[JENKINS] Archiving disabled
[JENKINS] Archiving disabled
[JENKINS] Archiving disabled
[JENKINS] Archiving disabled
[JENKINS] Archiving disabled
[JENKINS] Archiving disabled
[JENKINS] Archiving disabled
[JENKINS] Archiving disabled
[JENKINS] Archiving disabled
[JENKINS] Archiving disabled
[JENKINS] Archiving disabled
[JENKINS] Archiving disabled
[JENKINS] Archiving disabled
[JENKINS] Archiving disabled
[JENKINS] Archiving disabled
[JENKINS] Archiving disabled
[JENKINS] Archiving disabled
[JENKINS] Archiving disabled
[JENKINS] Archiving disabled
[JENKINS] Archiving disabled
[JENKINS] Archiving disabled
[JENKINS] Archiving disabled
[JENKINS] Archiving disabled
[JENKINS] Archiving disabled
[JENKINS] Archiving disabled
[JENKINS] Archiving disabled
[JENKINS] Archiving disabled
[JENKINS] Archiving disabled
[JENKINS] Archiving disabled
[JENKINS] Archiving disabled
[JENKINS] Archiving disabled
[JENKINS] Archiving disabled
[JENKINS] Archiving disabled
[JENKINS] Archiving disabled
[JENKINS] Archiving disabled
[JENKINS] Archiving disabled
[JENKINS] Archiving disabled
[JENKINS] Archiving disabled
[JENKINS] Archiving disabled
[JENKINS] Archiving disabled
[JENKINS] Archiving disabled
[JENKINS] Archiving disabled
[JENKINS] Archiving disabled
[JENKINS] Archiving disabled
[JENKINS] Archiving disabled
[JENKINS] Archiving disabled
[JENKINS] Archiving disabled
[JENKINS] Archiving disabled
[JENKINS] Archiving disabled
[JENKINS] Archiving disabled
[JENKINS] Archiving disabled
[JENKINS] Archiving disabled
[JENKINS] Archiving disabled2017-09-01T19:38:56.385 [INFO] ------------------------------------------------------------------------
2017-09-01T19:38:56.385 [INFO] Reactor Summary:
2017-09-01T19:38:56.385 [INFO] 
2017-09-01T19:38:56.385 [INFO] Apache Beam :: Parent .............................. SUCCESS
[01:44 min]
2017-09-01T19:38:56.385 [INFO] Apache Beam :: SDKs :: Java :: Build Tools ......... SUCCESS
[ 12.658 s]
2017-09-01T19:38:56.385 [INFO] Apache Beam :: SDKs ................................ SUCCESS
[  6.625 s]
2017-09-01T19:38:56.385 [INFO] Apache Beam :: SDKs :: Common ...................... SUCCESS
[  3.068 s]
2017-09-01T19:38:56.385 [INFO] Apache Beam :: SDKs :: Common :: Runner API ........ SUCCESS
[ 35.695 s]
2017-09-01T19:38:56.385 [INFO] Apache Beam :: SDKs :: Common :: Fn API ............ SUCCESS
[ 19.632 s]
2017-09-01T19:38:56.385 [INFO] Apache Beam :: SDKs :: Java ........................ SUCCESS
[  2.973 s]
2017-09-01T19:38:56.385 [INFO] Apache Beam :: SDKs :: Java :: Core ................ SUCCESS
[02:48 min]
2017-09-01T19:38:56.385 [INFO] Apache Beam :: Runners ............................. SUCCESS
[  3.008 s]
2017-09-01T19:38:56.385 [INFO] Apache Beam :: Runners :: Core Construction Java ... SUCCESS
[ 38.901 s]
2017-09-01T19:38:56.385 [INFO] Apache Beam :: Runners :: Core Java ................ SUCCESS
[ 54.889 s]
2017-09-01T19:38:56.385 [INFO] Apache Beam :: Runners :: Direct Java .............. SUCCESS
[05:51 min]
2017-09-01T19:38:56.385 [INFO] Apache Beam :: SDKs :: Java :: IO .................. SUCCESS
[  3.221 s]
2017-09-01T19:38:56.385 [INFO] Apache Beam :: SDKs :: Java :: IO :: AMQP .......... SUCCESS
[ 44.944 s]
2017-09-01T19:38:56.385 [INFO] Apache Beam :: SDKs :: Java :: IO :: Common ........ SUCCESS
[  8.554 s]
2017-09-01T19:38:56.385 [INFO] Apache Beam :: SDKs :: Java :: IO :: Cassandra ..... SUCCESS
[ 39.691 s]
2017-09-01T19:38:56.385 [INFO] Apache Beam :: SDKs :: Java :: IO :: Elasticsearch . SUCCESS
[ 44.057 s]
2017-09-01T19:38:56.385 [INFO] Apache Beam :: SDKs :: Java :: Extensions .......... SUCCESS
[  3.089 s]
2017-09-01T19:38:56.385 [INFO] Apache Beam :: SDKs :: Java :: Extensions :: Google Cloud Platform
Core SUCCESS [ 39.364 s]
2017-09-01T19:38:56.385 [INFO] Apache Beam :: SDKs :: Java :: Extensions :: Protobuf SUCCESS
[ 26.005 s]
2017-09-01T19:38:56.385 [INFO] Apache Beam :: SDKs :: Java :: IO :: Google Cloud Platform
SUCCESS [01:48 min]
2017-09-01T19:38:56.385 [INFO] Apache Beam :: SDKs :: Java :: IO :: Hadoop Common . SUCCESS
[ 21.854 s]
2017-09-01T19:38:56.385 [INFO] Apache Beam :: SDKs :: Java :: IO :: Hadoop File System SUCCESS
[ 54.268 s]
2017-09-01T19:38:56.385 [INFO] Apache Beam :: SDKs :: Java :: IO :: Hadoop ........ SUCCESS
[  5.500 s]
2017-09-01T19:38:56.385 [INFO] Apache Beam :: SDKs :: Java :: IO :: Hadoop :: input-format
SUCCESS [ 29.178 s]
2017-09-01T19:38:56.385 [INFO] Apache Beam :: Runners :: Google Cloud Dataflow .... SUCCESS
[07:21 min]
2017-09-01T19:38:56.385 [INFO] Apache Beam :: SDKs :: Java :: IO :: Hadoop :: jdk1.8-tests
FAILURE [ 19.675 s]
2017-09-01T19:38:56.385 [INFO] Apache Beam :: SDKs :: Java :: IO :: HBase ......... SKIPPED
2017-09-01T19:38:56.385 [INFO] Apache Beam :: SDKs :: Java :: IO :: HCatalog ...... SKIPPED
2017-09-01T19:38:56.385 [INFO] Apache Beam :: SDKs :: Java :: IO :: JDBC .......... SKIPPED
2017-09-01T19:38:56.385 [INFO] Apache Beam :: SDKs :: Java :: IO :: JMS ........... SKIPPED
2017-09-01T19:38:56.385 [INFO] Apache Beam :: SDKs :: Java :: IO :: Kafka ......... SKIPPED
2017-09-01T19:38:56.385 [INFO] Apache Beam :: SDKs :: Java :: IO :: Kinesis ....... SKIPPED
2017-09-01T19:38:56.385 [INFO] Apache Beam :: SDKs :: Java :: IO :: MongoDB ....... SKIPPED
2017-09-01T19:38:56.385 [INFO] Apache Beam :: SDKs :: Java :: IO :: MQTT .......... SKIPPED
2017-09-01T19:38:56.385 [INFO] Apache Beam :: SDKs :: Java :: IO :: Solr .......... SKIPPED
2017-09-01T19:38:56.385 [INFO] Apache Beam :: SDKs :: Java :: IO :: XML ........... SKIPPED
2017-09-01T19:38:56.385 [INFO] Apache Beam :: SDKs :: Java :: Maven Archetypes .... SKIPPED
2017-09-01T19:38:56.385 [INFO] Apache Beam :: SDKs :: Java :: Maven Archetypes :: Starter
SKIPPED
2017-09-01T19:38:56.385 [INFO] Apache Beam :: Examples ............................ SKIPPED
2017-09-01T19:38:56.385 [INFO] Apache Beam :: Examples :: Java .................... SKIPPED
2017-09-01T19:38:56.385 [INFO] Apache Beam :: SDKs :: Java :: Maven Archetypes :: Examples
SKIPPED
2017-09-01T19:38:56.385 [INFO] Apache Beam :: Examples :: Java 8 .................. SKIPPED
2017-09-01T19:38:56.385 [INFO] Apache Beam :: SDKs :: Java :: Maven Archetypes :: Examples
- Java 8 SKIPPED
2017-09-01T19:38:56.385 [INFO] Apache Beam :: SDKs :: Java :: Extensions :: Jackson SKIPPED
2017-09-01T19:38:56.385 [INFO] Apache Beam :: SDKs :: Java :: Extensions :: Join library SKIPPED
2017-09-01T19:38:56.385 [INFO] Apache Beam :: SDKs :: Java :: Extensions :: Sorter  SKIPPED
2017-09-01T19:38:56.385 [INFO] Apache Beam :: SDKs :: Java :: Nexmark ............. SKIPPED
2017-09-01T19:38:56.385 [INFO] Apache Beam :: SDKs :: Java :: Harness ............. SKIPPED
2017-09-01T19:38:56.386 [INFO] Apache Beam :: SDKs :: Java :: Java 8 Tests ........ SKIPPED
2017-09-01T19:38:56.386 [INFO] Apache Beam :: SDKs :: Python ...................... SKIPPED
2017-09-01T19:38:56.386 [INFO] Apache Beam :: Runners :: Flink .................... SKIPPED
2017-09-01T19:38:56.386 [INFO] Apache Beam :: Runners :: Spark .................... SKIPPED
2017-09-01T19:38:56.386 [INFO] Apache Beam :: Runners :: Apex ..................... SKIPPED
2017-09-01T19:38:56.386 [INFO] Apache Beam :: Runners :: Gearpump ................. SKIPPED
2017-09-01T19:38:56.386 [INFO] Apache Beam :: SDKs :: Java :: Aggregated Javadoc .. SKIPPED
2017-09-01T19:38:56.386 [INFO] ------------------------------------------------------------------------
2017-09-01T19:38:56.386 [INFO] BUILD FAILURE
2017-09-01T19:38:56.386 [INFO] ------------------------------------------------------------------------
2017-09-01T19:38:56.386 [INFO] Total time: 29:24 min
2017-09-01T19:38:56.386 [INFO] Finished at: 2017-09-01T19:38:56+00:00

2017-09-01T19:38:57.045 [INFO] Final Memory: 190M/1596M
2017-09-01T19:38:57.045 [INFO] ------------------------------------------------------------------------
2017-09-01T19:38:57.050 [ERROR] Failed to execute goal on project beam-sdks-java-io-hadoop-jdk1.8-tests:
Could not resolve dependencies for project org.apache.beam:beam-sdks-java-io-hadoop-jdk1.8-tests:jar:2.2.0-SNAPSHOT:
Could not transfer artifact org.apache.spark:spark-sql_2.10:jar:2.0.0 from/to central (https://repo.maven.apache.org/maven2):
GET request of: org/apache/spark/spark-sql_2.10/2.0.0/spark-sql_2.10-2.0.0.jar from central
failed: Connection reset -> [Help 1]
org.apache.maven.lifecycle.LifecycleExecutionException: Failed to execute goal on project
beam-sdks-java-io-hadoop-jdk1.8-tests: Could not resolve dependencies for project org.apache.beam:beam-sdks-java-io-hadoop-jdk1.8-tests:jar:2.2.0-SNAPSHOT:
Could not transfer artifact org.apache.spark:spark-sql_2.10:jar:2.0.0 from/to central (https://repo.maven.apache.org/maven2):
GET request of: org/apache/spark/spark-sql_2.10/2.0.0/spark-sql_2.10-2.0.0.jar from central
failed
	at org.apache.maven.lifecycle.internal.LifecycleDependencyResolver.getDependencies(LifecycleDependencyResolver.java:221)
	at org.apache.maven.lifecycle.internal.LifecycleDependencyResolver.resolveProjectDependencies(LifecycleDependencyResolver.java:127)
	at org.apache.maven.lifecycle.internal.MojoExecutor.ensureDependenciesAreResolved(MojoExecutor.java:257)
	at org.apache.maven.lifecycle.internal.MojoExecutor.execute(MojoExecutor.java:200)
	at org.apache.maven.lifecycle.internal.MojoExecutor.execute(MojoExecutor.java:153)
	at org.apache.maven.lifecycle.internal.MojoExecutor.execute(MojoExecutor.java:145)
	at org.apache.maven.lifecycle.internal.LifecycleModuleBuilder.buildProject(LifecycleModuleBuilder.java:116)
	at org.apache.maven.lifecycle.internal.LifecycleModuleBuilder.buildProject(LifecycleModuleBuilder.java:80)
	at org.apache.maven.lifecycle.internal.builder.singlethreaded.SingleThreadedBuilder.build(SingleThreadedBuilder.java:51)
	at org.apache.maven.lifecycle.internal.LifecycleStarter.execute(LifecycleStarter.java:128)
	at org.apache.maven.DefaultMaven.doExecute(DefaultMaven.java:307)
	at org.apache.maven.DefaultMaven.doExecute(DefaultMaven.java:193)
	at org.apache.maven.DefaultMaven.execute(DefaultMaven.java:106)
	at org.jvnet.hudson.maven3.launcher.Maven33Launcher.main(Maven33Launcher.java:129)
	at sun.reflect.NativeMethodAccessorImpl.invoke0(Native Method)
	at sun.reflect.NativeMethodAccessorImpl.invoke(NativeMethodAccessorImpl.java:62)
	at sun.reflect.DelegatingMethodAccessorImpl.invoke(DelegatingMethodAccessorImpl.java:43)
	at java.lang.reflect.Method.invoke(Method.java:498)
	at org.codehaus.plexus.classworlds.launcher.Launcher.launchStandard(Launcher.java:330)
	at org.codehaus.plexus.classworlds.launcher.Launcher.launch(Launcher.java:238)
	at jenkins.maven3.agent.Maven33Main.launch(Maven33Main.java:176)
	at sun.reflect.NativeMethodAccessorImpl.invoke0(Native Method)
	at sun.reflect.NativeMethodAccessorImpl.invoke(NativeMethodAccessorImpl.java:62)
	at sun.reflect.DelegatingMethodAccessorImpl.invoke(DelegatingMethodAccessorImpl.java:43)
	at java.lang.reflect.Method.invoke(Method.java:498)
	at hudson.maven.Maven3Builder.call(Maven3Builder.java:139)
	at hudson.maven.Maven3Builder.call(Maven3Builder.java:70)
	at hudson.remoting.UserRequest.perform(UserRequest.java:153)
	at hudson.remoting.UserRequest.perform(UserRequest.java:50)
	at hudson.remoting.Request$2.run(Request.java:336)
	at hudson.remoting.InterceptingExecutorService$1.call(InterceptingExecutorService.java:68)
	at java.util.concurrent.FutureTask.run(FutureTask.java:266)
	at java.util.concurrent.ThreadPoolExecutor.runWorker(ThreadPoolExecutor.java:1149)
	at java.util.concurrent.ThreadPoolExecutor$Worker.run(ThreadPoolExecutor.java:624)
	at java.lang.Thread.run(Thread.java:748)
Caused by: org.apache.maven.project.DependencyResolutionException: Could not resolve dependencies
for project org.apache.beam:beam-sdks-java-io-hadoop-jdk1.8-tests:jar:2.2.0-SNAPSHOT: Could
not transfer artifact org.apache.spark:spark-sql_2.10:jar:2.0.0 from/to central (https://repo.maven.apache.org/maven2):
GET request of: org/apache/spark/spark-sql_2.10/2.0.0/spark-sql_2.10-2.0.0.jar from central
failed
	at org.apache.maven.project.DefaultProjectDependenciesResolver.resolve(DefaultProjectDependenciesResolver.java:211)
	at org.apache.maven.lifecycle.internal.LifecycleDependencyResolver.getDependencies(LifecycleDependencyResolver.java:195)
	... 34 more
Caused by: org.eclipse.aether.resolution.DependencyResolutionException: Could not transfer
artifact org.apache.spark:spark-sql_2.10:jar:2.0.0 from/to central (https://repo.maven.apache.org/maven2):
GET request of: org/apache/spark/spark-sql_2.10/2.0.0/spark-sql_2.10-2.0.0.jar from central
failed
	at org.eclipse.aether.internal.impl.DefaultRepositorySystem.resolveDependencies(DefaultRepositorySystem.java:384)
	at org.apache.maven.project.DefaultProjectDependenciesResolver.resolve(DefaultProjectDependenciesResolver.java:205)
	... 35 more
Caused by: org.eclipse.aether.resolution.ArtifactResolutionException: Could not transfer artifact
org.apache.spark:spark-sql_2.10:jar:2.0.0 from/to central (https://repo.maven.apache.org/maven2):
GET request of: org/apache/spark/spark-sql_2.10/2.0.0/spark-sql_2.10-2.0.0.jar from central
failed
	at org.eclipse.aether.internal.impl.DefaultArtifactResolver.resolve(DefaultArtifactResolver.java:444)
	at org.eclipse.aether.internal.impl.DefaultArtifactResolver.resolveArtifacts(DefaultArtifactResolver.java:246)
	at org.eclipse.aether.internal.impl.DefaultRepositorySystem.resolveDependencies(DefaultRepositorySystem.java:367)
	... 36 more
Caused by: org.eclipse.aether.transfer.ArtifactTransferException: Could not transfer artifact
org.apache.spark:spark-sql_2.10:jar:2.0.0 from/to central (https://repo.maven.apache.org/maven2):
GET request of: org/apache/spark/spark-sql_2.10/2.0.0/spark-sql_2.10-2.0.0.jar from central
failed
	at org.eclipse.aether.connector.basic.ArtifactTransportListener.transferFailed(ArtifactTransportListener.java:43)
	at org.eclipse.aether.connector.basic.BasicRepositoryConnector$TaskRunner.run(BasicRepositoryConnector.java:355)
	at org.eclipse.aether.util.concurrency.RunnableErrorForwarder$1.run(RunnableErrorForwarder.java:67)
	... 3 more
Caused by: org.apache.maven.wagon.TransferFailedException: GET request of: org/apache/spark/spark-sql_2.10/2.0.0/spark-sql_2.10-2.0.0.jar
from central failed
	at org.apache.maven.wagon.AbstractWagon.getTransfer(AbstractWagon.java:363)
	at org.apache.maven.wagon.AbstractWagon.getTransfer(AbstractWagon.java:316)
	at org.apache.maven.wagon.AbstractWagon.getTransfer(AbstractWagon.java:285)
	at org.apache.maven.wagon.StreamWagon.getIfNewer(StreamWagon.java:97)
	at org.apache.maven.wagon.StreamWagon.get(StreamWagon.java:61)
	at org.eclipse.aether.transport.wagon.WagonTransporter$GetTaskRunner.run(WagonTransporter.java:560)
	at org.eclipse.aether.transport.wagon.WagonTransporter.execute(WagonTransporter.java:427)
	at org.eclipse.aether.transport.wagon.WagonTransporter.get(WagonTransporter.java:404)
	at org.eclipse.aether.connector.basic.BasicRepositoryConnector$GetTaskRunner.runTask(BasicRepositoryConnector.java:447)
	at org.eclipse.aether.connector.basic.BasicRepositoryConnector$TaskRunner.run(BasicRepositoryConnector.java:350)
	... 4 more
Caused by: java.net.SocketException: Connection reset
	at java.net.SocketInputStream.read(SocketInputStream.java:210)
	at java.net.SocketInputStream.read(SocketInputStream.java:141)
	at sun.security.ssl.InputRecord.readFully(InputRecord.java:465)
	at sun.security.ssl.InputRecord.readV3Record(InputRecord.java:593)
	at sun.security.ssl.InputRecord.read(InputRecord.java:532)
	at sun.security.ssl.SSLSocketImpl.readRecord(SSLSocketImpl.java:983)
	at sun.security.ssl.SSLSocketImpl.readDataRecord(SSLSocketImpl.java:940)
	at sun.security.ssl.AppInputStream.read(AppInputStream.java:105)
	at org.apache.maven.wagon.providers.http.httpclient.impl.io.SessionInputBufferImpl.streamRead(SessionInputBufferImpl.java:136)
	at org.apache.maven.wagon.providers.http.httpclient.impl.io.SessionInputBufferImpl.read(SessionInputBufferImpl.java:195)
	at org.apache.maven.wagon.providers.http.httpclient.impl.io.ContentLengthInputStream.read(ContentLengthInputStream.java:178)
	at org.apache.maven.wagon.providers.http.httpclient.conn.EofSensorInputStream.read(EofSensorInputStream.java:137)
	at org.apache.maven.wagon.AbstractWagon.transfer(AbstractWagon.java:531)
	at org.apache.maven.wagon.AbstractWagon.getTransfer(AbstractWagon.java:353)
	... 13 more
2017-09-01T19:38:57.051 [ERROR] 
2017-09-01T19:38:57.051 [ERROR] Re-run Maven using the -X switch to enable full debug logging.
2017-09-01T19:38:57.051 [ERROR] 
2017-09-01T19:38:57.051 [ERROR] For more information about the errors and possible solutions,
please read the following articles:
2017-09-01T19:38:57.051 [ERROR] [Help 1] http://cwiki.apache.org/confluence/display/MAVEN/DependencyResolutionException
2017-09-01T19:38:57.052 [ERROR] 
2017-09-01T19:38:57.052 [ERROR] After correcting the problems, you can resume the build with
the command
2017-09-01T19:38:57.052 [ERROR]   mvn <goals> -rf :beam-sdks-java-io-hadoop-jdk1.8-tests
channel stopped
Not sending mail to unregistered user ekirpichov@gmail.com

Mime
View raw message