beam-commits mailing list archives

Site index · List index
Message view « Date » · « Thread »
Top « Date » · « Thread »
From Apache Jenkins Server <jenk...@builds.apache.org>
Subject Build failed in Jenkins: beam_PostCommit_Java_MavenInstall #4773
Date Tue, 12 Sep 2017 00:53:24 GMT
See <https://builds.apache.org/job/beam_PostCommit_Java_MavenInstall/4773/display/redirect?page=changes>

Changes:

[relax] Add ability to set job labels to BEAM Java SDK

------------------------------------------
[...truncated 3.80 MB...]
2017-09-12T00:52:15.472 [INFO] <https://builds.apache.org/job/beam_PostCommit_Java_MavenInstall/ws/runners/flink/src/test/java/org/apache/beam/runners/flink/streaming/DoFnOperatorTest.java>:
Some input files use unchecked or unsafe operations.
2017-09-12T00:52:15.472 [INFO] <https://builds.apache.org/job/beam_PostCommit_Java_MavenInstall/ws/runners/flink/src/test/java/org/apache/beam/runners/flink/streaming/DoFnOperatorTest.java>:
Recompile with -Xlint:unchecked for details.
[WARNING] Cannot calculate digest of mojo class, because mojo wasn't loaded from a jar, but
from: <https://builds.apache.org/job/beam_PostCommit_Java_MavenInstall/ws/.repository/org/apache/maven/plugins/maven-compiler-plugin/3.6.2/maven-compiler-plugin-3.6.2.jar>
2017-09-12T00:52:15.581 [INFO] 
2017-09-12T00:52:15.581 [INFO] --- maven-checkstyle-plugin:2.17:check (default) @ beam-runners-flink_2.10
---
2017-09-12T00:52:16.791 [INFO] Starting audit...
Audit done.
[WARNING] Cannot calculate digest of mojo class, because mojo wasn't loaded from a jar, but
from: <https://builds.apache.org/job/beam_PostCommit_Java_MavenInstall/ws/.repository/org/apache/maven/plugins/maven-checkstyle-plugin/2.17/maven-checkstyle-plugin-2.17.jar>
2017-09-12T00:52:16.898 [INFO] 
2017-09-12T00:52:16.898 [INFO] >>> findbugs-maven-plugin:3.0.4:check (default) >
:findbugs @ beam-runners-flink_2.10 >>>
2017-09-12T00:52:16.915 [INFO] 
2017-09-12T00:52:16.915 [INFO] --- findbugs-maven-plugin:3.0.4:findbugs (findbugs) @ beam-runners-flink_2.10
---
2017-09-12T00:52:16.921 [INFO] Fork Value is true
[WARNING] Cannot calculate digest of mojo class, because mojo wasn't loaded from a jar, but
from: <https://builds.apache.org/job/beam_PostCommit_Java_MavenInstall/ws/.repository/org/codehaus/mojo/findbugs-maven-plugin/3.0.4/findbugs-maven-plugin-3.0.4.jar>
[WARNING] Cannot calculate digest of mojo class, because mojo wasn't loaded from a jar, but
from: <https://builds.apache.org/job/beam_PostCommit_Java_MavenInstall/ws/.repository/org/codehaus/mojo/findbugs-maven-plugin/3.0.4/findbugs-maven-plugin-3.0.4.jar>
[WARNING] Cannot calculate digest of mojo class, because mojo wasn't loaded from a jar, but
from: <https://builds.apache.org/job/beam_PostCommit_Java_MavenInstall/ws/.repository/org/codehaus/mojo/findbugs-maven-plugin/3.0.4/findbugs-maven-plugin-3.0.4.jar>
[JENKINS] Archiving disabled
2017-09-12T00:52:18.122 [INFO]                                                           
             
2017-09-12T00:52:18.122 [INFO] ------------------------------------------------------------------------
2017-09-12T00:52:18.122 [INFO] Skipping Apache Beam :: Parent
2017-09-12T00:52:18.122 [INFO] This project has been banned from the build due to previous
failures.
2017-09-12T00:52:18.122 [INFO] ------------------------------------------------------------------------
[JENKINS] Archiving disabled
[JENKINS] Archiving disabled
[JENKINS] Archiving disabled
[JENKINS] Archiving disabled
[JENKINS] Archiving disabled
[JENKINS] Archiving disabled
[JENKINS] Archiving disabled
[JENKINS] Archiving disabled
[JENKINS] Archiving disabled
[JENKINS] Archiving disabled
[JENKINS] Archiving disabled
[JENKINS] Archiving disabled
[JENKINS] Archiving disabled
[JENKINS] Archiving disabled
[JENKINS] Archiving disabled
[JENKINS] Archiving disabled
[JENKINS] Archiving disabled
[JENKINS] Archiving disabled
[JENKINS] Archiving disabled
[JENKINS] Archiving disabled
[JENKINS] Archiving disabled
[JENKINS] Archiving disabled
[JENKINS] Archiving disabled
[JENKINS] Archiving disabled
[JENKINS] Archiving disabled
[JENKINS] Archiving disabled
[JENKINS] Archiving disabled
[JENKINS] Archiving disabled
[JENKINS] Archiving disabled
[JENKINS] Archiving disabled
[JENKINS] Archiving disabled
[JENKINS] Archiving disabled
[JENKINS] Archiving disabled
[JENKINS] Archiving disabled
[JENKINS] Archiving disabled
[JENKINS] Archiving disabled
[JENKINS] Archiving disabled
[JENKINS] Archiving disabled
[JENKINS] Archiving disabled
[JENKINS] Archiving disabled
[JENKINS] Archiving disabled
[JENKINS] Archiving disabled
[JENKINS] Archiving disabled
[JENKINS] Archiving disabled
[JENKINS] Archiving disabled
[JENKINS] Archiving disabled
[JENKINS] Archiving disabled
[JENKINS] Archiving disabled
[JENKINS] Archiving disabled
[JENKINS] Archiving disabled
[JENKINS] Archiving disabled
[JENKINS] Archiving disabled
[JENKINS] Archiving disabled
[JENKINS] Archiving disabled
[JENKINS] Archiving disabled
[JENKINS] Archiving disabled
[JENKINS] Archiving disabled
[JENKINS] Archiving disabled
2017-09-12T00:53:13.984 [INFO] ------------------------------------------------------------------------
2017-09-12T00:53:13.984 [INFO] Reactor Summary:
2017-09-12T00:53:13.984 [INFO] 
2017-09-12T00:53:13.985 [INFO] Apache Beam :: Parent .............................. SUCCESS
[ 34.018 s]
2017-09-12T00:53:13.985 [INFO] Apache Beam :: SDKs :: Java :: Build Tools ......... SUCCESS
[ 12.434 s]
2017-09-12T00:53:13.985 [INFO] Apache Beam :: SDKs ................................ SUCCESS
[  6.223 s]
2017-09-12T00:53:13.985 [INFO] Apache Beam :: SDKs :: Common ...................... SUCCESS
[  3.065 s]
2017-09-12T00:53:13.985 [INFO] Apache Beam :: SDKs :: Common :: Runner API ........ SUCCESS
[ 38.077 s]
2017-09-12T00:53:13.985 [INFO] Apache Beam :: SDKs :: Common :: Fn API ............ SUCCESS
[ 19.208 s]
2017-09-12T00:53:13.985 [INFO] Apache Beam :: SDKs :: Java ........................ SUCCESS
[  3.570 s]
2017-09-12T00:53:13.985 [INFO] Apache Beam :: SDKs :: Java :: Core ................ SUCCESS
[02:45 min]
2017-09-12T00:53:13.985 [INFO] Apache Beam :: Runners ............................. SUCCESS
[  3.475 s]
2017-09-12T00:53:13.985 [INFO] Apache Beam :: Runners :: Core Construction Java ... SUCCESS
[ 53.745 s]
2017-09-12T00:53:13.985 [INFO] Apache Beam :: Runners :: Core Java ................ SUCCESS
[ 58.081 s]
2017-09-12T00:53:13.985 [INFO] Apache Beam :: Runners :: Direct Java .............. SUCCESS
[05:43 min]
2017-09-12T00:53:13.985 [INFO] Apache Beam :: SDKs :: Java :: IO .................. SUCCESS
[  3.195 s]
2017-09-12T00:53:13.985 [INFO] Apache Beam :: SDKs :: Java :: IO :: AMQP .......... SUCCESS
[ 46.403 s]
2017-09-12T00:53:13.985 [INFO] Apache Beam :: SDKs :: Java :: IO :: Common ........ SUCCESS
[  7.596 s]
2017-09-12T00:53:13.985 [INFO] Apache Beam :: SDKs :: Java :: IO :: Cassandra ..... SUCCESS
[ 36.908 s]
2017-09-12T00:53:13.985 [INFO] Apache Beam :: SDKs :: Java :: IO :: Elasticsearch . SUCCESS
[ 46.961 s]
2017-09-12T00:53:13.985 [INFO] Apache Beam :: SDKs :: Java :: Extensions .......... SUCCESS
[  3.034 s]
2017-09-12T00:53:13.985 [INFO] Apache Beam :: SDKs :: Java :: Extensions :: Google Cloud Platform
Core SUCCESS [ 45.786 s]
2017-09-12T00:53:13.985 [INFO] Apache Beam :: SDKs :: Java :: Extensions :: Protobuf SUCCESS
[ 28.908 s]
2017-09-12T00:53:13.985 [INFO] Apache Beam :: SDKs :: Java :: IO :: Google Cloud Platform
SUCCESS [01:55 min]
2017-09-12T00:53:13.985 [INFO] Apache Beam :: SDKs :: Java :: IO :: Hadoop Common . SUCCESS
[ 26.037 s]
2017-09-12T00:53:13.985 [INFO] Apache Beam :: SDKs :: Java :: IO :: Hadoop File System SUCCESS
[ 52.422 s]
2017-09-12T00:53:13.985 [INFO] Apache Beam :: SDKs :: Java :: IO :: Hadoop ........ SUCCESS
[  6.167 s]
2017-09-12T00:53:13.985 [INFO] Apache Beam :: SDKs :: Java :: IO :: Hadoop :: input-format
SUCCESS [ 36.539 s]
2017-09-12T00:53:13.985 [INFO] Apache Beam :: Runners :: Google Cloud Dataflow .... SUCCESS
[10:01 min]
2017-09-12T00:53:13.985 [INFO] Apache Beam :: SDKs :: Java :: IO :: Hadoop :: jdk1.8-tests
SUCCESS [01:50 min]
2017-09-12T00:53:13.985 [INFO] Apache Beam :: SDKs :: Java :: IO :: HBase ......... SUCCESS
[02:06 min]
2017-09-12T00:53:13.985 [INFO] Apache Beam :: SDKs :: Java :: IO :: HCatalog ...... SUCCESS
[01:21 min]
2017-09-12T00:53:13.985 [INFO] Apache Beam :: SDKs :: Java :: IO :: JDBC .......... SUCCESS
[ 49.308 s]
2017-09-12T00:53:13.985 [INFO] Apache Beam :: SDKs :: Java :: IO :: JMS ........... SUCCESS
[ 20.079 s]
2017-09-12T00:53:13.985 [INFO] Apache Beam :: SDKs :: Java :: IO :: Kafka ......... SUCCESS
[ 37.374 s]
2017-09-12T00:53:13.985 [INFO] Apache Beam :: SDKs :: Java :: IO :: Kinesis ....... SUCCESS
[ 21.692 s]
2017-09-12T00:53:13.985 [INFO] Apache Beam :: SDKs :: Java :: IO :: MongoDB ....... SUCCESS
[ 40.465 s]
2017-09-12T00:53:13.985 [INFO] Apache Beam :: SDKs :: Java :: IO :: MQTT .......... SUCCESS
[ 19.802 s]
2017-09-12T00:53:13.985 [INFO] Apache Beam :: SDKs :: Java :: IO :: Solr .......... SUCCESS
[ 36.841 s]
2017-09-12T00:53:13.985 [INFO] Apache Beam :: SDKs :: Java :: IO :: Tika .......... SUCCESS
[ 28.314 s]
2017-09-12T00:53:13.985 [INFO] Apache Beam :: SDKs :: Java :: IO :: XML ........... SUCCESS
[ 25.117 s]
2017-09-12T00:53:13.985 [INFO] Apache Beam :: SDKs :: Java :: Maven Archetypes .... SUCCESS
[  2.763 s]
2017-09-12T00:53:13.985 [INFO] Apache Beam :: SDKs :: Java :: Maven Archetypes :: Starter
SUCCESS [ 24.441 s]
2017-09-12T00:53:13.985 [INFO] Apache Beam :: Examples ............................ SUCCESS
[  3.301 s]
2017-09-12T00:53:13.985 [INFO] Apache Beam :: Examples :: Java .................... SUCCESS
[04:55 min]
2017-09-12T00:53:13.985 [INFO] Apache Beam :: SDKs :: Java :: Maven Archetypes :: Examples
SUCCESS [ 41.295 s]
2017-09-12T00:53:13.985 [INFO] Apache Beam :: Examples :: Java 8 .................. SUCCESS
[ 31.490 s]
2017-09-12T00:53:13.985 [INFO] Apache Beam :: SDKs :: Java :: Maven Archetypes :: Examples
- Java 8 SUCCESS [ 26.249 s]
2017-09-12T00:53:13.986 [INFO] Apache Beam :: SDKs :: Java :: Extensions :: Jackson SUCCESS
[ 15.186 s]
2017-09-12T00:53:13.986 [INFO] Apache Beam :: SDKs :: Java :: Extensions :: Join library SUCCESS
[ 22.876 s]
2017-09-12T00:53:13.986 [INFO] Apache Beam :: SDKs :: Java :: Extensions :: Sorter  SUCCESS
[ 29.558 s]
2017-09-12T00:53:13.986 [INFO] Apache Beam :: SDKs :: Java :: Extensions :: SQL ... SUCCESS
[ 52.669 s]
2017-09-12T00:53:13.986 [INFO] Apache Beam :: SDKs :: Java :: Nexmark ............. SUCCESS
[02:40 min]
2017-09-12T00:53:13.986 [INFO] Apache Beam :: SDKs :: Java :: Harness ............. SUCCESS
[ 39.407 s]
2017-09-12T00:53:13.986 [INFO] Apache Beam :: SDKs :: Java :: Java 8 Tests ........ SUCCESS
[ 18.773 s]
2017-09-12T00:53:13.986 [INFO] Apache Beam :: SDKs :: Python ...................... SUCCESS
[30:16 min]
2017-09-12T00:53:13.986 [INFO] Apache Beam :: Runners :: Flink .................... FAILURE
[ 15.245 s]
2017-09-12T00:53:13.986 [INFO] Apache Beam :: Runners :: Spark .................... SKIPPED
2017-09-12T00:53:13.986 [INFO] Apache Beam :: Runners :: Apex ..................... SKIPPED
2017-09-12T00:53:13.986 [INFO] Apache Beam :: Runners :: Gearpump ................. SKIPPED
2017-09-12T00:53:13.986 [INFO] Apache Beam :: SDKs :: Java :: Aggregated Javadoc .. SKIPPED
2017-09-12T00:53:13.986 [INFO] ------------------------------------------------------------------------
2017-09-12T00:53:13.986 [INFO] BUILD FAILURE
2017-09-12T00:53:13.986 [INFO] ------------------------------------------------------------------------
2017-09-12T00:53:13.986 [INFO] Total time: 01:25 h
2017-09-12T00:53:13.986 [INFO] Finished at: 2017-09-12T00:53:13+00:00
2017-09-12T00:53:14.875 [INFO] Final Memory: 343M/1770M
2017-09-12T00:53:14.875 [INFO] ------------------------------------------------------------------------
2017-09-12T00:53:14.882 [ERROR] Failed to execute goal org.codehaus.mojo:findbugs-maven-plugin:3.0.4:findbugs
(findbugs) on project beam-runners-flink_2.10: Execution findbugs of goal org.codehaus.mojo:findbugs-maven-plugin:3.0.4:findbugs
failed: The following error occurred while executing this line:
2017-09-12T00:53:14.882 [ERROR] Unable to find jar:<https://builds.apache.org/job/beam_PostCommit_Java_MavenInstall/ws/.repository/org/apache/ant/ant/1.9.4/ant-1.9.4.jar!/org/apache/tools/ant/antlib.xml>:
<https://builds.apache.org/job/beam_PostCommit_Java_MavenInstall/ws/.repository/org/apache/ant/ant/1.9.4/ant-1.9.4.jar>
(No such file or directory)
2017-09-12T00:53:14.882 [ERROR] -> [Help 1]
org.apache.maven.lifecycle.LifecycleExecutionException: Failed to execute goal org.codehaus.mojo:findbugs-maven-plugin:3.0.4:findbugs
(findbugs) on project beam-runners-flink_2.10: Execution findbugs of goal org.codehaus.mojo:findbugs-maven-plugin:3.0.4:findbugs
failed: The following error occurred while executing this line:
Unable to find jar:<https://builds.apache.org/job/beam_PostCommit_Java_MavenInstall/ws/.repository/org/apache/ant/ant/1.9.4/ant-1.9.4.jar!/org/apache/tools/ant/antlib.xml>
	at org.apache.maven.lifecycle.internal.MojoExecutor.execute(MojoExecutor.java:224)
	at org.apache.maven.lifecycle.internal.MojoExecutor.execute(MojoExecutor.java:153)
	at org.apache.maven.lifecycle.internal.MojoExecutor.execute(MojoExecutor.java:145)
	at org.apache.maven.lifecycle.internal.MojoExecutor.executeForkedExecutions(MojoExecutor.java:364)
	at org.apache.maven.lifecycle.internal.MojoExecutor.execute(MojoExecutor.java:198)
	at org.apache.maven.lifecycle.internal.MojoExecutor.execute(MojoExecutor.java:153)
	at org.apache.maven.lifecycle.internal.MojoExecutor.execute(MojoExecutor.java:145)
	at org.apache.maven.lifecycle.internal.LifecycleModuleBuilder.buildProject(LifecycleModuleBuilder.java:116)
	at org.apache.maven.lifecycle.internal.LifecycleModuleBuilder.buildProject(LifecycleModuleBuilder.java:80)
	at org.apache.maven.lifecycle.internal.builder.singlethreaded.SingleThreadedBuilder.build(SingleThreadedBuilder.java:51)
	at org.apache.maven.lifecycle.internal.LifecycleStarter.execute(LifecycleStarter.java:128)
	at org.apache.maven.DefaultMaven.doExecute(DefaultMaven.java:307)
	at org.apache.maven.DefaultMaven.doExecute(DefaultMaven.java:193)
	at org.apache.maven.DefaultMaven.execute(DefaultMaven.java:106)
	at org.jvnet.hudson.maven3.launcher.Maven33Launcher.main(Maven33Launcher.java:129)
	at sun.reflect.NativeMethodAccessorImpl.invoke0(Native Method)
	at sun.reflect.NativeMethodAccessorImpl.invoke(NativeMethodAccessorImpl.java:62)
	at sun.reflect.DelegatingMethodAccessorImpl.invoke(DelegatingMethodAccessorImpl.java:43)
	at java.lang.reflect.Method.invoke(Method.java:498)
	at org.codehaus.plexus.classworlds.launcher.Launcher.launchStandard(Launcher.java:330)
	at org.codehaus.plexus.classworlds.launcher.Launcher.launch(Launcher.java:238)
	at jenkins.maven3.agent.Maven33Main.launch(Maven33Main.java:176)
	at sun.reflect.NativeMethodAccessorImpl.invoke0(Native Method)
	at sun.reflect.NativeMethodAccessorImpl.invoke(NativeMethodAccessorImpl.java:62)
	at sun.reflect.DelegatingMethodAccessorImpl.invoke(DelegatingMethodAccessorImpl.java:43)
	at java.lang.reflect.Method.invoke(Method.java:498)
	at hudson.maven.Maven3Builder.call(Maven3Builder.java:139)
	at hudson.maven.Maven3Builder.call(Maven3Builder.java:70)
	at hudson.remoting.UserRequest.perform(UserRequest.java:153)
	at hudson.remoting.UserRequest.perform(UserRequest.java:50)
	at hudson.remoting.Request$2.run(Request.java:336)
	at hudson.remoting.InterceptingExecutorService$1.call(InterceptingExecutorService.java:68)
	at java.util.concurrent.FutureTask.run(FutureTask.java:266)
	at java.util.concurrent.ThreadPoolExecutor.runWorker(ThreadPoolExecutor.java:1149)
	at java.util.concurrent.ThreadPoolExecutor$Worker.run(ThreadPoolExecutor.java:624)
	at java.lang.Thread.run(Thread.java:748)
Caused by: org.apache.maven.plugin.PluginExecutionException: Execution findbugs of goal org.codehaus.mojo:findbugs-maven-plugin:3.0.4:findbugs
failed: The following error occurred while executing this line:
Unable to find jar:<https://builds.apache.org/job/beam_PostCommit_Java_MavenInstall/ws/.repository/org/apache/ant/ant/1.9.4/ant-1.9.4.jar!/org/apache/tools/ant/antlib.xml>
	at org.apache.maven.plugin.DefaultBuildPluginManager.executeMojo(DefaultBuildPluginManager.java:145)
	at org.apache.maven.lifecycle.internal.MojoExecutor.execute(MojoExecutor.java:208)
	... 35 more
Caused by: : The following error occurred while executing this line:
Unable to find jar:<https://builds.apache.org/job/beam_PostCommit_Java_MavenInstall/ws/.repository/org/apache/ant/ant/1.9.4/ant-1.9.4.jar!/org/apache/tools/ant/antlib.xml>
	at org.apache.tools.ant.ProjectHelper.addLocationToBuildException(ProjectHelper.java:568)
	at org.apache.tools.ant.taskdefs.Definer.loadAntlib(Definer.java:430)
	at org.apache.tools.ant.taskdefs.Definer.execute(Definer.java:277)
	at org.apache.tools.ant.ComponentHelper.checkNamespace(ComponentHelper.java:874)
	at org.apache.tools.ant.ComponentHelper.getDefinition(ComponentHelper.java:307)
	at org.apache.tools.ant.ComponentHelper.createComponent(ComponentHelper.java:284)
	at org.apache.tools.ant.ComponentHelper.createComponent(ComponentHelper.java:263)
	at org.apache.tools.ant.UnknownElement.makeObject(UnknownElement.java:429)
	at org.apache.tools.ant.UnknownElement.maybeConfigure(UnknownElement.java:163)
	at groovy.util.AntBuilder.performTask(AntBuilder.java:322)
	at groovy.util.AntBuilder.nodeCompleted(AntBuilder.java:272)
	at groovy.util.BuilderSupport.doInvokeMethod(BuilderSupport.java:154)
	at groovy.util.AntBuilder.doInvokeMethod(AntBuilder.java:207)
	at groovy.util.BuilderSupport.invokeMethod(BuilderSupport.java:67)
	at org.codehaus.groovy.runtime.callsite.PogoMetaClassSite.call(PogoMetaClassSite.java:48)
	at org.codehaus.groovy.runtime.callsite.AbstractCallSite.call(AbstractCallSite.java:133)
	at org.codehaus.mojo.findbugs.FindBugsMojo.executeFindbugs(FindBugsMojo.groovy:1049)
	at sun.reflect.GeneratedMethodAccessor491.invoke(Unknown Source)
	at sun.reflect.DelegatingMethodAccessorImpl.invoke(DelegatingMethodAccessorImpl.java:43)
	at java.lang.reflect.Method.invoke(Method.java:498)
	at org.codehaus.groovy.runtime.callsite.PogoMetaMethodSite$PogoCachedMethodSiteNoUnwrapNoCoerce.invoke(PogoMetaMethodSite.java:210)
	at org.codehaus.groovy.runtime.callsite.PogoMetaMethodSite.callCurrent(PogoMetaMethodSite.java:59)
	at org.codehaus.groovy.runtime.callsite.AbstractCallSite.callCurrent(AbstractCallSite.java:166)
	at org.codehaus.mojo.findbugs.FindBugsMojo.canGenerateReport(FindBugsMojo.groovy:562)
	at org.codehaus.mojo.findbugs.FindBugsMojo.execute(FindBugsMojo.groovy:701)
	at org.apache.maven.plugin.DefaultBuildPluginManager.executeMojo(DefaultBuildPluginManager.java:134)
	... 36 more
Caused by: Unable to find jar:<https://builds.apache.org/job/beam_PostCommit_Java_MavenInstall/ws/.repository/org/apache/ant/ant/1.9.4/ant-1.9.4.jar!/org/apache/tools/ant/antlib.xml>
	at org.apache.tools.ant.taskdefs.Antlib.createAntlib(Antlib.java:71)
	at org.apache.tools.ant.taskdefs.Definer.loadAntlib(Definer.java:425)
	... 60 more
Caused by: java.io.FileNotFoundException: <https://builds.apache.org/job/beam_PostCommit_Java_MavenInstall/ws/.repository/org/apache/ant/ant/1.9.4/ant-1.9.4.jar>
(No such file or directory)
	at java.util.zip.ZipFile.open(Native Method)
	at java.util.zip.ZipFile.<init>(ZipFile.java:225)
	at java.util.zip.ZipFile.<init>(ZipFile.java:155)
	at java.util.jar.JarFile.<init>(JarFile.java:166)
	at java.util.jar.JarFile.<init>(JarFile.java:103)
	at sun.net.www.protocol.jar.URLJarFile.<init>(URLJarFile.java:93)
	at sun.net.www.protocol.jar.URLJarFile.getJarFile(URLJarFile.java:69)
	at sun.net.www.protocol.jar.JarFileFactory.get(JarFileFactory.java:99)
	at sun.net.www.protocol.jar.JarURLConnection.connect(JarURLConnection.java:122)
	at org.apache.tools.ant.taskdefs.Antlib.createAntlib(Antlib.java:69)
	... 61 more
2017-09-12T00:53:14.883 [ERROR] 
2017-09-12T00:53:14.883 [ERROR] Re-run Maven using the -X switch to enable full debug logging.
2017-09-12T00:53:14.883 [ERROR] 
2017-09-12T00:53:14.883 [ERROR] For more information about the errors and possible solutions,
please read the following articles:
2017-09-12T00:53:14.883 [ERROR] [Help 1] http://cwiki.apache.org/confluence/display/MAVEN/PluginExecutionException
2017-09-12T00:53:14.883 [ERROR] 
2017-09-12T00:53:14.883 [ERROR] After correcting the problems, you can resume the build with
the command
2017-09-12T00:53:14.883 [ERROR]   mvn <goals> -rf :beam-runners-flink_2.10
channel stopped
Not sending mail to unregistered user relax@relax-macbookpro.roam.corp.google.com

Mime
View raw message