beam-commits mailing list archives

Site index · List index
Message view « Date » · « Thread »
Top « Date » · « Thread »
From Apache Jenkins Server <jenk...@builds.apache.org>
Subject Build failed in Jenkins: beam_PostCommit_Java_ValidatesRunner_Dataflow #3993
Date Tue, 19 Sep 2017 03:47:55 GMT
See <https://builds.apache.org/job/beam_PostCommit_Java_ValidatesRunner_Dataflow/3993/display/redirect>

------------------------------------------
[...truncated 3.33 MB...]
[WARNING] ByteKeyRangeTracker{range=ByteKeyRange{startKey=[6b6579303030303030303030], endKey=[6b6579303030303030303039]},
position=[6b6579303030303030303038]}: Rejecting split request at [6b657930303030303030303402000000000000]
because it is not after current position [6b6579303030303030303038].
[WARNING] After 101 concurrent splitting trials at item #5, observed only failure, giving
up on this item
[INFO] 423 total concurrent splitting trials for 9 items
[ERROR] At least 1 errors occurred writing to Bigtable. First 1 errors: 
Error mutating row KEY with mutations []: cell value missing
[INFO] About to split into bundles of size 5000 with sampleRowKeys length 10 first element
row_key: "key000000100"
offset_bytes: 10000

[INFO] Generated 20 splits. First split: BigtableSource{tableId=TEST-MANY-ROWS-SPLITS-TABLE,
filter=null, range=ByteKeyRange{startKey=[], endKey=[35b2bc981818181818189818]}, estimatedSizeBytes=5000}
[INFO] Adjusting range start from [] to [6b6579303030303030303030] as position of first returned
record
[INFO] Closing reader after reading 1000 records.
[INFO] Closing reader after reading 0 records.
[INFO] Adjusting range start from [35b2bc981818181818189818] to [6b6579303030303030303030]
as position of first returned record
[INFO] Closing reader after reading 100 records.
[INFO] Adjusting range start from [6b6579303030303030313030] to [6b6579303030303030313030]
as position of first returned record
[INFO] Closing reader after reading 100 records.
[INFO] Closing reader after reading 0 records.
[INFO] Adjusting range start from [6b6579303030303030323030] to [6b6579303030303030323030]
as position of first returned record
[INFO] Closing reader after reading 100 records.
[INFO] Closing reader after reading 0 records.
[INFO] Adjusting range start from [6b6579303030303030333030] to [6b6579303030303030333030]
as position of first returned record
[INFO] Closing reader after reading 100 records.
[INFO] Closing reader after reading 0 records.
[INFO] Adjusting range start from [6b6579303030303030343030] to [6b6579303030303030343030]
as position of first returned record
[INFO] Closing reader after reading 100 records.
[INFO] Closing reader after reading 0 records.
[INFO] Adjusting range start from [6b6579303030303030353030] to [6b6579303030303030353030]
as position of first returned record
[INFO] Closing reader after reading 100 records.
[INFO] Closing reader after reading 0 records.
[INFO] Adjusting range start from [6b6579303030303030363030] to [6b6579303030303030363030]
as position of first returned record
[INFO] Closing reader after reading 100 records.
[INFO] Closing reader after reading 0 records.
[INFO] Adjusting range start from [6b6579303030303030373030] to [6b6579303030303030373030]
as position of first returned record
[INFO] Closing reader after reading 100 records.
[INFO] Closing reader after reading 0 records.
[INFO] Adjusting range start from [6b6579303030303030383030] to [6b6579303030303030383030]
as position of first returned record
[INFO] Closing reader after reading 100 records.
[INFO] Closing reader after reading 0 records.
[INFO] Adjusting range start from [6b6579303030303030393030] to [6b6579303030303030393030]
as position of first returned record
[INFO] Closing reader after reading 100 records.
[INFO] Closing reader after reading 0 records.
[INFO] Wrote 1 records
[INFO] Adjusting range start from [] to [6b6579303030303030303030] as position of first returned
record
[INFO] Closing reader after reading 100 records.
[INFO] Enabling the use of null credentials. This should not be used in production.
2017-09-19T03:47:07.476 [INFO] Tests run: 27, Failures: 0, Errors: 0, Skipped: 0, Time elapsed:
5.674 s - in org.apache.beam.sdk.io.gcp.bigtable.BigtableIOTest
2017-09-19T03:47:07.476 [INFO] Running org.apache.beam.sdk.io.gcp.datastore.AdaptiveThrottlerTest
2017-09-19T03:47:07.652 [INFO] Tests run: 4, Failures: 0, Errors: 0, Skipped: 0, Time elapsed:
0.172 s - in org.apache.beam.sdk.io.gcp.datastore.AdaptiveThrottlerTest
2017-09-19T03:47:07.652 [INFO] Running org.apache.beam.sdk.io.gcp.datastore.DatastoreV1Test
[ERROR] Unable to update metrics on the current thread. Most likely caused by using metrics
outside the managed work-execution thread.
[INFO] Latest stats timestamp for kind testKind is 1234000000
[INFO] Estimated size bytes for the query is: 1342177280
[INFO] Splitting the query into 20 splits
[WARNING] Failed to translate Gql query 'SELECT * from DummyKind LIMIT 10 LIMIT 0': invalid
query
[WARNING] User query might have a limit already set, so trying without zero limit
[ERROR] Error writing batch of 200 mutations to Datastore (DEADLINE_EXCEEDED): 
[INFO] Latest stats timestamp for kind testKind is 1234000000
[INFO] Splitting the query into 100 splits
2017-09-19T03:47:18.761 [INFO] Tests run: 46, Failures: 0, Errors: 0, Skipped: 0, Time elapsed:
11.102 s - in org.apache.beam.sdk.io.gcp.datastore.DatastoreV1Test
2017-09-19T03:47:18.762 [INFO] Running org.apache.beam.sdk.io.gcp.spanner.SpannerIOWriteTest
2017-09-19T03:47:19.665 [INFO] Tests run: 10, Failures: 0, Errors: 0, Skipped: 0, Time elapsed:
0.898 s - in org.apache.beam.sdk.io.gcp.spanner.SpannerIOWriteTest
2017-09-19T03:47:19.666 [INFO] Running org.apache.beam.sdk.io.gcp.spanner.MutationSizeEstimatorTest
2017-09-19T03:47:19.715 [INFO] Tests run: 6, Failures: 0, Errors: 0, Skipped: 0, Time elapsed:
0.046 s - in org.apache.beam.sdk.io.gcp.spanner.MutationSizeEstimatorTest
2017-09-19T03:47:19.715 [INFO] Running org.apache.beam.sdk.io.gcp.spanner.SpannerIOReadTest
2017-09-19T03:47:20.370 [INFO] Tests run: 5, Failures: 0, Errors: 0, Skipped: 0, Time elapsed:
0.649 s - in org.apache.beam.sdk.io.gcp.spanner.SpannerIOReadTest
2017-09-19T03:47:20.372 [INFO] 
2017-09-19T03:47:20.373 [INFO] Results:
2017-09-19T03:47:20.373 [INFO] 
2017-09-19T03:47:20.373 [INFO] Tests run: 274, Failures: 0, Errors: 0, Skipped: 0
2017-09-19T03:47:20.373 [INFO] 
[JENKINS] Recording test results
2017-09-19T03:47:21.024 [INFO] 
2017-09-19T03:47:21.025 [INFO] --- build-helper-maven-plugin:3.0.0:regex-properties (render-artifact-id)
@ beam-sdks-java-io-google-cloud-platform ---
2017-09-19T03:47:21.238 [INFO] 
2017-09-19T03:47:21.238 [INFO] --- maven-jar-plugin:3.0.2:jar (default-jar) @ beam-sdks-java-io-google-cloud-platform
---
2017-09-19T03:47:21.292 [INFO] Building jar: <https://builds.apache.org/job/beam_PostCommit_Java_ValidatesRunner_Dataflow/ws/sdks/java/io/google-cloud-platform/target/beam-sdks-java-io-google-cloud-platform-2.2.0-SNAPSHOT.jar>
2017-09-19T03:47:21.451 [INFO] 
2017-09-19T03:47:21.451 [INFO] --- maven-site-plugin:3.5.1:attach-descriptor (attach-descriptor)
@ beam-sdks-java-io-google-cloud-platform ---
2017-09-19T03:47:21.664 [INFO] 
2017-09-19T03:47:21.665 [INFO] --- maven-jar-plugin:3.0.2:test-jar (default-test-jar) @ beam-sdks-java-io-google-cloud-platform
---
2017-09-19T03:47:21.687 [INFO] Building jar: <https://builds.apache.org/job/beam_PostCommit_Java_ValidatesRunner_Dataflow/ws/sdks/java/io/google-cloud-platform/target/beam-sdks-java-io-google-cloud-platform-2.2.0-SNAPSHOT-tests.jar>
2017-09-19T03:47:21.828 [INFO] 
2017-09-19T03:47:21.828 [INFO] --- maven-dependency-plugin:3.0.1:analyze-only (default) @
beam-sdks-java-io-google-cloud-platform ---
2017-09-19T03:47:22.052 [INFO] No dependency problems found
[JENKINS] Archiving disabled
2017-09-19T03:47:23.310 [INFO]                                                           
             
2017-09-19T03:47:23.310 [INFO] ------------------------------------------------------------------------
2017-09-19T03:47:23.310 [INFO] Building Apache Beam :: Runners :: Google Cloud Dataflow 2.2.0-SNAPSHOT
2017-09-19T03:47:23.310 [INFO] ------------------------------------------------------------------------
2017-09-19T03:47:23.325 [INFO] Downloading: https://repo.maven.apache.org/maven2/com/google/apis/google-api-services-dataflow/v1b3-rev198-1.22.0/google-api-services-dataflow-v1b3-rev198-1.22.0.pom
[INFO] I/O exception (java.net.SocketException) caught when processing request to {s}->https://repo.maven.apache.org:443:
Connection reset
[INFO] Retrying request to {s}->https://repo.maven.apache.org:443
2017-09-19T03:47:23.371 [INFO] Downloaded: https://repo.maven.apache.org/maven2/com/google/apis/google-api-services-dataflow/v1b3-rev198-1.22.0/google-api-services-dataflow-v1b3-rev198-1.22.0.pom
(3 KB at 56.0 KB/sec)
2017-09-19T03:47:23.373 [INFO] Downloading: https://repo.maven.apache.org/maven2/com/google/apis/google-api-services-clouddebugger/v2-rev8-1.22.0/google-api-services-clouddebugger-v2-rev8-1.22.0.pom
2017-09-19T03:47:23.399 [INFO] Downloaded: https://repo.maven.apache.org/maven2/com/google/apis/google-api-services-clouddebugger/v2-rev8-1.22.0/google-api-services-clouddebugger-v2-rev8-1.22.0.pom
(3 KB at 99.7 KB/sec)
2017-09-19T03:47:23.425 [INFO] Downloading: https://repo.maven.apache.org/maven2/com/google/apis/google-api-services-dataflow/v1b3-rev198-1.22.0/google-api-services-dataflow-v1b3-rev198-1.22.0.jar
2017-09-19T03:47:23.425 [INFO] Downloading: https://repo.maven.apache.org/maven2/com/google/apis/google-api-services-clouddebugger/v2-rev8-1.22.0/google-api-services-clouddebugger-v2-rev8-1.22.0.jar
[INFO] I/O exception (java.net.SocketException) caught when processing request to {s}->https://repo.maven.apache.org:443:
Connection reset
[INFO] Retrying request to {s}->https://repo.maven.apache.org:443
[INFO] I/O exception (java.net.SocketException) caught when processing request to {s}->https://repo.maven.apache.org:443:
Connection reset
[INFO] Retrying request to {s}->https://repo.maven.apache.org:443
[INFO] I/O exception (java.net.SocketException) caught when processing request to {s}->https://repo.maven.apache.org:443:
Connection reset
[INFO] Retrying request to {s}->https://repo.maven.apache.org:443
2017-09-19T03:47:23.485 [INFO] Downloaded: https://repo.maven.apache.org/maven2/com/google/apis/google-api-services-dataflow/v1b3-rev198-1.22.0/google-api-services-dataflow-v1b3-rev198-1.22.0.jar
(188 KB at 3118.5 KB/sec)
2017-09-19T03:47:23.627 [INFO] Downloaded: https://repo.maven.apache.org/maven2/com/google/apis/google-api-services-clouddebugger/v2-rev8-1.22.0/google-api-services-clouddebugger-v2-rev8-1.22.0.jar
(52 KB at 256.2 KB/sec)
2017-09-19T03:47:23.630 [INFO] 
2017-09-19T03:47:23.630 [INFO] --- maven-clean-plugin:3.0.0:clean (default-clean) @ beam-runners-google-cloud-dataflow-java
---
2017-09-19T03:47:23.631 [INFO] Deleting <https://builds.apache.org/job/beam_PostCommit_Java_ValidatesRunner_Dataflow/ws/runners/google-cloud-dataflow-java>
(includes = [**/*.pyc, **/*.egg-info/, **/sdks/python/LICENSE, **/sdks/python/NOTICE, **/sdks/python/README.md],
excludes = [])
2017-09-19T03:47:23.739 [INFO] 
2017-09-19T03:47:23.739 [INFO] --- maven-enforcer-plugin:3.0.0-M1:enforce (enforce) @ beam-runners-google-cloud-dataflow-java
---
2017-09-19T03:47:25.270 [INFO] 
2017-09-19T03:47:25.270 [INFO] --- maven-enforcer-plugin:3.0.0-M1:enforce (enforce-banned-dependencies)
@ beam-runners-google-cloud-dataflow-java ---
2017-09-19T03:47:25.419 [INFO] 
2017-09-19T03:47:25.419 [INFO] --- jacoco-maven-plugin:0.7.8:prepare-agent (default) @ beam-runners-google-cloud-dataflow-java
---
2017-09-19T03:47:25.420 [INFO] argLine set to -javaagent:<https://builds.apache.org/job/beam_PostCommit_Java_ValidatesRunner_Dataflow/ws/.repository/org/jacoco/org.jacoco.agent/0.7.8/org.jacoco.agent-0.7.8-runtime.jar=destfile=/home/jenkins/jenkins-slave/workspace/beam_PostCommit_Java_ValidatesRunner_Dataflow/runners/google-cloud-dataflow-java/target/jacoco.exec,excludes=**/AutoValue_*.class,dumponexit=true,output=file>
2017-09-19T03:47:25.526 [INFO] 
2017-09-19T03:47:25.527 [INFO] --- maven-remote-resources-plugin:1.5:process (process-resource-bundles)
@ beam-runners-google-cloud-dataflow-java ---
2017-09-19T03:47:26.663 [INFO] 
2017-09-19T03:47:26.663 [INFO] --- maven-resources-plugin:3.0.2:resources (default-resources)
@ beam-runners-google-cloud-dataflow-java ---
2017-09-19T03:47:26.664 [INFO] Using 'UTF-8' encoding to copy filtered resources.
2017-09-19T03:47:26.665 [INFO] Copying 1 resource
2017-09-19T03:47:26.666 [INFO] Copying 3 resources
2017-09-19T03:47:26.773 [INFO] 
2017-09-19T03:47:26.773 [INFO] --- maven-compiler-plugin:3.6.2:compile (default-compile) @
beam-runners-google-cloud-dataflow-java ---
2017-09-19T03:47:26.788 [INFO] Changes detected - recompiling the module!
2017-09-19T03:47:26.788 [INFO] Compiling 57 source files to <https://builds.apache.org/job/beam_PostCommit_Java_ValidatesRunner_Dataflow/ws/runners/google-cloud-dataflow-java/target/classes>
2017-09-19T03:47:29.440 [WARNING] bootstrap class path not set in conjunction with -source
1.7
2017-09-19T03:47:29.440 [WARNING] <https://builds.apache.org/job/beam_PostCommit_Java_ValidatesRunner_Dataflow/ws/runners/google-cloud-dataflow-java/src/main/java/org/apache/beam/runners/dataflow/internal/IsmFormat.java>:[116,31]
An @AutoValue property that is a primitive array returns the original array, which can therefore
be modified by the caller. If this OK, you can suppress this warning with @SuppressWarnings("mutable").
Otherwise, you should replace the property with an immutable type, perhaps a simple wrapper
around the original array.
2017-09-19T03:47:29.440 [INFO] <https://builds.apache.org/job/beam_PostCommit_Java_ValidatesRunner_Dataflow/ws/runners/google-cloud-dataflow-java/src/main/java/org/apache/beam/runners/dataflow/ReshuffleOverrideFactory.java>:
Some input files use or override a deprecated API.
2017-09-19T03:47:29.440 [INFO] <https://builds.apache.org/job/beam_PostCommit_Java_ValidatesRunner_Dataflow/ws/runners/google-cloud-dataflow-java/src/main/java/org/apache/beam/runners/dataflow/ReshuffleOverrideFactory.java>:
Recompile with -Xlint:deprecation for details.
2017-09-19T03:47:29.440 [INFO] <https://builds.apache.org/job/beam_PostCommit_Java_ValidatesRunner_Dataflow/ws/runners/google-cloud-dataflow-java/src/main/java/org/apache/beam/runners/dataflow/util/CloudObjects.java>:
Some input files use unchecked or unsafe operations.
2017-09-19T03:47:29.440 [INFO] <https://builds.apache.org/job/beam_PostCommit_Java_ValidatesRunner_Dataflow/ws/runners/google-cloud-dataflow-java/src/main/java/org/apache/beam/runners/dataflow/util/CloudObjects.java>:
Recompile with -Xlint:unchecked for details.
2017-09-19T03:47:29.646 [INFO] 
2017-09-19T03:47:29.646 [INFO] --- maven-resources-plugin:3.0.2:testResources (default-testResources)
@ beam-runners-google-cloud-dataflow-java ---
2017-09-19T03:47:29.648 [INFO] Using 'UTF-8' encoding to copy filtered resources.
2017-09-19T03:47:29.648 [INFO] skip non existing resourceDirectory <https://builds.apache.org/job/beam_PostCommit_Java_ValidatesRunner_Dataflow/ws/runners/google-cloud-dataflow-java/src/test/resources>
2017-09-19T03:47:29.648 [INFO] Copying 3 resources
2017-09-19T03:47:29.755 [INFO] 
2017-09-19T03:47:29.755 [INFO] --- maven-compiler-plugin:3.6.2:testCompile (default-testCompile)
@ beam-runners-google-cloud-dataflow-java ---
2017-09-19T03:47:29.767 [INFO] Changes detected - recompiling the module!
2017-09-19T03:47:29.768 [INFO] Compiling 23 source files to <https://builds.apache.org/job/beam_PostCommit_Java_ValidatesRunner_Dataflow/ws/runners/google-cloud-dataflow-java/target/test-classes>
2017-09-19T03:47:30.994 [INFO] <https://builds.apache.org/job/beam_PostCommit_Java_ValidatesRunner_Dataflow/ws/runners/google-cloud-dataflow-java/src/test/java/org/apache/beam/runners/dataflow/util/RandomAccessDataTest.java>:
Some input files use or override a deprecated API.
2017-09-19T03:47:30.994 [INFO] <https://builds.apache.org/job/beam_PostCommit_Java_ValidatesRunner_Dataflow/ws/runners/google-cloud-dataflow-java/src/test/java/org/apache/beam/runners/dataflow/util/RandomAccessDataTest.java>:
Recompile with -Xlint:deprecation for details.
2017-09-19T03:47:30.994 [INFO] <https://builds.apache.org/job/beam_PostCommit_Java_ValidatesRunner_Dataflow/ws/runners/google-cloud-dataflow-java/src/test/java/org/apache/beam/runners/dataflow/DataflowMetricsTest.java>:
Some input files use unchecked or unsafe operations.
2017-09-19T03:47:30.994 [INFO] <https://builds.apache.org/job/beam_PostCommit_Java_ValidatesRunner_Dataflow/ws/runners/google-cloud-dataflow-java/src/test/java/org/apache/beam/runners/dataflow/DataflowMetricsTest.java>:
Recompile with -Xlint:unchecked for details.
2017-09-19T03:47:31.370 [INFO] 
2017-09-19T03:47:31.370 [INFO] --- maven-checkstyle-plugin:2.17:check (default) @ beam-runners-google-cloud-dataflow-java
---
2017-09-19T03:47:35.772 [INFO] Starting audit...
[ERROR] <https://builds.apache.org/job/beam_PostCommit_Java_ValidatesRunner_Dataflow/ws/runners/google-cloud-dataflow-java/src/main/java/org/apache/beam/runners/dataflow/DataflowPipelineTranslator.java>:60:
Import org.apache.beam.runners.core.construction.SplittableParDo appears after other imports
that it should precede [ImportOrder]
[ERROR] <https://builds.apache.org/job/beam_PostCommit_Java_ValidatesRunner_Dataflow/ws/runners/google-cloud-dataflow-java/src/test/java/org/apache/beam/runners/dataflow/DataflowPipelineTranslatorTest.java>:70:
Import org.apache.beam.runners.dataflow.DataflowPipelineTranslator.JobSpecification appears
after other imports that it should precede [ImportOrder]
Audit done.
2017-09-19T03:47:35.773 [INFO] There are 2 errors reported by Checkstyle 6.19 with beam/checkstyle.xml
ruleset.
2017-09-19T03:47:35.775 [ERROR] src/main/java/org/apache/beam/runners/dataflow/DataflowPipelineTranslator.java:[60]
(imports) ImportOrder: Import org.apache.beam.runners.core.construction.SplittableParDo appears
after other imports that it should precede
2017-09-19T03:47:35.775 [ERROR] src/test/java/org/apache/beam/runners/dataflow/DataflowPipelineTranslatorTest.java:[70]
(imports) ImportOrder: Import org.apache.beam.runners.dataflow.DataflowPipelineTranslator.JobSpecification
appears after other imports that it should precede
[JENKINS] Archiving disabled
[JENKINS] Archiving disabled
[JENKINS] Archiving disabled
[JENKINS] Archiving disabled
[JENKINS] Archiving disabled
[JENKINS] Archiving disabled
[JENKINS] Archiving disabled
[JENKINS] Archiving disabled
[JENKINS] Archiving disabled
[JENKINS] Archiving disabled
[JENKINS] Archiving disabled
[JENKINS] Archiving disabled
[JENKINS] Archiving disabled
[JENKINS] Archiving disabled
[JENKINS] Archiving disabled
[JENKINS] Archiving disabled
[JENKINS] Archiving disabled
[JENKINS] Archiving disabled
[JENKINS] Archiving disabled
2017-09-19T03:47:47.029 [INFO] ------------------------------------------------------------------------
2017-09-19T03:47:47.029 [INFO] Reactor Summary:
2017-09-19T03:47:47.029 [INFO] 
2017-09-19T03:47:47.029 [INFO] Apache Beam :: Parent .............................. SUCCESS
[ 23.118 s]
2017-09-19T03:47:47.029 [INFO] Apache Beam :: SDKs :: Java :: Build Tools ......... SUCCESS
[ 10.803 s]
2017-09-19T03:47:47.029 [INFO] Apache Beam :: SDKs ................................ SUCCESS
[  2.363 s]
2017-09-19T03:47:47.029 [INFO] Apache Beam :: SDKs :: Common ...................... SUCCESS
[  2.119 s]
2017-09-19T03:47:47.029 [INFO] Apache Beam :: SDKs :: Common :: Runner API ........ SUCCESS
[ 24.738 s]
2017-09-19T03:47:47.029 [INFO] Apache Beam :: SDKs :: Common :: Fn API ............ SUCCESS
[ 13.210 s]
2017-09-19T03:47:47.029 [INFO] Apache Beam :: SDKs :: Java ........................ SUCCESS
[  2.261 s]
2017-09-19T03:47:47.029 [INFO] Apache Beam :: SDKs :: Java :: Core ................ SUCCESS
[01:21 min]
2017-09-19T03:47:47.029 [INFO] Apache Beam :: Runners ............................. SUCCESS
[  2.099 s]
2017-09-19T03:47:47.029 [INFO] Apache Beam :: Runners :: Core Construction Java ... SUCCESS
[ 13.000 s]
2017-09-19T03:47:47.029 [INFO] Apache Beam :: Runners :: Core Java ................ SUCCESS
[ 26.714 s]
2017-09-19T03:47:47.029 [INFO] Apache Beam :: Runners :: Direct Java .............. SUCCESS
[04:02 min]
2017-09-19T03:47:47.029 [INFO] Apache Beam :: SDKs :: Java :: IO .................. SUCCESS
[  2.272 s]
2017-09-19T03:47:47.029 [INFO] Apache Beam :: SDKs :: Java :: Extensions .......... SUCCESS
[  2.296 s]
2017-09-19T03:47:47.030 [INFO] Apache Beam :: SDKs :: Java :: Extensions :: Google Cloud Platform
Core SUCCESS [ 14.068 s]
2017-09-19T03:47:47.030 [INFO] Apache Beam :: SDKs :: Java :: Extensions :: Protobuf SUCCESS
[ 16.284 s]
2017-09-19T03:47:47.030 [INFO] Apache Beam :: SDKs :: Java :: IO :: Google Cloud Platform
SUCCESS [01:11 min]
2017-09-19T03:47:47.030 [INFO] Apache Beam :: Runners :: Google Cloud Dataflow .... FAILURE
[ 12.902 s]
2017-09-19T03:47:47.030 [INFO] ------------------------------------------------------------------------
2017-09-19T03:47:47.030 [INFO] BUILD FAILURE
2017-09-19T03:47:47.030 [INFO] ------------------------------------------------------------------------
2017-09-19T03:47:47.030 [INFO] Total time: 10:23 min
2017-09-19T03:47:47.030 [INFO] Finished at: 2017-09-19T03:47:47+00:00
2017-09-19T03:47:48.087 [INFO] Final Memory: 196M/1823M
2017-09-19T03:47:48.087 [INFO] ------------------------------------------------------------------------
2017-09-19T03:47:48.095 [ERROR] Failed to execute goal org.apache.maven.plugins:maven-checkstyle-plugin:2.17:check
(default) on project beam-runners-google-cloud-dataflow-java: You have 2 Checkstyle violations.
-> [Help 1]
org.apache.maven.lifecycle.LifecycleExecutionException: Failed to execute goal org.apache.maven.plugins:maven-checkstyle-plugin:2.17:check
(default) on project beam-runners-google-cloud-dataflow-java: You have 2 Checkstyle violations.
	at org.apache.maven.lifecycle.internal.MojoExecutor.execute(MojoExecutor.java:212)
	at org.apache.maven.lifecycle.internal.MojoExecutor.execute(MojoExecutor.java:153)
	at org.apache.maven.lifecycle.internal.MojoExecutor.execute(MojoExecutor.java:145)
	at org.apache.maven.lifecycle.internal.LifecycleModuleBuilder.buildProject(LifecycleModuleBuilder.java:116)
	at org.apache.maven.lifecycle.internal.LifecycleModuleBuilder.buildProject(LifecycleModuleBuilder.java:80)
	at org.apache.maven.lifecycle.internal.builder.singlethreaded.SingleThreadedBuilder.build(SingleThreadedBuilder.java:51)
	at org.apache.maven.lifecycle.internal.LifecycleStarter.execute(LifecycleStarter.java:128)
	at org.apache.maven.DefaultMaven.doExecute(DefaultMaven.java:307)
	at org.apache.maven.DefaultMaven.doExecute(DefaultMaven.java:193)
	at org.apache.maven.DefaultMaven.execute(DefaultMaven.java:106)
	at org.jvnet.hudson.maven3.launcher.Maven33Launcher.main(Maven33Launcher.java:129)
	at sun.reflect.NativeMethodAccessorImpl.invoke0(Native Method)
	at sun.reflect.NativeMethodAccessorImpl.invoke(NativeMethodAccessorImpl.java:62)
	at sun.reflect.DelegatingMethodAccessorImpl.invoke(DelegatingMethodAccessorImpl.java:43)
	at java.lang.reflect.Method.invoke(Method.java:498)
	at org.codehaus.plexus.classworlds.launcher.Launcher.launchStandard(Launcher.java:330)
	at org.codehaus.plexus.classworlds.launcher.Launcher.launch(Launcher.java:238)
	at jenkins.maven3.agent.Maven33Main.launch(Maven33Main.java:176)
	at sun.reflect.NativeMethodAccessorImpl.invoke0(Native Method)
	at sun.reflect.NativeMethodAccessorImpl.invoke(NativeMethodAccessorImpl.java:62)
	at sun.reflect.DelegatingMethodAccessorImpl.invoke(DelegatingMethodAccessorImpl.java:43)
	at java.lang.reflect.Method.invoke(Method.java:498)
	at hudson.maven.Maven3Builder.call(Maven3Builder.java:139)
	at hudson.maven.Maven3Builder.call(Maven3Builder.java:70)
	at hudson.remoting.UserRequest.perform(UserRequest.java:153)
	at hudson.remoting.UserRequest.perform(UserRequest.java:50)
	at hudson.remoting.Request$2.run(Request.java:336)
	at hudson.remoting.InterceptingExecutorService$1.call(InterceptingExecutorService.java:68)
	at java.util.concurrent.FutureTask.run(FutureTask.java:266)
	at java.util.concurrent.ThreadPoolExecutor.runWorker(ThreadPoolExecutor.java:1149)
	at java.util.concurrent.ThreadPoolExecutor$Worker.run(ThreadPoolExecutor.java:624)
	at java.lang.Thread.run(Thread.java:748)
Caused by: org.apache.maven.plugin.MojoFailureException: You have 2 Checkstyle violations.
	at org.apache.maven.plugin.checkstyle.CheckstyleViolationCheckMojo.execute(CheckstyleViolationCheckMojo.java:588)
	at org.apache.maven.plugin.DefaultBuildPluginManager.executeMojo(DefaultBuildPluginManager.java:134)
	at org.apache.maven.lifecycle.internal.MojoExecutor.execute(MojoExecutor.java:208)
	... 31 more
2017-09-19T03:47:48.097 [ERROR] 
2017-09-19T03:47:48.097 [ERROR] Re-run Maven using the -X switch to enable full debug logging.
2017-09-19T03:47:48.097 [ERROR] 
2017-09-19T03:47:48.098 [ERROR] For more information about the errors and possible solutions,
please read the following articles:
2017-09-19T03:47:48.098 [ERROR] [Help 1] http://cwiki.apache.org/confluence/display/MAVEN/MojoFailureException
2017-09-19T03:47:48.098 [ERROR] 
2017-09-19T03:47:48.098 [ERROR] After correcting the problems, you can resume the build with
the command
2017-09-19T03:47:48.098 [ERROR]   mvn <goals> -rf :beam-runners-google-cloud-dataflow-java
channel stopped

Mime
View raw message