beam-commits mailing list archives

Site index · List index
Message view « Date » · « Thread »
Top « Date » · « Thread »
From Apache Jenkins Server <jenk...@builds.apache.org>
Subject Build failed in Jenkins: beam_PostCommit_Java_MavenInstall #4764
Date Mon, 11 Sep 2017 06:04:12 GMT
See <https://builds.apache.org/job/beam_PostCommit_Java_MavenInstall/4764/display/redirect>

------------------------------------------
[...truncated 283.46 KB...]
2017-09-11T06:03:31.124 [INFO] Downloaded: https://repo.maven.apache.org/maven2/org/apache/commons/commons-parent/14/commons-parent-14.pom
(31 KB at 1057.0 KB/sec)
2017-09-11T06:03:31.127 [INFO] Downloading: https://repo.maven.apache.org/maven2/org/apache/maven/plugin-tools/maven-plugin-annotations/3.5/maven-plugin-annotations-3.5.pom
2017-09-11T06:03:31.154 [INFO] Downloaded: https://repo.maven.apache.org/maven2/org/apache/maven/plugin-tools/maven-plugin-annotations/3.5/maven-plugin-annotations-3.5.pom
(2 KB at 60.4 KB/sec)
2017-09-11T06:03:31.156 [INFO] Downloading: https://repo.maven.apache.org/maven2/org/apache/maven/plugin-tools/maven-plugin-tools/3.5/maven-plugin-tools-3.5.pom
2017-09-11T06:03:31.184 [INFO] Downloaded: https://repo.maven.apache.org/maven2/org/apache/maven/plugin-tools/maven-plugin-tools/3.5/maven-plugin-tools-3.5.pom
(16 KB at 564.7 KB/sec)
2017-09-11T06:03:31.187 [INFO] Downloading: https://repo.maven.apache.org/maven2/org/codehaus/plexus/plexus-resources/1.0.1/plexus-resources-1.0.1.pom
2017-09-11T06:03:31.213 [INFO] Downloaded: https://repo.maven.apache.org/maven2/org/codehaus/plexus/plexus-resources/1.0.1/plexus-resources-1.0.1.pom
(2 KB at 49.5 KB/sec)
2017-09-11T06:03:31.215 [INFO] Downloading: https://repo.maven.apache.org/maven2/org/codehaus/plexus/plexus-utils/3.0.8/plexus-utils-3.0.8.pom
2017-09-11T06:03:31.241 [INFO] Downloaded: https://repo.maven.apache.org/maven2/org/codehaus/plexus/plexus-utils/3.0.8/plexus-utils-3.0.8.pom
(4 KB at 118.0 KB/sec)
2017-09-11T06:03:31.245 [INFO] Downloading: https://repo.maven.apache.org/maven2/com/google/guava/guava/20.0/guava-20.0.jar
2017-09-11T06:03:31.245 [INFO] Downloading: https://repo.maven.apache.org/maven2/net/revelc/code/formatter/jdt-core/2.0.1/jdt-core-2.0.1.jar
2017-09-11T06:03:31.245 [INFO] Downloading: https://repo.maven.apache.org/maven2/net/revelc/code/formatter/jsdt-core/2.0.1/jsdt-core-2.0.1.jar
2017-09-11T06:03:31.249 [INFO] Downloading: https://repo.maven.apache.org/maven2/cglib/cglib/2.2.2/cglib-2.2.2.jar
2017-09-11T06:03:31.250 [INFO] Downloading: https://repo.maven.apache.org/maven2/org/apache/commons/commons-digester3/3.2/commons-digester3-3.2.jar
2017-09-11T06:03:31.295 [INFO] Downloaded: https://repo.maven.apache.org/maven2/org/apache/commons/commons-digester3/3.2/commons-digester3-3.2.jar
(236 KB at 4719.0 KB/sec)
2017-09-11T06:03:31.295 [INFO] Downloading: https://repo.maven.apache.org/maven2/asm/asm/3.3.1/asm-3.3.1.jar
2017-09-11T06:03:31.300 [INFO] Downloaded: https://repo.maven.apache.org/maven2/cglib/cglib/2.2.2/cglib-2.2.2.jar
(281 KB at 5099.3 KB/sec)
2017-09-11T06:03:31.301 [INFO] Downloading: https://repo.maven.apache.org/maven2/commons-beanutils/commons-beanutils/1.8.3/commons-beanutils-1.8.3.jar
2017-09-11T06:03:31.322 [INFO] Downloaded: https://repo.maven.apache.org/maven2/asm/asm/3.3.1/asm-3.3.1.jar
(43 KB at 583.0 KB/sec)
2017-09-11T06:03:31.322 [INFO] Downloading: https://repo.maven.apache.org/maven2/org/apache/maven/plugin-tools/maven-plugin-annotations/3.5/maven-plugin-annotations-3.5.jar
2017-09-11T06:03:31.345 [INFO] Downloaded: https://repo.maven.apache.org/maven2/commons-beanutils/commons-beanutils/1.8.3/commons-beanutils-1.8.3.jar
(227 KB at 2360.2 KB/sec)
2017-09-11T06:03:31.345 [INFO] Downloading: https://repo.maven.apache.org/maven2/org/codehaus/plexus/plexus-resources/1.0.1/plexus-resources-1.0.1.jar
2017-09-11T06:03:31.348 [INFO] Downloaded: https://repo.maven.apache.org/maven2/org/apache/maven/plugin-tools/maven-plugin-annotations/3.5/maven-plugin-annotations-3.5.jar
(14 KB at 141.1 KB/sec)
2017-09-11T06:03:31.373 [INFO] Downloaded: https://repo.maven.apache.org/maven2/org/codehaus/plexus/plexus-resources/1.0.1/plexus-resources-1.0.1.jar
(22 KB at 172.3 KB/sec)
2017-09-11T06:03:31.551 [INFO] Downloaded: https://repo.maven.apache.org/maven2/com/google/guava/guava/20.0/guava-20.0.jar
(2386 KB at 7795.3 KB/sec)
2017-09-11T06:03:34.318 [INFO] Downloaded: https://repo.maven.apache.org/maven2/net/revelc/code/formatter/jdt-core/2.0.1/jdt-core-2.0.1.jar
(19470 KB at 6335.7 KB/sec)
[WARNING] Failed to getClass for net.revelc.code.formatter.FormatterMojo
[JENKINS] Archiving disabled
2017-09-11T06:03:35.472 [INFO]                                                           
             
2017-09-11T06:03:35.472 [INFO] ------------------------------------------------------------------------
2017-09-11T06:03:35.472 [INFO] Skipping Apache Beam :: Parent
2017-09-11T06:03:35.472 [INFO] This project has been banned from the build due to previous
failures.
2017-09-11T06:03:35.472 [INFO] ------------------------------------------------------------------------
[JENKINS] Archiving disabled
[JENKINS] Archiving disabled
[JENKINS] Archiving disabled
[JENKINS] Archiving disabled
[JENKINS] Archiving disabled
[JENKINS] Archiving disabled
[JENKINS] Archiving disabled
[JENKINS] Archiving disabled
[JENKINS] Archiving disabled
[JENKINS] Archiving disabled
[JENKINS] Archiving disabled
[JENKINS] Archiving disabled
[JENKINS] Archiving disabled
[JENKINS] Archiving disabled
[JENKINS] Archiving disabled
[JENKINS] Archiving disabled
[JENKINS] Archiving disabled
[JENKINS] Archiving disabled
[JENKINS] Archiving disabled
[JENKINS] Archiving disabled
[JENKINS] Archiving disabled
[JENKINS] Archiving disabled
[JENKINS] Archiving disabled
[JENKINS] Archiving disabled
[JENKINS] Archiving disabled
[JENKINS] Archiving disabled
[JENKINS] Archiving disabled
[JENKINS] Archiving disabled
[JENKINS] Archiving disabled
[JENKINS] Archiving disabled
[JENKINS] Archiving disabled
[JENKINS] Archiving disabled
[JENKINS] Archiving disabled
[JENKINS] Archiving disabled
[JENKINS] Archiving disabled
[JENKINS] Archiving disabled
[JENKINS] Archiving disabled
[JENKINS] Archiving disabled
[JENKINS] Archiving disabled
[JENKINS] Archiving disabled
[JENKINS] Archiving disabled
[JENKINS] Archiving disabled
[JENKINS] Archiving disabled
[JENKINS] Archiving disabled
[JENKINS] Archiving disabled
[JENKINS] Archiving disabled
[JENKINS] Archiving disabled
[JENKINS] Archiving disabled
[JENKINS] Archiving disabled
[JENKINS] Archiving disabled
[JENKINS] Archiving disabled
[JENKINS] Archiving disabled
[JENKINS] Archiving disabled
[JENKINS] Archiving disabled
[JENKINS] Archiving disabled
[JENKINS] Archiving disabled
2017-09-11T06:03:57.501 [INFO] ------------------------------------------------------------------------
2017-09-11T06:03:57.501 [INFO] Reactor Summary:
2017-09-11T06:03:57.501 [INFO] 
2017-09-11T06:03:57.502 [INFO] Apache Beam :: Parent .............................. SUCCESS
[01:25 min]
2017-09-11T06:03:57.502 [INFO] Apache Beam :: SDKs :: Java :: Build Tools ......... FAILURE
[  5.507 s]
2017-09-11T06:03:57.502 [INFO] Apache Beam :: SDKs ................................ SKIPPED
2017-09-11T06:03:57.502 [INFO] Apache Beam :: SDKs :: Common ...................... SKIPPED
2017-09-11T06:03:57.502 [INFO] Apache Beam :: SDKs :: Common :: Runner API ........ SKIPPED
2017-09-11T06:03:57.502 [INFO] Apache Beam :: SDKs :: Common :: Fn API ............ SKIPPED
2017-09-11T06:03:57.502 [INFO] Apache Beam :: SDKs :: Java ........................ SKIPPED
2017-09-11T06:03:57.502 [INFO] Apache Beam :: SDKs :: Java :: Core ................ SKIPPED
2017-09-11T06:03:57.502 [INFO] Apache Beam :: Runners ............................. SKIPPED
2017-09-11T06:03:57.502 [INFO] Apache Beam :: Runners :: Core Construction Java ... SKIPPED
2017-09-11T06:03:57.502 [INFO] Apache Beam :: Runners :: Core Java ................ SKIPPED
2017-09-11T06:03:57.502 [INFO] Apache Beam :: Runners :: Direct Java .............. SKIPPED
2017-09-11T06:03:57.502 [INFO] Apache Beam :: SDKs :: Java :: IO .................. SKIPPED
2017-09-11T06:03:57.502 [INFO] Apache Beam :: SDKs :: Java :: IO :: AMQP .......... SKIPPED
2017-09-11T06:03:57.502 [INFO] Apache Beam :: SDKs :: Java :: IO :: Common ........ SKIPPED
2017-09-11T06:03:57.502 [INFO] Apache Beam :: SDKs :: Java :: IO :: Cassandra ..... SKIPPED
2017-09-11T06:03:57.502 [INFO] Apache Beam :: SDKs :: Java :: IO :: Elasticsearch . SKIPPED
2017-09-11T06:03:57.502 [INFO] Apache Beam :: SDKs :: Java :: Extensions .......... SKIPPED
2017-09-11T06:03:57.502 [INFO] Apache Beam :: SDKs :: Java :: Extensions :: Google Cloud Platform
Core SKIPPED
2017-09-11T06:03:57.502 [INFO] Apache Beam :: SDKs :: Java :: Extensions :: Protobuf SKIPPED
2017-09-11T06:03:57.502 [INFO] Apache Beam :: SDKs :: Java :: IO :: Google Cloud Platform
SKIPPED
2017-09-11T06:03:57.502 [INFO] Apache Beam :: SDKs :: Java :: IO :: Hadoop Common . SKIPPED
2017-09-11T06:03:57.502 [INFO] Apache Beam :: SDKs :: Java :: IO :: Hadoop File System SKIPPED
2017-09-11T06:03:57.502 [INFO] Apache Beam :: SDKs :: Java :: IO :: Hadoop ........ SKIPPED
2017-09-11T06:03:57.502 [INFO] Apache Beam :: SDKs :: Java :: IO :: Hadoop :: input-format
SKIPPED
2017-09-11T06:03:57.502 [INFO] Apache Beam :: Runners :: Google Cloud Dataflow .... SKIPPED
2017-09-11T06:03:57.502 [INFO] Apache Beam :: SDKs :: Java :: IO :: Hadoop :: jdk1.8-tests
SKIPPED
2017-09-11T06:03:57.502 [INFO] Apache Beam :: SDKs :: Java :: IO :: HBase ......... SKIPPED
2017-09-11T06:03:57.502 [INFO] Apache Beam :: SDKs :: Java :: IO :: HCatalog ...... SKIPPED
2017-09-11T06:03:57.502 [INFO] Apache Beam :: SDKs :: Java :: IO :: JDBC .......... SKIPPED
2017-09-11T06:03:57.502 [INFO] Apache Beam :: SDKs :: Java :: IO :: JMS ........... SKIPPED
2017-09-11T06:03:57.502 [INFO] Apache Beam :: SDKs :: Java :: IO :: Kafka ......... SKIPPED
2017-09-11T06:03:57.502 [INFO] Apache Beam :: SDKs :: Java :: IO :: Kinesis ....... SKIPPED
2017-09-11T06:03:57.502 [INFO] Apache Beam :: SDKs :: Java :: IO :: MongoDB ....... SKIPPED
2017-09-11T06:03:57.502 [INFO] Apache Beam :: SDKs :: Java :: IO :: MQTT .......... SKIPPED
2017-09-11T06:03:57.502 [INFO] Apache Beam :: SDKs :: Java :: IO :: Solr .......... SKIPPED
2017-09-11T06:03:57.502 [INFO] Apache Beam :: SDKs :: Java :: IO :: XML ........... SKIPPED
2017-09-11T06:03:57.502 [INFO] Apache Beam :: SDKs :: Java :: Maven Archetypes .... SKIPPED
2017-09-11T06:03:57.502 [INFO] Apache Beam :: SDKs :: Java :: Maven Archetypes :: Starter
SKIPPED
2017-09-11T06:03:57.502 [INFO] Apache Beam :: Examples ............................ SKIPPED
2017-09-11T06:03:57.502 [INFO] Apache Beam :: Examples :: Java .................... SKIPPED
2017-09-11T06:03:57.503 [INFO] Apache Beam :: SDKs :: Java :: Maven Archetypes :: Examples
SKIPPED
2017-09-11T06:03:57.503 [INFO] Apache Beam :: Examples :: Java 8 .................. SKIPPED
2017-09-11T06:03:57.503 [INFO] Apache Beam :: SDKs :: Java :: Maven Archetypes :: Examples
- Java 8 SKIPPED
2017-09-11T06:03:57.503 [INFO] Apache Beam :: SDKs :: Java :: Extensions :: Jackson SKIPPED
2017-09-11T06:03:57.503 [INFO] Apache Beam :: SDKs :: Java :: Extensions :: Join library SKIPPED
2017-09-11T06:03:57.503 [INFO] Apache Beam :: SDKs :: Java :: Extensions :: Sorter  SKIPPED
2017-09-11T06:03:57.503 [INFO] Apache Beam :: SDKs :: Java :: Nexmark ............. SKIPPED
2017-09-11T06:03:57.503 [INFO] Apache Beam :: SDKs :: Java :: Harness ............. SKIPPED
2017-09-11T06:03:57.503 [INFO] Apache Beam :: SDKs :: Java :: Java 8 Tests ........ SKIPPED
2017-09-11T06:03:57.503 [INFO] Apache Beam :: SDKs :: Python ...................... SKIPPED
2017-09-11T06:03:57.503 [INFO] Apache Beam :: Runners :: Flink .................... SKIPPED
2017-09-11T06:03:57.503 [INFO] Apache Beam :: Runners :: Spark .................... SKIPPED
2017-09-11T06:03:57.503 [INFO] Apache Beam :: Runners :: Apex ..................... SKIPPED
2017-09-11T06:03:57.503 [INFO] Apache Beam :: Runners :: Gearpump ................. SKIPPED
2017-09-11T06:03:57.503 [INFO] Apache Beam :: SDKs :: Java :: Aggregated Javadoc .. SKIPPED
2017-09-11T06:03:57.503 [INFO] ------------------------------------------------------------------------
2017-09-11T06:03:57.503 [INFO] BUILD FAILURE
2017-09-11T06:03:57.503 [INFO] ------------------------------------------------------------------------
2017-09-11T06:03:57.503 [INFO] Total time: 02:04 min
2017-09-11T06:03:57.503 [INFO] Finished at: 2017-09-11T06:03:57+00:00
2017-09-11T06:03:57.906 [INFO] Final Memory: 73M/957M
2017-09-11T06:03:57.906 [INFO] ------------------------------------------------------------------------
2017-09-11T06:03:57.911 [ERROR] Failed to execute goal net.revelc.code.formatter:formatter-maven-plugin:2.0.1:format
(test-code-style) on project beam-sdks-java-build-tools: Execution test-code-style of goal
net.revelc.code.formatter:formatter-maven-plugin:2.0.1:format failed: Plugin net.revelc.code.formatter:formatter-maven-plugin:2.0.1
or one of its dependencies could not be resolved: Could not transfer artifact net.revelc.code.formatter:jsdt-core:jar:2.0.1
from/to central (https://repo.maven.apache.org/maven2): GET request of: net/revelc/code/formatter/jsdt-core/2.0.1/jsdt-core-2.0.1.jar
from central failed: Connection reset -> [Help 1]
org.apache.maven.lifecycle.LifecycleExecutionException: Failed to execute goal net.revelc.code.formatter:formatter-maven-plugin:2.0.1:format
(test-code-style) on project beam-sdks-java-build-tools: Execution test-code-style of goal
net.revelc.code.formatter:formatter-maven-plugin:2.0.1:format failed: Plugin net.revelc.code.formatter:formatter-maven-plugin:2.0.1
or one of its dependencies could not be resolved: Could not transfer artifact net.revelc.code.formatter:jsdt-core:jar:2.0.1
from/to central (https://repo.maven.apache.org/maven2): GET request of: net/revelc/code/formatter/jsdt-core/2.0.1/jsdt-core-2.0.1.jar
from central failed
	at org.apache.maven.lifecycle.internal.MojoExecutor.execute(MojoExecutor.java:224)
	at org.apache.maven.lifecycle.internal.MojoExecutor.execute(MojoExecutor.java:153)
	at org.apache.maven.lifecycle.internal.MojoExecutor.execute(MojoExecutor.java:145)
	at org.apache.maven.lifecycle.internal.LifecycleModuleBuilder.buildProject(LifecycleModuleBuilder.java:116)
	at org.apache.maven.lifecycle.internal.LifecycleModuleBuilder.buildProject(LifecycleModuleBuilder.java:80)
	at org.apache.maven.lifecycle.internal.builder.singlethreaded.SingleThreadedBuilder.build(SingleThreadedBuilder.java:51)
	at org.apache.maven.lifecycle.internal.LifecycleStarter.execute(LifecycleStarter.java:128)
	at org.apache.maven.DefaultMaven.doExecute(DefaultMaven.java:307)
	at org.apache.maven.DefaultMaven.doExecute(DefaultMaven.java:193)
	at org.apache.maven.DefaultMaven.execute(DefaultMaven.java:106)
	at org.jvnet.hudson.maven3.launcher.Maven33Launcher.main(Maven33Launcher.java:129)
	at sun.reflect.NativeMethodAccessorImpl.invoke0(Native Method)
	at sun.reflect.NativeMethodAccessorImpl.invoke(NativeMethodAccessorImpl.java:62)
	at sun.reflect.DelegatingMethodAccessorImpl.invoke(DelegatingMethodAccessorImpl.java:43)
	at java.lang.reflect.Method.invoke(Method.java:498)
	at org.codehaus.plexus.classworlds.launcher.Launcher.launchStandard(Launcher.java:330)
	at org.codehaus.plexus.classworlds.launcher.Launcher.launch(Launcher.java:238)
	at jenkins.maven3.agent.Maven33Main.launch(Maven33Main.java:176)
	at sun.reflect.NativeMethodAccessorImpl.invoke0(Native Method)
	at sun.reflect.NativeMethodAccessorImpl.invoke(NativeMethodAccessorImpl.java:62)
	at sun.reflect.DelegatingMethodAccessorImpl.invoke(DelegatingMethodAccessorImpl.java:43)
	at java.lang.reflect.Method.invoke(Method.java:498)
	at hudson.maven.Maven3Builder.call(Maven3Builder.java:139)
	at hudson.maven.Maven3Builder.call(Maven3Builder.java:70)
	at hudson.remoting.UserRequest.perform(UserRequest.java:153)
	at hudson.remoting.UserRequest.perform(UserRequest.java:50)
	at hudson.remoting.Request$2.run(Request.java:336)
	at hudson.remoting.InterceptingExecutorService$1.call(InterceptingExecutorService.java:68)
	at java.util.concurrent.FutureTask.run(FutureTask.java:266)
	at java.util.concurrent.ThreadPoolExecutor.runWorker(ThreadPoolExecutor.java:1149)
	at java.util.concurrent.ThreadPoolExecutor$Worker.run(ThreadPoolExecutor.java:624)
	at java.lang.Thread.run(Thread.java:748)
Caused by: org.apache.maven.plugin.PluginExecutionException: Execution test-code-style of
goal net.revelc.code.formatter:formatter-maven-plugin:2.0.1:format failed: Plugin net.revelc.code.formatter:formatter-maven-plugin:2.0.1
or one of its dependencies could not be resolved: Could not transfer artifact net.revelc.code.formatter:jsdt-core:jar:2.0.1
from/to central (https://repo.maven.apache.org/maven2): GET request of: net/revelc/code/formatter/jsdt-core/2.0.1/jsdt-core-2.0.1.jar
from central failed
	at org.apache.maven.plugin.DefaultBuildPluginManager.executeMojo(DefaultBuildPluginManager.java:106)
	at org.apache.maven.lifecycle.internal.MojoExecutor.execute(MojoExecutor.java:208)
	... 31 more
Caused by: org.apache.maven.plugin.PluginResolutionException: Plugin net.revelc.code.formatter:formatter-maven-plugin:2.0.1
or one of its dependencies could not be resolved: Could not transfer artifact net.revelc.code.formatter:jsdt-core:jar:2.0.1
from/to central (https://repo.maven.apache.org/maven2): GET request of: net/revelc/code/formatter/jsdt-core/2.0.1/jsdt-core-2.0.1.jar
from central failed
	at org.apache.maven.plugin.internal.DefaultPluginDependenciesResolver.resolveInternal(DefaultPluginDependenciesResolver.java:218)
	at org.apache.maven.plugin.internal.DefaultPluginDependenciesResolver.resolve(DefaultPluginDependenciesResolver.java:149)
	at org.apache.maven.plugin.internal.DefaultMavenPluginManager.createPluginRealm(DefaultMavenPluginManager.java:422)
	at org.apache.maven.plugin.internal.DefaultMavenPluginManager.setupPluginRealm(DefaultMavenPluginManager.java:385)
	at org.apache.maven.plugin.DefaultBuildPluginManager.getPluginRealm(DefaultBuildPluginManager.java:231)
	at org.apache.maven.plugin.DefaultBuildPluginManager.executeMojo(DefaultBuildPluginManager.java:102)
	... 32 more
Caused by: org.eclipse.aether.resolution.ArtifactResolutionException: Could not transfer artifact
net.revelc.code.formatter:jsdt-core:jar:2.0.1 from/to central (https://repo.maven.apache.org/maven2):
GET request of: net/revelc/code/formatter/jsdt-core/2.0.1/jsdt-core-2.0.1.jar from central
failed
	at org.eclipse.aether.internal.impl.DefaultArtifactResolver.resolve(DefaultArtifactResolver.java:444)
	at org.eclipse.aether.internal.impl.DefaultArtifactResolver.resolveArtifacts(DefaultArtifactResolver.java:246)
	at org.eclipse.aether.internal.impl.DefaultRepositorySystem.resolveDependencies(DefaultRepositorySystem.java:367)
	at org.apache.maven.plugin.internal.DefaultPluginDependenciesResolver.resolveInternal(DefaultPluginDependenciesResolver.java:210)
	... 37 more
Caused by: org.eclipse.aether.transfer.ArtifactTransferException: Could not transfer artifact
net.revelc.code.formatter:jsdt-core:jar:2.0.1 from/to central (https://repo.maven.apache.org/maven2):
GET request of: net/revelc/code/formatter/jsdt-core/2.0.1/jsdt-core-2.0.1.jar from central
failed
	at org.eclipse.aether.connector.basic.ArtifactTransportListener.transferFailed(ArtifactTransportListener.java:43)
	at org.eclipse.aether.connector.basic.BasicRepositoryConnector$TaskRunner.run(BasicRepositoryConnector.java:355)
	at org.eclipse.aether.util.concurrency.RunnableErrorForwarder$1.run(RunnableErrorForwarder.java:67)
	... 3 more
Caused by: org.apache.maven.wagon.TransferFailedException: GET request of: net/revelc/code/formatter/jsdt-core/2.0.1/jsdt-core-2.0.1.jar
from central failed
	at org.apache.maven.wagon.AbstractWagon.getTransfer(AbstractWagon.java:363)
	at org.apache.maven.wagon.AbstractWagon.getTransfer(AbstractWagon.java:316)
	at org.apache.maven.wagon.AbstractWagon.getTransfer(AbstractWagon.java:285)
	at org.apache.maven.wagon.StreamWagon.getIfNewer(StreamWagon.java:97)
	at org.apache.maven.wagon.StreamWagon.get(StreamWagon.java:61)
	at org.eclipse.aether.transport.wagon.WagonTransporter$GetTaskRunner.run(WagonTransporter.java:560)
	at org.eclipse.aether.transport.wagon.WagonTransporter.execute(WagonTransporter.java:427)
	at org.eclipse.aether.transport.wagon.WagonTransporter.get(WagonTransporter.java:404)
	at org.eclipse.aether.connector.basic.BasicRepositoryConnector$GetTaskRunner.runTask(BasicRepositoryConnector.java:447)
	at org.eclipse.aether.connector.basic.BasicRepositoryConnector$TaskRunner.run(BasicRepositoryConnector.java:350)
	... 4 more
Caused by: java.net.SocketException: Connection reset
	at java.net.SocketInputStream.read(SocketInputStream.java:210)
	at java.net.SocketInputStream.read(SocketInputStream.java:141)
	at sun.security.ssl.InputRecord.readFully(InputRecord.java:465)
	at sun.security.ssl.InputRecord.readV3Record(InputRecord.java:593)
	at sun.security.ssl.InputRecord.read(InputRecord.java:532)
	at sun.security.ssl.SSLSocketImpl.readRecord(SSLSocketImpl.java:983)
	at sun.security.ssl.SSLSocketImpl.readDataRecord(SSLSocketImpl.java:940)
	at sun.security.ssl.AppInputStream.read(AppInputStream.java:105)
	at org.apache.maven.wagon.providers.http.httpclient.impl.io.SessionInputBufferImpl.streamRead(SessionInputBufferImpl.java:136)
	at org.apache.maven.wagon.providers.http.httpclient.impl.io.SessionInputBufferImpl.read(SessionInputBufferImpl.java:195)
	at org.apache.maven.wagon.providers.http.httpclient.impl.io.ContentLengthInputStream.read(ContentLengthInputStream.java:178)
	at org.apache.maven.wagon.providers.http.httpclient.conn.EofSensorInputStream.read(EofSensorInputStream.java:137)
	at org.apache.maven.wagon.AbstractWagon.transfer(AbstractWagon.java:531)
	at org.apache.maven.wagon.AbstractWagon.getTransfer(AbstractWagon.java:353)
	... 13 more
2017-09-11T06:03:57.913 [ERROR] 
2017-09-11T06:03:57.913 [ERROR] Re-run Maven using the -X switch to enable full debug logging.
2017-09-11T06:03:57.913 [ERROR] 
2017-09-11T06:03:57.913 [ERROR] For more information about the errors and possible solutions,
please read the following articles:
2017-09-11T06:03:57.913 [ERROR] [Help 1] http://cwiki.apache.org/confluence/display/MAVEN/PluginResolutionException
2017-09-11T06:03:57.913 [ERROR] 
2017-09-11T06:03:57.913 [ERROR] After correcting the problems, you can resume the build with
the command
2017-09-11T06:03:57.913 [ERROR]   mvn <goals> -rf :beam-sdks-java-build-tools
channel stopped

Mime
View raw message