beam-commits mailing list archives

Site index · List index
Message view « Date » · « Thread »
Top « Date » · « Thread »
From Apache Jenkins Server <jenk...@builds.apache.org>
Subject Build failed in Jenkins: beam_PostCommit_Java_MavenInstall #4878
Date Mon, 25 Sep 2017 23:23:30 GMT
See <https://builds.apache.org/job/beam_PostCommit_Java_MavenInstall/4878/display/redirect?page=changes>

Changes:

[tgroh] Update the Dataflow v1b3 API version

------------------------------------------
[...truncated 1.19 MB...]
2017-09-25T23:22:19.383 [INFO] Downloading: http://conjars.org/repo/thirdparty/jgrapht-jdk1.6/0.8.1/jgrapht-jdk1.6-0.8.1.jar
2017-09-25T23:22:19.441 [INFO] Downloaded: http://conjars.org/repo/riffle/riffle/0.1-dev/riffle-0.1-dev.jar
(12 KB at 90.1 KB/sec)
2017-09-25T23:22:19.441 [INFO] Downloading: http://conjars.org/repo/org/apache/storm/storm-core/1.0.1/storm-core-1.0.1.jar
2017-09-25T23:22:19.496 [INFO] Downloaded: http://conjars.org/repo/org/pentaho/pentaho-aggdesigner-algorithm/5.1.5-jhyde/pentaho-aggdesigner-algorithm-5.1.5-jhyde.jar
(48 KB at 263.4 KB/sec)
2017-09-25T23:22:19.496 [INFO] Downloading: http://conjars.org/repo/org/clojure/clojure/1.7.0/clojure-1.7.0.jar
2017-09-25T23:22:19.497 [INFO] Downloading: http://conjars.org/repo/cascading/cascading-local/2.6.3/cascading-local-2.6.3.jar
2017-09-25T23:22:19.674 [INFO] Downloaded: http://conjars.org/repo/cascading/cascading-local/2.6.3/cascading-local-2.6.3.jar
(43 KB at 119.3 KB/sec)
2017-09-25T23:22:19.723 [INFO] Downloaded: http://conjars.org/repo/cascading/cascading-hadoop/2.6.3/cascading-hadoop-2.6.3.jar
(246 KB at 605.6 KB/sec)
2017-09-25T23:22:19.772 [INFO] Downloaded: http://conjars.org/repo/thirdparty/jgrapht-jdk1.6/0.8.1/jgrapht-jdk1.6-0.8.1.jar
(230 KB at 506.1 KB/sec)
2017-09-25T23:22:20.022 [INFO] Downloaded: http://conjars.org/repo/cascading/cascading-core/2.6.3/cascading-core-2.6.3.jar
(680 KB at 965.1 KB/sec)
2017-09-25T23:22:20.026 [INFO] Downloading: http://clojars.org/repo/org/scalatest/scalatest_2.10/2.2.6/scalatest_2.10-2.2.6.jar
2017-09-25T23:22:20.034 [INFO] Downloading: http://clojars.org/repo/org/apache/storm/storm-core/1.0.1/storm-core-1.0.1.jar
2017-09-25T23:22:20.035 [INFO] Downloading: http://clojars.org/repo/org/clojure/clojure/1.7.0/clojure-1.7.0.jar
2017-09-25T23:22:20.107 [INFO] Downloading: https://clojars.org/repo/org/clojure/clojure/1.7.0/clojure-1.7.0.jar
[JENKINS] Archiving disabled
2017-09-25T23:22:20.948 [INFO]                                                           
             
2017-09-25T23:22:20.948 [INFO] ------------------------------------------------------------------------
2017-09-25T23:22:20.949 [INFO] Skipping Apache Beam :: Parent
2017-09-25T23:22:20.949 [INFO] This project has been banned from the build due to previous
failures.
2017-09-25T23:22:20.949 [INFO] ------------------------------------------------------------------------
[JENKINS] Archiving disabled
[JENKINS] Archiving disabled
[JENKINS] Archiving disabled
[JENKINS] Archiving disabled
[JENKINS] Archiving disabled
[JENKINS] Archiving disabled
[JENKINS] Archiving disabled
[JENKINS] Archiving disabled
[JENKINS] Archiving disabled
[JENKINS] Archiving disabled
[JENKINS] Archiving disabled
[JENKINS] Archiving disabled
[JENKINS] Archiving disabled
[JENKINS] Archiving disabled
[JENKINS] Archiving disabled
[JENKINS] Archiving disabled
[JENKINS] Archiving disabled
[JENKINS] Archiving disabled
[JENKINS] Archiving disabled
[JENKINS] Archiving disabled
[JENKINS] Archiving disabled
[JENKINS] Archiving disabled
[JENKINS] Archiving disabled
[JENKINS] Archiving disabled
[JENKINS] Archiving disabled
[JENKINS] Archiving disabled
[JENKINS] Archiving disabled
[JENKINS] Archiving disabled
[JENKINS] Archiving disabled
[JENKINS] Archiving disabled
[JENKINS] Archiving disabled
[JENKINS] Archiving disabled
[JENKINS] Archiving disabled
[JENKINS] Archiving disabled
[JENKINS] Archiving disabled
[JENKINS] Archiving disabled
[JENKINS] Archiving disabled
[JENKINS] Archiving disabled
[JENKINS] Archiving disabled
[JENKINS] Archiving disabled
[JENKINS] Archiving disabled
[JENKINS] Archiving disabled
[JENKINS] Archiving disabled
[JENKINS] Archiving disabled
[JENKINS] Archiving disabled
[JENKINS] Archiving disabled
[JENKINS] Archiving disabled
[JENKINS] Archiving disabled
[JENKINS] Archiving disabled
[JENKINS] Archiving disabled
[JENKINS] Archiving disabled
[JENKINS] Archiving disabled
[JENKINS] Archiving disabled
[JENKINS] Archiving disabled
[JENKINS] Archiving disabled
[JENKINS] Archiving disabled
[JENKINS] Archiving disabled
[JENKINS] Archiving disabled
[JENKINS] Archiving disabled
[JENKINS] Archiving disabled
[JENKINS] Archiving disabled
[JENKINS] Archiving disabled
[JENKINS] Archiving disabled
2017-09-25T23:23:15.033 [INFO] ------------------------------------------------------------------------
2017-09-25T23:23:15.033 [INFO] Reactor Summary:
2017-09-25T23:23:15.033 [INFO] 
2017-09-25T23:23:15.034 [INFO] Apache Beam :: Parent .............................. SUCCESS
[ 45.387 s]
2017-09-25T23:23:15.034 [INFO] Apache Beam :: SDKs :: Java :: Build Tools ......... SUCCESS
[ 14.936 s]
2017-09-25T23:23:15.034 [INFO] Apache Beam :: SDKs ................................ SUCCESS
[  7.409 s]
2017-09-25T23:23:15.034 [INFO] Apache Beam :: SDKs :: Common ...................... SUCCESS
[  3.399 s]
2017-09-25T23:23:15.034 [INFO] Apache Beam :: SDKs :: Common :: Runner API ........ SUCCESS
[ 46.878 s]
2017-09-25T23:23:15.034 [INFO] Apache Beam :: SDKs :: Common :: Fn API ............ SUCCESS
[ 47.632 s]
2017-09-25T23:23:15.034 [INFO] Apache Beam :: SDKs :: Java ........................ SUCCESS
[  3.398 s]
2017-09-25T23:23:15.034 [INFO] Apache Beam :: SDKs :: Java :: Core ................ SUCCESS
[04:55 min]
2017-09-25T23:23:15.034 [INFO] Apache Beam :: Runners ............................. SUCCESS
[  3.837 s]
2017-09-25T23:23:15.034 [INFO] Apache Beam :: Runners :: Core Construction Java ... SUCCESS
[ 53.403 s]
2017-09-25T23:23:15.034 [INFO] Apache Beam :: Runners :: Core Java ................ SUCCESS
[01:42 min]
2017-09-25T23:23:15.034 [INFO] Apache Beam :: Runners :: Direct Java .............. SUCCESS
[08:03 min]
2017-09-25T23:23:15.034 [INFO] Apache Beam :: SDKs :: Java :: IO .................. SUCCESS
[  3.686 s]
2017-09-25T23:23:15.034 [INFO] Apache Beam :: SDKs :: Java :: IO :: AMQP .......... SUCCESS
[ 56.228 s]
2017-09-25T23:23:15.034 [INFO] Apache Beam :: SDKs :: Java :: IO :: Common ........ SUCCESS
[ 11.994 s]
2017-09-25T23:23:15.034 [INFO] Apache Beam :: SDKs :: Java :: IO :: Cassandra ..... SUCCESS
[ 51.961 s]
2017-09-25T23:23:15.034 [INFO] Apache Beam :: SDKs :: Java :: IO :: Elasticsearch . SUCCESS
[ 34.701 s]
2017-09-25T23:23:15.034 [INFO] Apache Beam :: SDKs :: Java :: IO :: Elasticsearch-Tests SUCCESS
[  5.335 s]
2017-09-25T23:23:15.034 [INFO] Apache Beam :: SDKs :: Java :: IO :: Elasticsearch-Tests ::
Common SUCCESS [  5.839 s]
2017-09-25T23:23:15.034 [INFO] Apache Beam :: SDKs :: Java :: IO :: Elasticsearch-Tests ::
2.x SUCCESS [ 51.736 s]
2017-09-25T23:23:15.034 [INFO] Apache Beam :: SDKs :: Java :: IO :: Elasticsearch-Tests ::
5.x SUCCESS [ 58.998 s]
2017-09-25T23:23:15.035 [INFO] Apache Beam :: SDKs :: Java :: Extensions .......... SUCCESS
[  4.425 s]
2017-09-25T23:23:15.035 [INFO] Apache Beam :: SDKs :: Java :: Extensions :: Google Cloud Platform
Core SUCCESS [01:04 min]
2017-09-25T23:23:15.035 [INFO] Apache Beam :: SDKs :: Java :: Extensions :: Protobuf SUCCESS
[ 44.542 s]
2017-09-25T23:23:15.035 [INFO] Apache Beam :: SDKs :: Java :: IO :: Google Cloud Platform
SUCCESS [02:33 min]
2017-09-25T23:23:15.035 [INFO] Apache Beam :: SDKs :: Java :: IO :: Hadoop Common . SUCCESS
[ 42.306 s]
2017-09-25T23:23:15.035 [INFO] Apache Beam :: SDKs :: Java :: IO :: Hadoop File System SUCCESS
[01:19 min]
2017-09-25T23:23:15.035 [INFO] Apache Beam :: SDKs :: Java :: IO :: Hadoop ........ SUCCESS
[ 10.445 s]
2017-09-25T23:23:15.035 [INFO] Apache Beam :: SDKs :: Java :: IO :: Hadoop :: input-format
SUCCESS [ 49.260 s]
2017-09-25T23:23:15.035 [INFO] Apache Beam :: Runners :: Google Cloud Dataflow .... SUCCESS
[08:39 min]
2017-09-25T23:23:15.035 [INFO] Apache Beam :: SDKs :: Java :: IO :: Hadoop :: jdk1.8-tests
FAILURE [ 30.333 s]
2017-09-25T23:23:15.035 [INFO] Apache Beam :: SDKs :: Java :: IO :: HBase ......... SKIPPED
2017-09-25T23:23:15.035 [INFO] Apache Beam :: SDKs :: Java :: IO :: HCatalog ...... SKIPPED
2017-09-25T23:23:15.035 [INFO] Apache Beam :: SDKs :: Java :: IO :: JDBC .......... SKIPPED
2017-09-25T23:23:15.035 [INFO] Apache Beam :: SDKs :: Java :: IO :: JMS ........... SKIPPED
2017-09-25T23:23:15.035 [INFO] Apache Beam :: SDKs :: Java :: IO :: Kafka ......... SKIPPED
2017-09-25T23:23:15.035 [INFO] Apache Beam :: SDKs :: Java :: IO :: Kinesis ....... SKIPPED
2017-09-25T23:23:15.035 [INFO] Apache Beam :: SDKs :: Java :: IO :: MongoDB ....... SKIPPED
2017-09-25T23:23:15.035 [INFO] Apache Beam :: SDKs :: Java :: IO :: MQTT .......... SKIPPED
2017-09-25T23:23:15.035 [INFO] Apache Beam :: SDKs :: Java :: IO :: Solr .......... SKIPPED
2017-09-25T23:23:15.035 [INFO] Apache Beam :: SDKs :: Java :: IO :: Tika .......... SKIPPED
2017-09-25T23:23:15.035 [INFO] Apache Beam :: SDKs :: Java :: IO :: XML ........... SKIPPED
2017-09-25T23:23:15.035 [INFO] Apache Beam :: SDKs :: Java :: Maven Archetypes .... SKIPPED
2017-09-25T23:23:15.035 [INFO] Apache Beam :: SDKs :: Java :: Maven Archetypes :: Starter
SKIPPED
2017-09-25T23:23:15.035 [INFO] Apache Beam :: Examples ............................ SKIPPED
2017-09-25T23:23:15.035 [INFO] Apache Beam :: Examples :: Java .................... SKIPPED
2017-09-25T23:23:15.035 [INFO] Apache Beam :: SDKs :: Java :: Maven Archetypes :: Examples
SKIPPED
2017-09-25T23:23:15.035 [INFO] Apache Beam :: Examples :: Java 8 .................. SKIPPED
2017-09-25T23:23:15.035 [INFO] Apache Beam :: SDKs :: Java :: Maven Archetypes :: Examples
- Java 8 SKIPPED
2017-09-25T23:23:15.035 [INFO] Apache Beam :: SDKs :: Java :: Extensions :: Jackson SKIPPED
2017-09-25T23:23:15.035 [INFO] Apache Beam :: SDKs :: Java :: Extensions :: Join library SKIPPED
2017-09-25T23:23:15.035 [INFO] Apache Beam :: SDKs :: Java :: Extensions :: Sorter  SKIPPED
2017-09-25T23:23:15.035 [INFO] Apache Beam :: SDKs :: Java :: Extensions :: SQL ... SKIPPED
2017-09-25T23:23:15.035 [INFO] Apache Beam :: SDKs :: Java :: Nexmark ............. SKIPPED
2017-09-25T23:23:15.035 [INFO] Apache Beam :: SDKs :: Java :: Harness ............. SKIPPED
2017-09-25T23:23:15.035 [INFO] Apache Beam :: SDKs :: Java :: Java 8 Tests ........ SKIPPED
2017-09-25T23:23:15.035 [INFO] Apache Beam :: SDKs :: Python ...................... SKIPPED
2017-09-25T23:23:15.035 [INFO] Apache Beam :: Runners :: Java Local Artifact Service SKIPPED
2017-09-25T23:23:15.035 [INFO] Apache Beam :: Runners :: Flink .................... SKIPPED
2017-09-25T23:23:15.035 [INFO] Apache Beam :: Runners :: Spark .................... SKIPPED
2017-09-25T23:23:15.035 [INFO] Apache Beam :: Runners :: Apex ..................... SKIPPED
2017-09-25T23:23:15.035 [INFO] Apache Beam :: Runners :: Gearpump ................. SKIPPED
2017-09-25T23:23:15.035 [INFO] Apache Beam :: SDKs :: Java :: Aggregated Javadoc .. SKIPPED
2017-09-25T23:23:15.035 [INFO] ------------------------------------------------------------------------
2017-09-25T23:23:15.035 [INFO] BUILD FAILURE
2017-09-25T23:23:15.036 [INFO] ------------------------------------------------------------------------
2017-09-25T23:23:15.037 [INFO] Total time: 41:32 min
2017-09-25T23:23:15.037 [INFO] Finished at: 2017-09-25T23:23:15+00:00
2017-09-25T23:23:16.708 [INFO] Final Memory: 207M/1507M
2017-09-25T23:23:16.708 [INFO] ------------------------------------------------------------------------
2017-09-25T23:23:16.719 [ERROR] Failed to execute goal on project beam-sdks-java-io-hadoop-jdk1.8-tests:
Could not resolve dependencies for project org.apache.beam:beam-sdks-java-io-hadoop-jdk1.8-tests:jar:2.2.0-SNAPSHOT:
The following artifacts could not be resolved: org.scalatest:scalatest_2.10:jar:2.2.6, org.apache.storm:storm-core:jar:1.0.1,
org.clojure:clojure:jar:1.7.0: Could not transfer artifact org.scalatest:scalatest_2.10:jar:2.2.6
from/to central (https://repo.maven.apache.org/maven2): GET request of: org/scalatest/scalatest_2.10/2.2.6/scalatest_2.10-2.2.6.jar
from central failed: Connection reset -> [Help 1]
org.apache.maven.lifecycle.LifecycleExecutionException: Failed to execute goal on project
beam-sdks-java-io-hadoop-jdk1.8-tests: Could not resolve dependencies for project org.apache.beam:beam-sdks-java-io-hadoop-jdk1.8-tests:jar:2.2.0-SNAPSHOT:
The following artifacts could not be resolved: org.scalatest:scalatest_2.10:jar:2.2.6, org.apache.storm:storm-core:jar:1.0.1,
org.clojure:clojure:jar:1.7.0: Could not transfer artifact org.scalatest:scalatest_2.10:jar:2.2.6
from/to central (https://repo.maven.apache.org/maven2): GET request of: org/scalatest/scalatest_2.10/2.2.6/scalatest_2.10-2.2.6.jar
from central failed
	at org.apache.maven.lifecycle.internal.LifecycleDependencyResolver.getDependencies(LifecycleDependencyResolver.java:221)
	at org.apache.maven.lifecycle.internal.LifecycleDependencyResolver.resolveProjectDependencies(LifecycleDependencyResolver.java:127)
	at org.apache.maven.lifecycle.internal.MojoExecutor.ensureDependenciesAreResolved(MojoExecutor.java:257)
	at org.apache.maven.lifecycle.internal.MojoExecutor.execute(MojoExecutor.java:200)
	at org.apache.maven.lifecycle.internal.MojoExecutor.execute(MojoExecutor.java:153)
	at org.apache.maven.lifecycle.internal.MojoExecutor.execute(MojoExecutor.java:145)
	at org.apache.maven.lifecycle.internal.LifecycleModuleBuilder.buildProject(LifecycleModuleBuilder.java:116)
	at org.apache.maven.lifecycle.internal.LifecycleModuleBuilder.buildProject(LifecycleModuleBuilder.java:80)
	at org.apache.maven.lifecycle.internal.builder.singlethreaded.SingleThreadedBuilder.build(SingleThreadedBuilder.java:51)
	at org.apache.maven.lifecycle.internal.LifecycleStarter.execute(LifecycleStarter.java:128)
	at org.apache.maven.DefaultMaven.doExecute(DefaultMaven.java:307)
	at org.apache.maven.DefaultMaven.doExecute(DefaultMaven.java:193)
	at org.apache.maven.DefaultMaven.execute(DefaultMaven.java:106)
	at org.jvnet.hudson.maven3.launcher.Maven33Launcher.main(Maven33Launcher.java:129)
	at sun.reflect.NativeMethodAccessorImpl.invoke0(Native Method)
	at sun.reflect.NativeMethodAccessorImpl.invoke(NativeMethodAccessorImpl.java:62)
	at sun.reflect.DelegatingMethodAccessorImpl.invoke(DelegatingMethodAccessorImpl.java:43)
	at java.lang.reflect.Method.invoke(Method.java:498)
	at org.codehaus.plexus.classworlds.launcher.Launcher.launchStandard(Launcher.java:330)
	at org.codehaus.plexus.classworlds.launcher.Launcher.launch(Launcher.java:238)
	at jenkins.maven3.agent.Maven33Main.launch(Maven33Main.java:176)
	at sun.reflect.NativeMethodAccessorImpl.invoke0(Native Method)
	at sun.reflect.NativeMethodAccessorImpl.invoke(NativeMethodAccessorImpl.java:62)
	at sun.reflect.DelegatingMethodAccessorImpl.invoke(DelegatingMethodAccessorImpl.java:43)
	at java.lang.reflect.Method.invoke(Method.java:498)
	at hudson.maven.Maven3Builder.call(Maven3Builder.java:139)
	at hudson.maven.Maven3Builder.call(Maven3Builder.java:70)
	at hudson.remoting.UserRequest.perform(UserRequest.java:153)
	at hudson.remoting.UserRequest.perform(UserRequest.java:50)
	at hudson.remoting.Request$2.run(Request.java:336)
	at hudson.remoting.InterceptingExecutorService$1.call(InterceptingExecutorService.java:68)
	at java.util.concurrent.FutureTask.run(FutureTask.java:266)
	at java.util.concurrent.ThreadPoolExecutor.runWorker(ThreadPoolExecutor.java:1149)
	at java.util.concurrent.ThreadPoolExecutor$Worker.run(ThreadPoolExecutor.java:624)
	at java.lang.Thread.run(Thread.java:748)
Caused by: org.apache.maven.project.DependencyResolutionException: Could not resolve dependencies
for project org.apache.beam:beam-sdks-java-io-hadoop-jdk1.8-tests:jar:2.2.0-SNAPSHOT: The
following artifacts could not be resolved: org.scalatest:scalatest_2.10:jar:2.2.6, org.apache.storm:storm-core:jar:1.0.1,
org.clojure:clojure:jar:1.7.0: Could not transfer artifact org.scalatest:scalatest_2.10:jar:2.2.6
from/to central (https://repo.maven.apache.org/maven2): GET request of: org/scalatest/scalatest_2.10/2.2.6/scalatest_2.10-2.2.6.jar
from central failed
	at org.apache.maven.project.DefaultProjectDependenciesResolver.resolve(DefaultProjectDependenciesResolver.java:211)
	at org.apache.maven.lifecycle.internal.LifecycleDependencyResolver.getDependencies(LifecycleDependencyResolver.java:195)
	... 34 more
Caused by: org.eclipse.aether.resolution.DependencyResolutionException: The following artifacts
could not be resolved: org.scalatest:scalatest_2.10:jar:2.2.6, org.apache.storm:storm-core:jar:1.0.1,
org.clojure:clojure:jar:1.7.0: Could not transfer artifact org.scalatest:scalatest_2.10:jar:2.2.6
from/to central (https://repo.maven.apache.org/maven2): GET request of: org/scalatest/scalatest_2.10/2.2.6/scalatest_2.10-2.2.6.jar
from central failed
	at org.eclipse.aether.internal.impl.DefaultRepositorySystem.resolveDependencies(DefaultRepositorySystem.java:384)
	at org.apache.maven.project.DefaultProjectDependenciesResolver.resolve(DefaultProjectDependenciesResolver.java:205)
	... 35 more
Caused by: org.eclipse.aether.resolution.ArtifactResolutionException: The following artifacts
could not be resolved: org.scalatest:scalatest_2.10:jar:2.2.6, org.apache.storm:storm-core:jar:1.0.1,
org.clojure:clojure:jar:1.7.0: Could not transfer artifact org.scalatest:scalatest_2.10:jar:2.2.6
from/to central (https://repo.maven.apache.org/maven2): GET request of: org/scalatest/scalatest_2.10/2.2.6/scalatest_2.10-2.2.6.jar
from central failed
	at org.eclipse.aether.internal.impl.DefaultArtifactResolver.resolve(DefaultArtifactResolver.java:444)
	at org.eclipse.aether.internal.impl.DefaultArtifactResolver.resolveArtifacts(DefaultArtifactResolver.java:246)
	at org.eclipse.aether.internal.impl.DefaultRepositorySystem.resolveDependencies(DefaultRepositorySystem.java:367)
	... 36 more
Caused by: org.eclipse.aether.transfer.ArtifactTransferException: Could not transfer artifact
org.scalatest:scalatest_2.10:jar:2.2.6 from/to central (https://repo.maven.apache.org/maven2):
GET request of: org/scalatest/scalatest_2.10/2.2.6/scalatest_2.10-2.2.6.jar from central failed
	at org.eclipse.aether.connector.basic.ArtifactTransportListener.transferFailed(ArtifactTransportListener.java:43)
	at org.eclipse.aether.connector.basic.BasicRepositoryConnector$TaskRunner.run(BasicRepositoryConnector.java:355)
	at org.eclipse.aether.util.concurrency.RunnableErrorForwarder$1.run(RunnableErrorForwarder.java:67)
	... 3 more
Caused by: org.apache.maven.wagon.TransferFailedException: GET request of: org/scalatest/scalatest_2.10/2.2.6/scalatest_2.10-2.2.6.jar
from central failed
	at org.apache.maven.wagon.AbstractWagon.getTransfer(AbstractWagon.java:363)
	at org.apache.maven.wagon.AbstractWagon.getTransfer(AbstractWagon.java:316)
	at org.apache.maven.wagon.AbstractWagon.getTransfer(AbstractWagon.java:285)
	at org.apache.maven.wagon.StreamWagon.getIfNewer(StreamWagon.java:97)
	at org.apache.maven.wagon.StreamWagon.get(StreamWagon.java:61)
	at org.eclipse.aether.transport.wagon.WagonTransporter$GetTaskRunner.run(WagonTransporter.java:560)
	at org.eclipse.aether.transport.wagon.WagonTransporter.execute(WagonTransporter.java:427)
	at org.eclipse.aether.transport.wagon.WagonTransporter.get(WagonTransporter.java:404)
	at org.eclipse.aether.connector.basic.BasicRepositoryConnector$GetTaskRunner.runTask(BasicRepositoryConnector.java:447)
	at org.eclipse.aether.connector.basic.BasicRepositoryConnector$TaskRunner.run(BasicRepositoryConnector.java:350)
	... 4 more
Caused by: java.net.SocketException: Connection reset
	at java.net.SocketInputStream.read(SocketInputStream.java:210)
	at java.net.SocketInputStream.read(SocketInputStream.java:141)
	at sun.security.ssl.InputRecord.readFully(InputRecord.java:465)
	at sun.security.ssl.InputRecord.readV3Record(InputRecord.java:593)
	at sun.security.ssl.InputRecord.read(InputRecord.java:532)
	at sun.security.ssl.SSLSocketImpl.readRecord(SSLSocketImpl.java:983)
	at sun.security.ssl.SSLSocketImpl.readDataRecord(SSLSocketImpl.java:940)
	at sun.security.ssl.AppInputStream.read(AppInputStream.java:105)
	at org.apache.maven.wagon.providers.http.httpclient.impl.io.SessionInputBufferImpl.streamRead(SessionInputBufferImpl.java:136)
	at org.apache.maven.wagon.providers.http.httpclient.impl.io.SessionInputBufferImpl.read(SessionInputBufferImpl.java:195)
	at org.apache.maven.wagon.providers.http.httpclient.impl.io.ContentLengthInputStream.read(ContentLengthInputStream.java:178)
	at org.apache.maven.wagon.providers.http.httpclient.conn.EofSensorInputStream.read(EofSensorInputStream.java:137)
	at org.apache.maven.wagon.AbstractWagon.transfer(AbstractWagon.java:531)
	at org.apache.maven.wagon.AbstractWagon.getTransfer(AbstractWagon.java:353)
	... 13 more
2017-09-25T23:23:16.731 [ERROR] 
2017-09-25T23:23:16.731 [ERROR] Re-run Maven using the -X switch to enable full debug logging.
2017-09-25T23:23:16.731 [ERROR] 
2017-09-25T23:23:16.731 [ERROR] For more information about the errors and possible solutions,
please read the following articles:
2017-09-25T23:23:16.731 [ERROR] [Help 1] http://cwiki.apache.org/confluence/display/MAVEN/DependencyResolutionException
2017-09-25T23:23:16.731 [ERROR] 
2017-09-25T23:23:16.731 [ERROR] After correcting the problems, you can resume the build with
the command
2017-09-25T23:23:16.731 [ERROR]   mvn <goals> -rf :beam-sdks-java-io-hadoop-jdk1.8-tests
channel stopped
Not sending mail to unregistered user kirpichov@google.com

Mime
View raw message