beam-commits mailing list archives

Site index · List index
Message view « Date » · « Thread »
Top « Date » · « Thread »
From Apache Jenkins Server <jenk...@builds.apache.org>
Subject Build failed in Jenkins: beam_PostCommit_Java_MavenInstall #4706
Date Sat, 02 Sep 2017 18:29:25 GMT
See <https://builds.apache.org/job/beam_PostCommit_Java_MavenInstall/4706/display/redirect>

------------------------------------------
[...truncated 1.06 MB...]
2017-09-02T18:27:12.619 [INFO] Downloaded: https://repo.maven.apache.org/maven2/com/github/ben-manes/caffeine/caffeine/2.2.6/caffeine-2.2.6.pom
(5 KB at 160.1 KB/sec)
[JENKINS] Archiving disabled
2017-09-02T18:27:13.461 [INFO]                                                           
             
2017-09-02T18:27:13.461 [INFO] ------------------------------------------------------------------------
2017-09-02T18:27:13.461 [INFO] Skipping Apache Beam :: Parent
2017-09-02T18:27:13.461 [INFO] This project has been banned from the build due to previous
failures.
2017-09-02T18:27:13.461 [INFO] ------------------------------------------------------------------------
[JENKINS] Archiving disabled
[JENKINS] Archiving disabled
[JENKINS] Archiving disabled
[JENKINS] Archiving disabled
[JENKINS] Archiving disabled
[JENKINS] Archiving disabled
[JENKINS] Archiving disabled
[JENKINS] Archiving disabled
[JENKINS] Archiving disabled
[JENKINS] Archiving disabled
[JENKINS] Archiving disabled
[JENKINS] Archiving disabled
[JENKINS] Archiving disabled
[JENKINS] Archiving disabled
[JENKINS] Archiving disabled
[JENKINS] Archiving disabled
[JENKINS] Archiving disabled
[JENKINS] Archiving disabled
[JENKINS] Archiving disabled
[JENKINS] Archiving disabled
[JENKINS] Archiving disabled
[JENKINS] Archiving disabled
[JENKINS] Archiving disabled
[JENKINS] Archiving disabled
[JENKINS] Archiving disabled
[JENKINS] Archiving disabled
[JENKINS] Archiving disabled
[JENKINS] Archiving disabled
[JENKINS] Archiving disabled
[JENKINS] Archiving disabled
[JENKINS] Archiving disabled
[JENKINS] Archiving disabled
[JENKINS] Archiving disabled
[JENKINS] Archiving disabled
[JENKINS] Archiving disabled
[JENKINS] Archiving disabled
[JENKINS] Archiving disabled
[JENKINS] Archiving disabled
[JENKINS] Archiving disabled
[JENKINS] Archiving disabled
[JENKINS] Archiving disabled
[JENKINS] Archiving disabled
[JENKINS] Archiving disabled
[JENKINS] Archiving disabled
[JENKINS] Archiving disabled
[JENKINS] Archiving disabled
[JENKINS] Archiving disabled
[JENKINS] Archiving disabled
[JENKINS] Archiving disabled
[JENKINS] Archiving disabled
[JENKINS] Archiving disabled
[JENKINS] Archiving disabled
[JENKINS] Archiving disabled
[JENKINS] Archiving disabled
[JENKINS] Archiving disabled
[JENKINS] Archiving disabled
2017-09-02T18:28:59.713 [INFO] ------------------------------------------------------------------------
2017-09-02T18:28:59.714 [INFO] Reactor Summary:
2017-09-02T18:28:59.714 [INFO] 
2017-09-02T18:28:59.714 [INFO] Apache Beam :: Parent .............................. SUCCESS
[ 25.617 s]
2017-09-02T18:28:59.714 [INFO] Apache Beam :: SDKs :: Java :: Build Tools ......... SUCCESS
[ 10.903 s]
2017-09-02T18:28:59.714 [INFO] Apache Beam :: SDKs ................................ SUCCESS
[  6.163 s]
2017-09-02T18:28:59.714 [INFO] Apache Beam :: SDKs :: Common ...................... SUCCESS
[  2.996 s]
2017-09-02T18:28:59.714 [INFO] Apache Beam :: SDKs :: Common :: Runner API ........ SUCCESS
[ 38.608 s]
2017-09-02T18:28:59.714 [INFO] Apache Beam :: SDKs :: Common :: Fn API ............ SUCCESS
[ 20.716 s]
2017-09-02T18:28:59.714 [INFO] Apache Beam :: SDKs :: Java ........................ SUCCESS
[  2.947 s]
2017-09-02T18:28:59.714 [INFO] Apache Beam :: SDKs :: Java :: Core ................ SUCCESS
[02:47 min]
2017-09-02T18:28:59.714 [INFO] Apache Beam :: Runners ............................. SUCCESS
[  3.196 s]
2017-09-02T18:28:59.714 [INFO] Apache Beam :: Runners :: Core Construction Java ... SUCCESS
[ 44.284 s]
2017-09-02T18:28:59.714 [INFO] Apache Beam :: Runners :: Core Java ................ SUCCESS
[ 49.177 s]
2017-09-02T18:28:59.714 [INFO] Apache Beam :: Runners :: Direct Java .............. SUCCESS
[04:54 min]
2017-09-02T18:28:59.714 [INFO] Apache Beam :: SDKs :: Java :: IO .................. SUCCESS
[  3.102 s]
2017-09-02T18:28:59.714 [INFO] Apache Beam :: SDKs :: Java :: IO :: AMQP .......... SUCCESS
[ 23.845 s]
2017-09-02T18:28:59.714 [INFO] Apache Beam :: SDKs :: Java :: IO :: Common ........ SUCCESS
[  7.496 s]
2017-09-02T18:28:59.714 [INFO] Apache Beam :: SDKs :: Java :: IO :: Cassandra ..... SUCCESS
[ 24.385 s]
2017-09-02T18:28:59.714 [INFO] Apache Beam :: SDKs :: Java :: IO :: Elasticsearch . SUCCESS
[ 38.557 s]
2017-09-02T18:28:59.714 [INFO] Apache Beam :: SDKs :: Java :: Extensions .......... SUCCESS
[ 18.747 s]
2017-09-02T18:28:59.714 [INFO] Apache Beam :: SDKs :: Java :: Extensions :: Google Cloud Platform
Core SUCCESS [ 27.240 s]
2017-09-02T18:28:59.714 [INFO] Apache Beam :: SDKs :: Java :: Extensions :: Protobuf SUCCESS
[ 19.096 s]
2017-09-02T18:28:59.714 [INFO] Apache Beam :: SDKs :: Java :: IO :: Google Cloud Platform
SUCCESS [01:45 min]
2017-09-02T18:28:59.714 [INFO] Apache Beam :: SDKs :: Java :: IO :: Hadoop Common . SUCCESS
[ 20.659 s]
2017-09-02T18:28:59.714 [INFO] Apache Beam :: SDKs :: Java :: IO :: Hadoop File System SUCCESS
[ 31.066 s]
2017-09-02T18:28:59.714 [INFO] Apache Beam :: SDKs :: Java :: IO :: Hadoop ........ SUCCESS
[  5.937 s]
2017-09-02T18:28:59.714 [INFO] Apache Beam :: SDKs :: Java :: IO :: Hadoop :: input-format
SUCCESS [ 20.718 s]
2017-09-02T18:28:59.714 [INFO] Apache Beam :: Runners :: Google Cloud Dataflow .... SUCCESS
[07:53 min]
2017-09-02T18:28:59.714 [INFO] Apache Beam :: SDKs :: Java :: IO :: Hadoop :: jdk1.8-tests
FAILURE [ 11.900 s]
2017-09-02T18:28:59.714 [INFO] Apache Beam :: SDKs :: Java :: IO :: HBase ......... SKIPPED
2017-09-02T18:28:59.714 [INFO] Apache Beam :: SDKs :: Java :: IO :: HCatalog ...... SKIPPED
2017-09-02T18:28:59.714 [INFO] Apache Beam :: SDKs :: Java :: IO :: JDBC .......... SKIPPED
2017-09-02T18:28:59.714 [INFO] Apache Beam :: SDKs :: Java :: IO :: JMS ........... SKIPPED
2017-09-02T18:28:59.714 [INFO] Apache Beam :: SDKs :: Java :: IO :: Kafka ......... SKIPPED
2017-09-02T18:28:59.714 [INFO] Apache Beam :: SDKs :: Java :: IO :: Kinesis ....... SKIPPED
2017-09-02T18:28:59.714 [INFO] Apache Beam :: SDKs :: Java :: IO :: MongoDB ....... SKIPPED
2017-09-02T18:28:59.714 [INFO] Apache Beam :: SDKs :: Java :: IO :: MQTT .......... SKIPPED
2017-09-02T18:28:59.714 [INFO] Apache Beam :: SDKs :: Java :: IO :: Solr .......... SKIPPED
2017-09-02T18:28:59.714 [INFO] Apache Beam :: SDKs :: Java :: IO :: XML ........... SKIPPED
2017-09-02T18:28:59.714 [INFO] Apache Beam :: SDKs :: Java :: Maven Archetypes .... SKIPPED
2017-09-02T18:28:59.714 [INFO] Apache Beam :: SDKs :: Java :: Maven Archetypes :: Starter
SKIPPED
2017-09-02T18:28:59.714 [INFO] Apache Beam :: Examples ............................ SKIPPED
2017-09-02T18:28:59.714 [INFO] Apache Beam :: Examples :: Java .................... SKIPPED
2017-09-02T18:28:59.714 [INFO] Apache Beam :: SDKs :: Java :: Maven Archetypes :: Examples
SKIPPED
2017-09-02T18:28:59.714 [INFO] Apache Beam :: Examples :: Java 8 .................. SKIPPED
2017-09-02T18:28:59.714 [INFO] Apache Beam :: SDKs :: Java :: Maven Archetypes :: Examples
- Java 8 SKIPPED
2017-09-02T18:28:59.714 [INFO] Apache Beam :: SDKs :: Java :: Extensions :: Jackson SKIPPED
2017-09-02T18:28:59.714 [INFO] Apache Beam :: SDKs :: Java :: Extensions :: Join library SKIPPED
2017-09-02T18:28:59.715 [INFO] Apache Beam :: SDKs :: Java :: Extensions :: Sorter  SKIPPED
2017-09-02T18:28:59.715 [INFO] Apache Beam :: SDKs :: Java :: Nexmark ............. SKIPPED
2017-09-02T18:28:59.715 [INFO] Apache Beam :: SDKs :: Java :: Harness ............. SKIPPED
2017-09-02T18:28:59.715 [INFO] Apache Beam :: SDKs :: Java :: Java 8 Tests ........ SKIPPED
2017-09-02T18:28:59.715 [INFO] Apache Beam :: SDKs :: Python ...................... SKIPPED
2017-09-02T18:28:59.715 [INFO] Apache Beam :: Runners :: Flink .................... SKIPPED
2017-09-02T18:28:59.715 [INFO] Apache Beam :: Runners :: Spark .................... SKIPPED
2017-09-02T18:28:59.715 [INFO] Apache Beam :: Runners :: Apex ..................... SKIPPED
2017-09-02T18:28:59.715 [INFO] Apache Beam :: Runners :: Gearpump ................. SKIPPED
2017-09-02T18:28:59.715 [INFO] Apache Beam :: SDKs :: Java :: Aggregated Javadoc .. SKIPPED
2017-09-02T18:28:59.715 [INFO] ------------------------------------------------------------------------
2017-09-02T18:28:59.715 [INFO] BUILD FAILURE
2017-09-02T18:28:59.715 [INFO] ------------------------------------------------------------------------
2017-09-02T18:28:59.715 [INFO] Total time: 27:26 min
2017-09-02T18:28:59.715 [INFO] Finished at: 2017-09-02T18:28:59+00:00
2017-09-02T18:29:00.401 [INFO] Final Memory: 195M/1398M
2017-09-02T18:29:00.401 [INFO] ------------------------------------------------------------------------
2017-09-02T18:29:00.406 [ERROR] Failed to execute goal on project beam-sdks-java-io-hadoop-jdk1.8-tests:
Could not resolve dependencies for project org.apache.beam:beam-sdks-java-io-hadoop-jdk1.8-tests:jar:2.2.0-SNAPSHOT:
Failed to collect dependencies at org.elasticsearch:elasticsearch-hadoop:jar:5.0.0 -> org.apache.storm:storm-core:jar:1.0.1:
Failed to read artifact descriptor for org.apache.storm:storm-core:jar:1.0.1: Could not transfer
artifact org.apache.storm:storm:pom:1.0.1 from/to central (https://repo.maven.apache.org/maven2):
GET request of: org/apache/storm/storm/1.0.1/storm-1.0.1.pom from central failed: Connection
reset -> [Help 1]
org.apache.maven.lifecycle.LifecycleExecutionException: Failed to execute goal on project
beam-sdks-java-io-hadoop-jdk1.8-tests: Could not resolve dependencies for project org.apache.beam:beam-sdks-java-io-hadoop-jdk1.8-tests:jar:2.2.0-SNAPSHOT:
Failed to collect dependencies at org.elasticsearch:elasticsearch-hadoop:jar:5.0.0 -> org.apache.storm:storm-core:jar:1.0.1
	at org.apache.maven.lifecycle.internal.LifecycleDependencyResolver.getDependencies(LifecycleDependencyResolver.java:221)
	at org.apache.maven.lifecycle.internal.LifecycleDependencyResolver.resolveProjectDependencies(LifecycleDependencyResolver.java:127)
	at org.apache.maven.lifecycle.internal.MojoExecutor.ensureDependenciesAreResolved(MojoExecutor.java:257)
	at org.apache.maven.lifecycle.internal.MojoExecutor.execute(MojoExecutor.java:200)
	at org.apache.maven.lifecycle.internal.MojoExecutor.execute(MojoExecutor.java:153)
	at org.apache.maven.lifecycle.internal.MojoExecutor.execute(MojoExecutor.java:145)
	at org.apache.maven.lifecycle.internal.LifecycleModuleBuilder.buildProject(LifecycleModuleBuilder.java:116)
	at org.apache.maven.lifecycle.internal.LifecycleModuleBuilder.buildProject(LifecycleModuleBuilder.java:80)
	at org.apache.maven.lifecycle.internal.builder.singlethreaded.SingleThreadedBuilder.build(SingleThreadedBuilder.java:51)
	at org.apache.maven.lifecycle.internal.LifecycleStarter.execute(LifecycleStarter.java:128)
	at org.apache.maven.DefaultMaven.doExecute(DefaultMaven.java:307)
	at org.apache.maven.DefaultMaven.doExecute(DefaultMaven.java:193)
	at org.apache.maven.DefaultMaven.execute(DefaultMaven.java:106)
	at org.jvnet.hudson.maven3.launcher.Maven33Launcher.main(Maven33Launcher.java:129)
	at sun.reflect.NativeMethodAccessorImpl.invoke0(Native Method)
	at sun.reflect.NativeMethodAccessorImpl.invoke(NativeMethodAccessorImpl.java:62)
	at sun.reflect.DelegatingMethodAccessorImpl.invoke(DelegatingMethodAccessorImpl.java:43)
	at java.lang.reflect.Method.invoke(Method.java:498)
	at org.codehaus.plexus.classworlds.launcher.Launcher.launchStandard(Launcher.java:330)
	at org.codehaus.plexus.classworlds.launcher.Launcher.launch(Launcher.java:238)
	at jenkins.maven3.agent.Maven33Main.launch(Maven33Main.java:176)
	at sun.reflect.NativeMethodAccessorImpl.invoke0(Native Method)
	at sun.reflect.NativeMethodAccessorImpl.invoke(NativeMethodAccessorImpl.java:62)
	at sun.reflect.DelegatingMethodAccessorImpl.invoke(DelegatingMethodAccessorImpl.java:43)
	at java.lang.reflect.Method.invoke(Method.java:498)
	at hudson.maven.Maven3Builder.call(Maven3Builder.java:139)
	at hudson.maven.Maven3Builder.call(Maven3Builder.java:70)
	at hudson.remoting.UserRequest.perform(UserRequest.java:153)
	at hudson.remoting.UserRequest.perform(UserRequest.java:50)
	at hudson.remoting.Request$2.run(Request.java:336)
	at hudson.remoting.InterceptingExecutorService$1.call(InterceptingExecutorService.java:68)
	at java.util.concurrent.FutureTask.run(FutureTask.java:266)
	at java.util.concurrent.ThreadPoolExecutor.runWorker(ThreadPoolExecutor.java:1149)
	at java.util.concurrent.ThreadPoolExecutor$Worker.run(ThreadPoolExecutor.java:624)
	at java.lang.Thread.run(Thread.java:748)
Caused by: org.apache.maven.project.DependencyResolutionException: Could not resolve dependencies
for project org.apache.beam:beam-sdks-java-io-hadoop-jdk1.8-tests:jar:2.2.0-SNAPSHOT: Failed
to collect dependencies at org.elasticsearch:elasticsearch-hadoop:jar:5.0.0 -> org.apache.storm:storm-core:jar:1.0.1
	at org.apache.maven.project.DefaultProjectDependenciesResolver.resolve(DefaultProjectDependenciesResolver.java:180)
	at org.apache.maven.lifecycle.internal.LifecycleDependencyResolver.getDependencies(LifecycleDependencyResolver.java:195)
	... 34 more
Caused by: org.eclipse.aether.collection.DependencyCollectionException: Failed to collect
dependencies at org.elasticsearch:elasticsearch-hadoop:jar:5.0.0 -> org.apache.storm:storm-core:jar:1.0.1
	at org.eclipse.aether.internal.impl.DefaultDependencyCollector.collectDependencies(DefaultDependencyCollector.java:291)
	at org.eclipse.aether.internal.impl.DefaultRepositorySystem.collectDependencies(DefaultRepositorySystem.java:316)
	at org.apache.maven.project.DefaultProjectDependenciesResolver.resolve(DefaultProjectDependenciesResolver.java:172)
	... 35 more
Caused by: org.eclipse.aether.resolution.ArtifactDescriptorException: Failed to read artifact
descriptor for org.apache.storm:storm-core:jar:1.0.1
	at org.apache.maven.repository.internal.DefaultArtifactDescriptorReader.loadPom(DefaultArtifactDescriptorReader.java:349)
	at org.apache.maven.repository.internal.DefaultArtifactDescriptorReader.readArtifactDescriptor(DefaultArtifactDescriptorReader.java:218)
	at org.eclipse.aether.internal.impl.DefaultDependencyCollector.resolveCachedArtifactDescriptor(DefaultDependencyCollector.java:535)
	at org.eclipse.aether.internal.impl.DefaultDependencyCollector.getArtifactDescriptorResult(DefaultDependencyCollector.java:519)
	at org.eclipse.aether.internal.impl.DefaultDependencyCollector.processDependency(DefaultDependencyCollector.java:409)
	at org.eclipse.aether.internal.impl.DefaultDependencyCollector.processDependency(DefaultDependencyCollector.java:363)
	at org.eclipse.aether.internal.impl.DefaultDependencyCollector.process(DefaultDependencyCollector.java:351)
	at org.eclipse.aether.internal.impl.DefaultDependencyCollector.doRecurse(DefaultDependencyCollector.java:504)
	at org.eclipse.aether.internal.impl.DefaultDependencyCollector.processDependency(DefaultDependencyCollector.java:458)
	at org.eclipse.aether.internal.impl.DefaultDependencyCollector.processDependency(DefaultDependencyCollector.java:363)
	at org.eclipse.aether.internal.impl.DefaultDependencyCollector.process(DefaultDependencyCollector.java:351)
	at org.eclipse.aether.internal.impl.DefaultDependencyCollector.collectDependencies(DefaultDependencyCollector.java:254)
	... 37 more
Caused by: org.apache.maven.model.resolution.UnresolvableModelException: Could not transfer
artifact org.apache.storm:storm:pom:1.0.1 from/to central (https://repo.maven.apache.org/maven2):
GET request of: org/apache/storm/storm/1.0.1/storm-1.0.1.pom from central failed
	at org.apache.maven.repository.internal.DefaultModelResolver.resolveModel(DefaultModelResolver.java:177)
	at org.apache.maven.repository.internal.DefaultModelResolver.resolveModel(DefaultModelResolver.java:226)
	at org.apache.maven.model.building.DefaultModelBuilder.readParentExternally(DefaultModelBuilder.java:978)
	at org.apache.maven.model.building.DefaultModelBuilder.readParent(DefaultModelBuilder.java:796)
	at org.apache.maven.model.building.DefaultModelBuilder.build(DefaultModelBuilder.java:325)
	at org.apache.maven.repository.internal.DefaultArtifactDescriptorReader.loadPom(DefaultArtifactDescriptorReader.java:340)
	... 48 more
Caused by: org.eclipse.aether.resolution.ArtifactResolutionException: Could not transfer artifact
org.apache.storm:storm:pom:1.0.1 from/to central (https://repo.maven.apache.org/maven2): GET
request of: org/apache/storm/storm/1.0.1/storm-1.0.1.pom from central failed
	at org.eclipse.aether.internal.impl.DefaultArtifactResolver.resolve(DefaultArtifactResolver.java:444)
	at org.eclipse.aether.internal.impl.DefaultArtifactResolver.resolveArtifacts(DefaultArtifactResolver.java:246)
	at org.eclipse.aether.internal.impl.DefaultArtifactResolver.resolveArtifact(DefaultArtifactResolver.java:223)
	at org.apache.maven.repository.internal.DefaultModelResolver.resolveModel(DefaultModelResolver.java:173)
	... 53 more
Caused by: org.eclipse.aether.transfer.ArtifactTransferException: Could not transfer artifact
org.apache.storm:storm:pom:1.0.1 from/to central (https://repo.maven.apache.org/maven2): GET
request of: org/apache/storm/storm/1.0.1/storm-1.0.1.pom from central failed
	at org.eclipse.aether.connector.basic.ArtifactTransportListener.transferFailed(ArtifactTransportListener.java:43)
	at org.eclipse.aether.connector.basic.BasicRepositoryConnector$TaskRunner.run(BasicRepositoryConnector.java:355)
	at org.eclipse.aether.util.concurrency.RunnableErrorForwarder$1.run(RunnableErrorForwarder.java:67)
	at org.eclipse.aether.connector.basic.BasicRepositoryConnector$DirectExecutor.execute(BasicRepositoryConnector.java:581)
	at org.eclipse.aether.connector.basic.BasicRepositoryConnector.get(BasicRepositoryConnector.java:249)
	at org.eclipse.aether.internal.impl.DefaultArtifactResolver.performDownloads(DefaultArtifactResolver.java:520)
	at org.eclipse.aether.internal.impl.DefaultArtifactResolver.resolve(DefaultArtifactResolver.java:421)
	... 56 more
Caused by: org.apache.maven.wagon.TransferFailedException: GET request of: org/apache/storm/storm/1.0.1/storm-1.0.1.pom
from central failed
	at org.apache.maven.wagon.AbstractWagon.getTransfer(AbstractWagon.java:363)
	at org.apache.maven.wagon.AbstractWagon.getTransfer(AbstractWagon.java:316)
	at org.apache.maven.wagon.AbstractWagon.getTransfer(AbstractWagon.java:285)
	at org.apache.maven.wagon.StreamWagon.getIfNewer(StreamWagon.java:97)
	at org.apache.maven.wagon.StreamWagon.get(StreamWagon.java:61)
	at org.eclipse.aether.transport.wagon.WagonTransporter$GetTaskRunner.run(WagonTransporter.java:560)
	at org.eclipse.aether.transport.wagon.WagonTransporter.execute(WagonTransporter.java:427)
	at org.eclipse.aether.transport.wagon.WagonTransporter.get(WagonTransporter.java:404)
	at org.eclipse.aether.connector.basic.BasicRepositoryConnector$GetTaskRunner.runTask(BasicRepositoryConnector.java:447)
	at org.eclipse.aether.connector.basic.BasicRepositoryConnector$TaskRunner.run(BasicRepositoryConnector.java:350)
	... 61 more
Caused by: java.net.SocketException: Connection reset
	at java.net.SocketInputStream.read(SocketInputStream.java:210)
	at java.net.SocketInputStream.read(SocketInputStream.java:141)
	at sun.security.ssl.InputRecord.readFully(InputRecord.java:465)
	at sun.security.ssl.InputRecord.readV3Record(InputRecord.java:593)
	at sun.security.ssl.InputRecord.read(InputRecord.java:532)
	at sun.security.ssl.SSLSocketImpl.readRecord(SSLSocketImpl.java:983)
	at sun.security.ssl.SSLSocketImpl.readDataRecord(SSLSocketImpl.java:940)
	at sun.security.ssl.AppInputStream.read(AppInputStream.java:105)
	at org.apache.maven.wagon.providers.http.httpclient.impl.io.SessionInputBufferImpl.streamRead(SessionInputBufferImpl.java:136)
	at org.apache.maven.wagon.providers.http.httpclient.impl.io.SessionInputBufferImpl.read(SessionInputBufferImpl.java:195)
	at org.apache.maven.wagon.providers.http.httpclient.impl.io.ContentLengthInputStream.read(ContentLengthInputStream.java:178)
	at org.apache.maven.wagon.providers.http.httpclient.conn.EofSensorInputStream.read(EofSensorInputStream.java:137)
	at org.apache.maven.wagon.AbstractWagon.transfer(AbstractWagon.java:531)
	at org.apache.maven.wagon.AbstractWagon.getTransfer(AbstractWagon.java:353)
	... 70 more
2017-09-02T18:29:00.408 [ERROR] 
2017-09-02T18:29:00.408 [ERROR] Re-run Maven using the -X switch to enable full debug logging.
2017-09-02T18:29:00.408 [ERROR] 
2017-09-02T18:29:00.408 [ERROR] For more information about the errors and possible solutions,
please read the following articles:
2017-09-02T18:29:00.408 [ERROR] [Help 1] http://cwiki.apache.org/confluence/display/MAVEN/DependencyResolutionException
2017-09-02T18:29:00.408 [ERROR] 
2017-09-02T18:29:00.408 [ERROR] After correcting the problems, you can resume the build with
the command
2017-09-02T18:29:00.408 [ERROR]   mvn <goals> -rf :beam-sdks-java-io-hadoop-jdk1.8-tests
channel stopped

Mime
View raw message