beam-commits mailing list archives

Site index · List index
Message view « Date » · « Thread »
Top « Date » · « Thread »
From Apache Jenkins Server <jenk...@builds.apache.org>
Subject Build failed in Jenkins: beam_PostCommit_Java_ValidatesRunner_Apex #2489
Date Thu, 28 Sep 2017 19:36:28 GMT
See <https://builds.apache.org/job/beam_PostCommit_Java_ValidatesRunner_Apex/2489/display/redirect?page=changes>

Changes:

[robertwb] Avoid using beta grpc implementation.

------------------------------------------
[...truncated 479.37 KB...]
2017-09-28T19:36:06.761 [INFO] Downloading: https://repo.maven.apache.org/maven2/org/slf4j/slf4j-log4j12/1.6.1/slf4j-log4j12-1.6.1.pom
2017-09-28T19:36:06.789 [INFO] Downloaded: https://repo.maven.apache.org/maven2/org/slf4j/slf4j-log4j12/1.6.1/slf4j-log4j12-1.6.1.pom
(2 KB at 57.7 KB/sec)
2017-09-28T19:36:06.791 [INFO] Downloading: https://repo.maven.apache.org/maven2/org/slf4j/slf4j-parent/1.6.1/slf4j-parent-1.6.1.pom
2017-09-28T19:36:06.824 [INFO] Downloaded: https://repo.maven.apache.org/maven2/org/slf4j/slf4j-parent/1.6.1/slf4j-parent-1.6.1.pom
(10 KB at 275.9 KB/sec)
2017-09-28T19:36:06.827 [INFO] Downloading: https://repo.maven.apache.org/maven2/log4j/log4j/1.2.16/log4j-1.2.16.pom
2017-09-28T19:36:06.857 [INFO] Downloaded: https://repo.maven.apache.org/maven2/log4j/log4j/1.2.16/log4j-1.2.16.pom
(20 KB at 662.1 KB/sec)
2017-09-28T19:36:06.861 [INFO] Downloading: https://repo.maven.apache.org/maven2/jline/jline/0.9.94/jline-0.9.94.pom
2017-09-28T19:36:06.889 [INFO] Downloaded: https://repo.maven.apache.org/maven2/jline/jline/0.9.94/jline-0.9.94.pom
(7 KB at 221.8 KB/sec)
2017-09-28T19:36:06.892 [INFO] Downloading: https://repo.maven.apache.org/maven2/io/netty/netty/3.7.0.Final/netty-3.7.0.Final.pom
2017-09-28T19:36:06.924 [INFO] Downloaded: https://repo.maven.apache.org/maven2/io/netty/netty/3.7.0.Final/netty-3.7.0.Final.pom
(26 KB at 799.7 KB/sec)
2017-09-28T19:36:06.932 [INFO] Downloading: https://repo.maven.apache.org/maven2/org/apache/curator/curator-framework/2.7.1/curator-framework-2.7.1.pom
2017-09-28T19:36:06.960 [INFO] Downloaded: https://repo.maven.apache.org/maven2/org/apache/curator/curator-framework/2.7.1/curator-framework-2.7.1.pom
(3 KB at 78.3 KB/sec)
2017-09-28T19:36:06.961 [INFO] Downloading: https://repo.maven.apache.org/maven2/org/apache/curator/apache-curator/2.7.1/apache-curator-2.7.1.pom
2017-09-28T19:36:06.994 [INFO] Downloaded: https://repo.maven.apache.org/maven2/org/apache/curator/apache-curator/2.7.1/apache-curator-2.7.1.pom
(32 KB at 941.9 KB/sec)
2017-09-28T19:36:06.998 [INFO] Downloading: https://repo.maven.apache.org/maven2/org/apache/curator/curator-client/2.7.1/curator-client-2.7.1.pom
2017-09-28T19:36:07.026 [INFO] Downloaded: https://repo.maven.apache.org/maven2/org/apache/curator/curator-client/2.7.1/curator-client-2.7.1.pom
(3 KB at 78.8 KB/sec)
2017-09-28T19:36:07.030 [INFO] Downloading: https://repo.maven.apache.org/maven2/com/jcraft/jsch/0.1.42/jsch-0.1.42.pom
2017-09-28T19:36:07.057 [INFO] Downloaded: https://repo.maven.apache.org/maven2/com/jcraft/jsch/0.1.42/jsch-0.1.42.pom
(967 B at 35.0 KB/sec)
2017-09-28T19:36:07.059 [INFO] Downloading: https://repo.maven.apache.org/maven2/org/apache/curator/curator-recipes/2.7.1/curator-recipes-2.7.1.pom
2017-09-28T19:36:07.088 [INFO] Downloaded: https://repo.maven.apache.org/maven2/org/apache/curator/curator-recipes/2.7.1/curator-recipes-2.7.1.pom
(3 KB at 79.6 KB/sec)
2017-09-28T19:36:07.092 [INFO] Downloading: https://repo.maven.apache.org/maven2/org/apache/htrace/htrace-core/3.1.0-incubating/htrace-core-3.1.0-incubating.pom
2017-09-28T19:36:07.130 [INFO] Downloaded: https://repo.maven.apache.org/maven2/org/apache/htrace/htrace-core/3.1.0-incubating/htrace-core-3.1.0-incubating.pom
(4 KB at 105.1 KB/sec)
2017-09-28T19:36:07.132 [INFO] Downloading: https://repo.maven.apache.org/maven2/org/apache/htrace/htrace/3.1.0-incubating/htrace-3.1.0-incubating.pom
2017-09-28T19:36:07.160 [INFO] Downloaded: https://repo.maven.apache.org/maven2/org/apache/htrace/htrace/3.1.0-incubating/htrace-3.1.0-incubating.pom
(12 KB at 405.2 KB/sec)
2017-09-28T19:36:07.163 [INFO] Downloading: https://repo.maven.apache.org/maven2/org/apache/apache/12/apache-12.pom
2017-09-28T19:36:07.194 [INFO] Downloaded: https://repo.maven.apache.org/maven2/org/apache/apache/12/apache-12.pom
(16 KB at 473.6 KB/sec)
2017-09-28T19:36:07.198 [INFO] Downloading: https://repo.maven.apache.org/maven2/com/datatorrent/netlet/1.2.1/netlet-1.2.1.pom
2017-09-28T19:36:07.228 [INFO] Downloaded: https://repo.maven.apache.org/maven2/com/datatorrent/netlet/1.2.1/netlet-1.2.1.pom
(19 KB at 608.8 KB/sec)
2017-09-28T19:36:07.232 [INFO] Downloading: https://repo.maven.apache.org/maven2/org/slf4j/slf4j-log4j12/1.7.5/slf4j-log4j12-1.7.5.pom
2017-09-28T19:36:07.258 [INFO] Downloaded: https://repo.maven.apache.org/maven2/org/slf4j/slf4j-log4j12/1.7.5/slf4j-log4j12-1.7.5.pom
(2 KB at 60.1 KB/sec)
2017-09-28T19:36:07.262 [INFO] Downloading: https://repo.maven.apache.org/maven2/com/esotericsoftware/kryo/kryo/2.24.0/kryo-2.24.0.pom
2017-09-28T19:36:07.291 [INFO] Downloaded: https://repo.maven.apache.org/maven2/com/esotericsoftware/kryo/kryo/2.24.0/kryo-2.24.0.pom
(7 KB at 209.5 KB/sec)
2017-09-28T19:36:07.294 [INFO] Downloading: https://repo.maven.apache.org/maven2/org/objenesis/objenesis/2.1/objenesis-2.1.pom
2017-09-28T19:36:07.321 [INFO] Downloaded: https://repo.maven.apache.org/maven2/org/objenesis/objenesis/2.1/objenesis-2.1.pom
(3 KB at 91.7 KB/sec)
2017-09-28T19:36:07.324 [INFO] Downloading: https://repo.maven.apache.org/maven2/org/objenesis/objenesis-parent/2.1/objenesis-parent-2.1.pom
2017-09-28T19:36:07.353 [INFO] Downloaded: https://repo.maven.apache.org/maven2/org/objenesis/objenesis-parent/2.1/objenesis-parent-2.1.pom
(17 KB at 562.6 KB/sec)
2017-09-28T19:36:07.357 [INFO] Downloading: https://repo.maven.apache.org/maven2/org/codehaus/jackson/jackson-core-asl/1.9.2/jackson-core-asl-1.9.2.pom
2017-09-28T19:36:07.385 [INFO] Downloaded: https://repo.maven.apache.org/maven2/org/codehaus/jackson/jackson-core-asl/1.9.2/jackson-core-asl-1.9.2.pom
(1016 B at 35.4 KB/sec)
2017-09-28T19:36:07.387 [INFO] Downloading: https://repo.maven.apache.org/maven2/org/codehaus/jackson/jackson-mapper-asl/1.9.2/jackson-mapper-asl-1.9.2.pom
2017-09-28T19:36:07.416 [INFO] Downloaded: https://repo.maven.apache.org/maven2/org/codehaus/jackson/jackson-mapper-asl/1.9.2/jackson-mapper-asl-1.9.2.pom
(2 KB at 41.8 KB/sec)
2017-09-28T19:36:07.419 [INFO] Downloading: https://repo.maven.apache.org/maven2/javax/validation/validation-api/1.1.0.Final/validation-api-1.1.0.Final.pom
2017-09-28T19:36:07.446 [INFO] Downloaded: https://repo.maven.apache.org/maven2/javax/validation/validation-api/1.1.0.Final/validation-api-1.1.0.Final.pom
(8 KB at 284.3 KB/sec)
2017-09-28T19:36:07.449 [INFO] Downloading: https://repo.maven.apache.org/maven2/org/eclipse/jetty/jetty-servlet/8.1.10.v20130312/jetty-servlet-8.1.10.v20130312.pom
2017-09-28T19:36:07.478 [INFO] Downloaded: https://repo.maven.apache.org/maven2/org/eclipse/jetty/jetty-servlet/8.1.10.v20130312/jetty-servlet-8.1.10.v20130312.pom
(3 KB at 90.4 KB/sec)
2017-09-28T19:36:07.480 [INFO] Downloading: https://repo.maven.apache.org/maven2/org/eclipse/jetty/jetty-project/8.1.10.v20130312/jetty-project-8.1.10.v20130312.pom
2017-09-28T19:36:07.511 [INFO] Downloaded: https://repo.maven.apache.org/maven2/org/eclipse/jetty/jetty-project/8.1.10.v20130312/jetty-project-8.1.10.v20130312.pom
(28 KB at 879.5 KB/sec)
2017-09-28T19:36:07.514 [INFO] Downloading: https://repo.maven.apache.org/maven2/org/eclipse/jetty/jetty-parent/20/jetty-parent-20.pom
2017-09-28T19:36:07.544 [INFO] Downloaded: https://repo.maven.apache.org/maven2/org/eclipse/jetty/jetty-parent/20/jetty-parent-20.pom
(21 KB at 690.0 KB/sec)
2017-09-28T19:36:07.550 [INFO] Downloading: https://repo.maven.apache.org/maven2/org/eclipse/jetty/jetty-security/8.1.10.v20130312/jetty-security-8.1.10.v20130312.pom
2017-09-28T19:36:07.578 [INFO] Downloaded: https://repo.maven.apache.org/maven2/org/eclipse/jetty/jetty-security/8.1.10.v20130312/jetty-security-8.1.10.v20130312.pom
(3 KB at 94.0 KB/sec)
2017-09-28T19:36:07.584 [INFO] Downloading: https://repo.maven.apache.org/maven2/org/eclipse/jetty/jetty-server/8.1.10.v20130312/jetty-server-8.1.10.v20130312.pom
2017-09-28T19:36:07.611 [INFO] Downloaded: https://repo.maven.apache.org/maven2/org/eclipse/jetty/jetty-server/8.1.10.v20130312/jetty-server-8.1.10.v20130312.pom
(4 KB at 135.2 KB/sec)
2017-09-28T19:36:07.618 [INFO] Downloading: https://repo.maven.apache.org/maven2/org/eclipse/jetty/jetty-continuation/8.1.10.v20130312/jetty-continuation-8.1.10.v20130312.pom
2017-09-28T19:36:07.646 [INFO] Downloaded: https://repo.maven.apache.org/maven2/org/eclipse/jetty/jetty-continuation/8.1.10.v20130312/jetty-continuation-8.1.10.v20130312.pom
(3 KB at 93.9 KB/sec)
2017-09-28T19:36:07.652 [INFO] Downloading: https://repo.maven.apache.org/maven2/org/eclipse/jetty/jetty-http/8.1.10.v20130312/jetty-http-8.1.10.v20130312.pom
2017-09-28T19:36:07.680 [INFO] Downloaded: https://repo.maven.apache.org/maven2/org/eclipse/jetty/jetty-http/8.1.10.v20130312/jetty-http-8.1.10.v20130312.pom
(3 KB at 90.6 KB/sec)
2017-09-28T19:36:07.686 [INFO] Downloading: https://repo.maven.apache.org/maven2/org/eclipse/jetty/jetty-io/8.1.10.v20130312/jetty-io-8.1.10.v20130312.pom
2017-09-28T19:36:07.715 [INFO] Downloaded: https://repo.maven.apache.org/maven2/org/eclipse/jetty/jetty-io/8.1.10.v20130312/jetty-io-8.1.10.v20130312.pom
(3 KB at 70.9 KB/sec)
2017-09-28T19:36:07.721 [INFO] Downloading: https://repo.maven.apache.org/maven2/org/eclipse/jetty/jetty-util/8.1.10.v20130312/jetty-util-8.1.10.v20130312.pom
2017-09-28T19:36:07.750 [INFO] Downloaded: https://repo.maven.apache.org/maven2/org/eclipse/jetty/jetty-util/8.1.10.v20130312/jetty-util-8.1.10.v20130312.pom
(4 KB at 114.2 KB/sec)
2017-09-28T19:36:07.756 [INFO] Downloading: https://repo.maven.apache.org/maven2/com/sun/mail/javax.mail/1.5.0/javax.mail-1.5.0.pom
2017-09-28T19:36:07.786 [INFO] Downloaded: https://repo.maven.apache.org/maven2/com/sun/mail/javax.mail/1.5.0/javax.mail-1.5.0.pom
(5 KB at 139.9 KB/sec)
2017-09-28T19:36:07.788 [INFO] Downloading: https://repo.maven.apache.org/maven2/com/sun/mail/all/1.5.0/all-1.5.0.pom
2017-09-28T19:36:07.818 [INFO] Downloaded: https://repo.maven.apache.org/maven2/com/sun/mail/all/1.5.0/all-1.5.0.pom
(19 KB at 632.6 KB/sec)
2017-09-28T19:36:07.821 [INFO] Downloading: https://repo.maven.apache.org/maven2/com/sun/jersey/jersey-client/1.9/jersey-client-1.9.pom
2017-09-28T19:36:07.849 [INFO] Downloaded: https://repo.maven.apache.org/maven2/com/sun/jersey/jersey-client/1.9/jersey-client-1.9.pom
(7 KB at 224.7 KB/sec)
2017-09-28T19:36:07.852 [INFO] Downloading: https://repo.maven.apache.org/maven2/javax/jms/jms-api/1.1-rev-1/jms-api-1.1-rev-1.pom
2017-09-28T19:36:07.881 [INFO] Downloaded: https://repo.maven.apache.org/maven2/javax/jms/jms-api/1.1-rev-1/jms-api-1.1-rev-1.pom
(3 KB at 103.3 KB/sec)
2017-09-28T19:36:07.883 [INFO] Downloading: https://repo.maven.apache.org/maven2/org/glassfish/api/api/1/api-1.pom
2017-09-28T19:36:07.910 [INFO] Downloaded: https://repo.maven.apache.org/maven2/org/glassfish/api/api/1/api-1.pom
(6 KB at 187.0 KB/sec)
2017-09-28T19:36:07.912 [INFO] Downloading: https://repo.maven.apache.org/maven2/org/glassfish/pom/2/pom-2.pom
2017-09-28T19:36:07.942 [INFO] Downloaded: https://repo.maven.apache.org/maven2/org/glassfish/pom/2/pom-2.pom
(9 KB at 304.4 KB/sec)
2017-09-28T19:36:07.945 [INFO] Downloading: https://repo.maven.apache.org/maven2/org/apache/activemq/activemq-client/5.8.0/activemq-client-5.8.0.pom
2017-09-28T19:36:07.974 [INFO] Downloaded: https://repo.maven.apache.org/maven2/org/apache/activemq/activemq-client/5.8.0/activemq-client-5.8.0.pom
(11 KB at 339.9 KB/sec)
2017-09-28T19:36:07.976 [INFO] Downloading: https://repo.maven.apache.org/maven2/org/apache/activemq/activemq-parent/5.8.0/activemq-parent-5.8.0.pom
2017-09-28T19:36:08.012 [INFO] Downloaded: https://repo.maven.apache.org/maven2/org/apache/activemq/activemq-parent/5.8.0/activemq-parent-5.8.0.pom
(54 KB at 1493.2 KB/sec)
2017-09-28T19:36:08.021 [INFO] Downloading: https://repo.maven.apache.org/maven2/org/apache/geronimo/specs/geronimo-jms_1.1_spec/1.1.1/geronimo-jms_1.1_spec-1.1.1.pom
2017-09-28T19:36:08.050 [INFO] Downloaded: https://repo.maven.apache.org/maven2/org/apache/geronimo/specs/geronimo-jms_1.1_spec/1.1.1/geronimo-jms_1.1_spec-1.1.1.pom
(3 KB at 86.9 KB/sec)
2017-09-28T19:36:08.052 [INFO] Downloading: https://repo.maven.apache.org/maven2/org/apache/geronimo/specs/specs/1.4/specs-1.4.pom
2017-09-28T19:36:08.081 [INFO] Downloaded: https://repo.maven.apache.org/maven2/org/apache/geronimo/specs/specs/1.4/specs-1.4.pom
(12 KB at 404.1 KB/sec)
2017-09-28T19:36:08.084 [INFO] Downloading: https://repo.maven.apache.org/maven2/org/apache/geronimo/genesis/config/project-config/1.2/project-config-1.2.pom
2017-09-28T19:36:08.114 [INFO] Downloaded: https://repo.maven.apache.org/maven2/org/apache/geronimo/genesis/config/project-config/1.2/project-config-1.2.pom
(22 KB at 709.4 KB/sec)
2017-09-28T19:36:08.117 [INFO] Downloading: https://repo.maven.apache.org/maven2/org/apache/geronimo/genesis/config/config/1.2/config-1.2.pom
2017-09-28T19:36:08.146 [INFO] Downloaded: https://repo.maven.apache.org/maven2/org/apache/geronimo/genesis/config/config/1.2/config-1.2.pom
(2 KB at 59.8 KB/sec)
2017-09-28T19:36:08.148 [INFO] Downloading: https://repo.maven.apache.org/maven2/org/apache/geronimo/genesis/genesis/1.2/genesis-1.2.pom
2017-09-28T19:36:08.178 [INFO] Downloaded: https://repo.maven.apache.org/maven2/org/apache/geronimo/genesis/genesis/1.2/genesis-1.2.pom
(11 KB at 361.2 KB/sec)
2017-09-28T19:36:08.182 [INFO] Downloading: https://repo.maven.apache.org/maven2/org/fusesource/hawtbuf/hawtbuf/1.9/hawtbuf-1.9.pom
2017-09-28T19:36:08.212 [INFO] Downloaded: https://repo.maven.apache.org/maven2/org/fusesource/hawtbuf/hawtbuf/1.9/hawtbuf-1.9.pom
(3 KB at 84.5 KB/sec)
2017-09-28T19:36:08.214 [INFO] Downloading: https://repo.maven.apache.org/maven2/org/fusesource/hawtbuf/hawtbuf-project/1.9/hawtbuf-project-1.9.pom
2017-09-28T19:36:08.242 [INFO] Downloaded: https://repo.maven.apache.org/maven2/org/fusesource/hawtbuf/hawtbuf-project/1.9/hawtbuf-project-1.9.pom
(11 KB at 373.3 KB/sec)
2017-09-28T19:36:08.244 [INFO] Downloading: https://repo.maven.apache.org/maven2/org/fusesource/fusesource-pom/1.9/fusesource-pom-1.9.pom
2017-09-28T19:36:08.273 [INFO] Downloaded: https://repo.maven.apache.org/maven2/org/fusesource/fusesource-pom/1.9/fusesource-pom-1.9.pom
(15 KB at 498.1 KB/sec)
2017-09-28T19:36:08.277 [INFO] Downloading: https://repo.maven.apache.org/maven2/org/apache/geronimo/specs/geronimo-j2ee-management_1.1_spec/1.0.1/geronimo-j2ee-management_1.1_spec-1.0.1.pom
2017-09-28T19:36:08.306 [INFO] Downloaded: https://repo.maven.apache.org/maven2/org/apache/geronimo/specs/geronimo-j2ee-management_1.1_spec/1.0.1/geronimo-j2ee-management_1.1_spec-1.0.1.pom
(3 KB at 85.8 KB/sec)
2017-09-28T19:36:08.309 [INFO] Downloading: https://repo.maven.apache.org/maven2/com/github/tony19/named-regexp/0.2.3/named-regexp-0.2.3.pom
2017-09-28T19:36:08.338 [INFO] Downloaded: https://repo.maven.apache.org/maven2/com/github/tony19/named-regexp/0.2.3/named-regexp-0.2.3.pom
(7 KB at 229.4 KB/sec)
2017-09-28T19:36:08.341 [INFO] Downloading: https://repo.maven.apache.org/maven2/org/codehaus/janino/commons-compiler/2.7.8/commons-compiler-2.7.8.pom
2017-09-28T19:36:08.369 [INFO] Downloaded: https://repo.maven.apache.org/maven2/org/codehaus/janino/commons-compiler/2.7.8/commons-compiler-2.7.8.pom
(666 B at 23.2 KB/sec)
2017-09-28T19:36:08.371 [INFO] Downloading: https://repo.maven.apache.org/maven2/org/codehaus/janino/janino-parent/2.7.8/janino-parent-2.7.8.pom
2017-09-28T19:36:08.401 [INFO] Downloaded: https://repo.maven.apache.org/maven2/org/codehaus/janino/janino-parent/2.7.8/janino-parent-2.7.8.pom
(9 KB at 271.7 KB/sec)
2017-09-28T19:36:08.405 [INFO] Downloading: https://repo.maven.apache.org/maven2/org/eclipse/jetty/jetty-websocket/8.1.10.v20130312/jetty-websocket-8.1.10.v20130312.pom
2017-09-28T19:36:08.433 [INFO] Downloaded: https://repo.maven.apache.org/maven2/org/eclipse/jetty/jetty-websocket/8.1.10.v20130312/jetty-websocket-8.1.10.v20130312.pom
(4 KB at 141.5 KB/sec)
2017-09-28T19:36:08.440 [INFO] Downloading: https://repo.maven.apache.org/maven2/it/unimi/dsi/fastutil/7.0.6/fastutil-7.0.6.pom
2017-09-28T19:36:08.467 [INFO] Downloaded: https://repo.maven.apache.org/maven2/it/unimi/dsi/fastutil/7.0.6/fastutil-7.0.6.pom
(2 KB at 39.8 KB/sec)
2017-09-28T19:36:08.470 [INFO] Downloading: https://repo.maven.apache.org/maven2/org/apache/apex/apex-shaded-ning19/1.0.0/apex-shaded-ning19-1.0.0.pom
2017-09-28T19:36:08.499 [INFO] Downloaded: https://repo.maven.apache.org/maven2/org/apache/apex/apex-shaded-ning19/1.0.0/apex-shaded-ning19-1.0.0.pom
(651 B at 21.9 KB/sec)
2017-09-28T19:36:08.501 [INFO] Downloading: https://repo.maven.apache.org/maven2/org/apache/apex/apex-engine/3.6.0/apex-engine-3.6.0.pom
2017-09-28T19:36:08.530 [INFO] Downloaded: https://repo.maven.apache.org/maven2/org/apache/apex/apex-engine/3.6.0/apex-engine-3.6.0.pom
(14 KB at 451.1 KB/sec)
2017-09-28T19:36:08.533 [INFO] Downloading: https://repo.maven.apache.org/maven2/org/apache/apex/apex/3.6.0/apex-3.6.0.pom
2017-09-28T19:36:08.562 [INFO] Downloaded: https://repo.maven.apache.org/maven2/org/apache/apex/apex/3.6.0/apex-3.6.0.pom
(17 KB at 554.2 KB/sec)
2017-09-28T19:36:08.567 [INFO] Downloading: https://repo.maven.apache.org/maven2/org/apache/bval/bval-jsr303/0.5/bval-jsr303-0.5.pom
2017-09-28T19:36:08.597 [INFO] Downloaded: https://repo.maven.apache.org/maven2/org/apache/bval/bval-jsr303/0.5/bval-jsr303-0.5.pom
(9 KB at 280.9 KB/sec)
2017-09-28T19:36:08.599 [INFO] Downloading: https://repo.maven.apache.org/maven2/org/apache/bval/bval-parent/0.5/bval-parent-0.5.pom
2017-09-28T19:36:08.630 [INFO] Downloaded: https://repo.maven.apache.org/maven2/org/apache/bval/bval-parent/0.5/bval-parent-0.5.pom
(25 KB at 806.5 KB/sec)
2017-09-28T19:36:08.634 [INFO] Downloading: https://repo.maven.apache.org/maven2/org/apache/bval/bval-core/0.5/bval-core-0.5.pom
2017-09-28T19:36:08.663 [INFO] Downloaded: https://repo.maven.apache.org/maven2/org/apache/bval/bval-core/0.5/bval-core-0.5.pom
(6 KB at 211.4 KB/sec)
2017-09-28T19:36:08.667 [INFO] Downloading: https://repo.maven.apache.org/maven2/org/apache/apex/apex-bufferserver/3.6.0/apex-bufferserver-3.6.0.pom
2017-09-28T19:36:08.696 [INFO] Downloaded: https://repo.maven.apache.org/maven2/org/apache/apex/apex-bufferserver/3.6.0/apex-bufferserver-3.6.0.pom
(3 KB at 78.3 KB/sec)
2017-09-28T19:36:08.699 [INFO] Downloading: https://repo.maven.apache.org/maven2/org/apache/httpcomponents/httpclient/4.3.6/httpclient-4.3.6.pom
2017-09-28T19:36:08.727 [INFO] Downloaded: https://repo.maven.apache.org/maven2/org/apache/httpcomponents/httpclient/4.3.6/httpclient-4.3.6.pom
(6 KB at 181.7 KB/sec)
2017-09-28T19:36:08.732 [INFO] Downloading: https://repo.maven.apache.org/maven2/org/apache/httpcomponents/httpcomponents-client/4.3.6/httpcomponents-client-4.3.6.pom
2017-09-28T19:36:08.761 [INFO] Downloaded: https://repo.maven.apache.org/maven2/org/apache/httpcomponents/httpcomponents-client/4.3.6/httpcomponents-client-4.3.6.pom
(16 KB at 537.0 KB/sec)
2017-09-28T19:36:08.764 [INFO] Downloading: https://repo.maven.apache.org/maven2/org/apache/httpcomponents/project/7/project-7.pom
2017-09-28T19:36:08.795 [INFO] Downloaded: https://repo.maven.apache.org/maven2/org/apache/httpcomponents/project/7/project-7.pom
(27 KB at 858.2 KB/sec)
2017-09-28T19:36:08.800 [INFO] Downloading: https://repo.maven.apache.org/maven2/org/apache/httpcomponents/httpcore/4.3.3/httpcore-4.3.3.pom
2017-09-28T19:36:08.828 [INFO] Downloaded: https://repo.maven.apache.org/maven2/org/apache/httpcomponents/httpcore/4.3.3/httpcore-4.3.3.pom
(5 KB at 160.3 KB/sec)
2017-09-28T19:36:08.830 [INFO] Downloading: https://repo.maven.apache.org/maven2/org/apache/httpcomponents/httpcomponents-core/4.3.3/httpcomponents-core-4.3.3.pom
2017-09-28T19:36:08.860 [INFO] Downloaded: https://repo.maven.apache.org/maven2/org/apache/httpcomponents/httpcomponents-core/4.3.3/httpcomponents-core-4.3.3.pom
(13 KB at 429.3 KB/sec)
2017-09-28T19:36:08.867 [INFO] Downloading: https://repo.maven.apache.org/maven2/com/sun/jersey/contribs/jersey-apache-client4/1.9/jersey-apache-client4-1.9.pom
2017-09-28T19:36:08.896 [INFO] Downloaded: https://repo.maven.apache.org/maven2/com/sun/jersey/contribs/jersey-apache-client4/1.9/jersey-apache-client4-1.9.pom
(7 KB at 209.2 KB/sec)
2017-09-28T19:36:08.898 [INFO] Downloading: https://repo.maven.apache.org/maven2/com/sun/jersey/contribs/jersey-contribs/1.9/jersey-contribs-1.9.pom
2017-09-28T19:36:08.925 [INFO] Downloaded: https://repo.maven.apache.org/maven2/com/sun/jersey/contribs/jersey-contribs/1.9/jersey-contribs-1.9.pom
(5 KB at 150.3 KB/sec)
2017-09-28T19:36:08.928 [INFO] Downloading: https://repo.maven.apache.org/maven2/org/apache/httpcomponents/httpclient/4.1.1/httpclient-4.1.1.pom
2017-09-28T19:36:08.957 [INFO] Downloaded: https://repo.maven.apache.org/maven2/org/apache/httpcomponents/httpclient/4.1.1/httpclient-4.1.1.pom
(6 KB at 201.7 KB/sec)
2017-09-28T19:36:08.959 [INFO] Downloading: https://repo.maven.apache.org/maven2/org/apache/httpcomponents/httpcomponents-client/4.1.1/httpcomponents-client-4.1.1.pom
2017-09-28T19:36:08.988 [INFO] Downloaded: https://repo.maven.apache.org/maven2/org/apache/httpcomponents/httpcomponents-client/4.1.1/httpcomponents-client-4.1.1.pom
(12 KB at 381.8 KB/sec)
2017-09-28T19:36:08.990 [INFO] Downloading: https://repo.maven.apache.org/maven2/org/apache/httpcomponents/project/4.1.1/project-4.1.1.pom
2017-09-28T19:36:09.020 [INFO] Downloaded: https://repo.maven.apache.org/maven2/org/apache/httpcomponents/project/4.1.1/project-4.1.1.pom
(17 KB at 545.8 KB/sec)
2017-09-28T19:36:09.024 [INFO] Downloading: https://repo.maven.apache.org/maven2/org/apache/httpcomponents/httpcore/4.1/httpcore-4.1.pom
2017-09-28T19:36:09.054 [INFO] Downloaded: https://repo.maven.apache.org/maven2/org/apache/httpcomponents/httpcore/4.1/httpcore-4.1.pom
(9 KB at 272.1 KB/sec)
2017-09-28T19:36:09.057 [INFO] Downloading: https://repo.maven.apache.org/maven2/org/apache/httpcomponents/httpcomponents-core/4.1/httpcomponents-core-4.1.pom
2017-09-28T19:36:09.085 [INFO] Downloaded: https://repo.maven.apache.org/maven2/org/apache/httpcomponents/httpcomponents-core/4.1/httpcomponents-core-4.1.pom
(9 KB at 315.4 KB/sec)
2017-09-28T19:36:09.089 [INFO] Downloading: https://repo.maven.apache.org/maven2/org/apache/hadoop/hadoop-yarn-client/2.6.0/hadoop-yarn-client-2.6.0.pom
2017-09-28T19:36:09.118 [INFO] Downloaded: https://repo.maven.apache.org/maven2/org/apache/hadoop/hadoop-yarn-client/2.6.0/hadoop-yarn-client-2.6.0.pom
(7 KB at 213.0 KB/sec)
2017-09-28T19:36:09.120 [INFO] Downloading: https://repo.maven.apache.org/maven2/org/apache/hadoop/hadoop-yarn/2.6.0/hadoop-yarn-2.6.0.pom
2017-09-28T19:36:09.149 [INFO] Downloaded: https://repo.maven.apache.org/maven2/org/apache/hadoop/hadoop-yarn/2.6.0/hadoop-yarn-2.6.0.pom
(4 KB at 120.5 KB/sec)
2017-09-28T19:36:09.151 [INFO] Downloading: https://repo.maven.apache.org/maven2/org/apache/hadoop/hadoop-project/2.6.0/hadoop-project-2.6.0.pom
2017-09-28T19:36:09.185 [INFO] Downloaded: https://repo.maven.apache.org/maven2/org/apache/hadoop/hadoop-project/2.6.0/hadoop-project-2.6.0.pom
(43 KB at 1245.5 KB/sec)
2017-09-28T19:36:09.189 [INFO] Downloading: https://repo.maven.apache.org/maven2/org/apache/hadoop/hadoop-main/2.6.0/hadoop-main-2.6.0.pom
2017-09-28T19:36:09.220 [INFO] Downloaded: https://repo.maven.apache.org/maven2/org/apache/hadoop/hadoop-main/2.6.0/hadoop-main-2.6.0.pom
(18 KB at 569.6 KB/sec)
2017-09-28T19:36:09.226 [INFO] Downloading: https://repo.maven.apache.org/maven2/org/apache/hadoop/hadoop-annotations/2.6.0/hadoop-annotations-2.6.0.pom
2017-09-28T19:36:09.253 [INFO] Downloaded: https://repo.maven.apache.org/maven2/org/apache/hadoop/hadoop-annotations/2.6.0/hadoop-annotations-2.6.0.pom
(3 KB at 86.4 KB/sec)
2017-09-28T19:36:09.258 [INFO] Downloading: https://repo.maven.apache.org/maven2/org/apache/hadoop/hadoop-yarn-api/2.6.0/hadoop-yarn-api-2.6.0.pom
2017-09-28T19:36:09.288 [INFO] Downloaded: https://repo.maven.apache.org/maven2/org/apache/hadoop/hadoop-yarn-api/2.6.0/hadoop-yarn-api-2.6.0.pom
(5 KB at 150.2 KB/sec)
2017-09-28T19:36:09.294 [INFO] Downloading: https://repo.maven.apache.org/maven2/org/apache/hadoop/hadoop-yarn-common/2.6.0/hadoop-yarn-common-2.6.0.pom
2017-09-28T19:36:09.324 [INFO] Downloaded: https://repo.maven.apache.org/maven2/org/apache/hadoop/hadoop-yarn-common/2.6.0/hadoop-yarn-common-2.6.0.pom
(11 KB at 341.7 KB/sec)
2017-09-28T19:36:09.333 [INFO] Downloading: https://repo.maven.apache.org/maven2/com/google/inject/extensions/guice-servlet/3.0/guice-servlet-3.0.pom
2017-09-28T19:36:09.360 [INFO] Downloaded: https://repo.maven.apache.org/maven2/com/google/inject/extensions/guice-servlet/3.0/guice-servlet-3.0.pom
(915 B at 33.1 KB/sec)
2017-09-28T19:36:09.362 [INFO] Downloading: https://repo.maven.apache.org/maven2/com/google/inject/extensions/extensions-parent/3.0/extensions-parent-3.0.pom
2017-09-28T19:36:09.392 [INFO] Downloaded: https://repo.maven.apache.org/maven2/com/google/inject/extensions/extensions-parent/3.0/extensions-parent-3.0.pom
(4 KB at 117.4 KB/sec)
2017-09-28T19:36:09.394 [INFO] Downloading: https://repo.maven.apache.org/maven2/com/google/inject/guice-parent/3.0/guice-parent-3.0.pom
2017-09-28T19:36:09.423 [INFO] Downloaded: https://repo.maven.apache.org/maven2/com/google/inject/guice-parent/3.0/guice-parent-3.0.pom
(13 KB at 436.9 KB/sec)
2017-09-28T19:36:09.425 [INFO] Downloading: https://repo.maven.apache.org/maven2/com/google/google/5/google-5.pom
2017-09-28T19:36:09.453 [INFO] Downloaded: https://repo.maven.apache.org/maven2/com/google/google/5/google-5.pom
(3 KB at 85.7 KB/sec)
2017-09-28T19:36:09.456 [INFO] Downloading: https://repo.maven.apache.org/maven2/com/google/inject/guice/3.0/guice-3.0.pom
2017-09-28T19:36:09.483 [INFO] Downloaded: https://repo.maven.apache.org/maven2/com/google/inject/guice/3.0/guice-3.0.pom
(8 KB at 263.4 KB/sec)
2017-09-28T19:36:09.487 [INFO] Downloading: https://repo.maven.apache.org/maven2/com/sun/jersey/jersey-server/1.9/jersey-server-1.9.pom
2017-09-28T19:36:09.516 [INFO] Downloaded: https://repo.maven.apache.org/maven2/com/sun/jersey/jersey-server/1.9/jersey-server-1.9.pom
(12 KB at 389.3 KB/sec)
2017-09-28T19:36:09.519 [INFO] Downloading: https://repo.maven.apache.org/maven2/asm/asm/3.1/asm-3.1.pom
2017-09-28T19:36:09.546 [INFO] Downloaded: https://repo.maven.apache.org/maven2/asm/asm/3.1/asm-3.1.pom
(278 B at 10.1 KB/sec)
2017-09-28T19:36:09.548 [INFO] Downloading: https://repo.maven.apache.org/maven2/asm/asm-parent/3.1/asm-parent-3.1.pom
2017-09-28T19:36:09.575 [INFO] Downloaded: https://repo.maven.apache.org/maven2/asm/asm-parent/3.1/asm-parent-3.1.pom
(5 KB at 150.2 KB/sec)
2017-09-28T19:36:09.579 [INFO] Downloading: https://repo.maven.apache.org/maven2/com/sun/jersey/contribs/jersey-guice/1.9/jersey-guice-1.9.pom
2017-09-28T19:36:09.607 [INFO] Downloaded: https://repo.maven.apache.org/maven2/com/sun/jersey/contribs/jersey-guice/1.9/jersey-guice-1.9.pom
(8 KB at 270.4 KB/sec)
2017-09-28T19:36:09.610 [INFO] Downloading: https://repo.maven.apache.org/maven2/jline/jline/2.11/jline-2.11.pom
2017-09-28T19:36:09.640 [INFO] Downloaded: https://repo.maven.apache.org/maven2/jline/jline/2.11/jline-2.11.pom
(17 KB at 549.1 KB/sec)
2017-09-28T19:36:09.644 [INFO] Downloading: https://repo.maven.apache.org/maven2/org/apache/ant/ant/1.9.2/ant-1.9.2.pom
2017-09-28T19:36:09.673 [INFO] Downloaded: https://repo.maven.apache.org/maven2/org/apache/ant/ant/1.9.2/ant-1.9.2.pom
(10 KB at 318.8 KB/sec)
2017-09-28T19:36:09.675 [INFO] Downloading: https://repo.maven.apache.org/maven2/org/apache/ant/ant-parent/1.9.2/ant-parent-1.9.2.pom
2017-09-28T19:36:09.704 [INFO] Downloaded: https://repo.maven.apache.org/maven2/org/apache/ant/ant-parent/1.9.2/ant-parent-1.9.2.pom
(6 KB at 188.7 KB/sec)
2017-09-28T19:36:09.707 [INFO] Downloading: https://repo.maven.apache.org/maven2/org/apache/ant/ant-launcher/1.9.2/ant-launcher-1.9.2.pom
2017-09-28T19:36:09.734 [INFO] Downloaded: https://repo.maven.apache.org/maven2/org/apache/ant/ant-launcher/1.9.2/ant-launcher-1.9.2.pom
(3 KB at 84.5 KB/sec)
2017-09-28T19:36:09.736 [INFO] Downloading: https://repo.maven.apache.org/maven2/net/engio/mbassador/1.1.9/mbassador-1.1.9.pom
2017-09-28T19:36:09.765 [INFO] Downloaded: https://repo.maven.apache.org/maven2/net/engio/mbassador/1.1.9/mbassador-1.1.9.pom
(9 KB at 291.5 KB/sec)
2017-09-28T19:36:09.767 [INFO] Downloading: https://repo.maven.apache.org/maven2/net/lingala/zip4j/zip4j/1.3.2/zip4j-1.3.2.pom
2017-09-28T19:36:09.795 [INFO] Downloaded: https://repo.maven.apache.org/maven2/net/lingala/zip4j/zip4j/1.3.2/zip4j-1.3.2.pom
(922 B at 32.2 KB/sec)
2017-09-28T19:36:09.797 [INFO] Downloading: https://repo.maven.apache.org/maven2/commons-codec/commons-codec/1.10/commons-codec-1.10.pom
2017-09-28T19:36:09.826 [INFO] Downloaded: https://repo.maven.apache.org/maven2/commons-codec/commons-codec/1.10/commons-codec-1.10.pom
(12 KB at 390.9 KB/sec)
2017-09-28T19:36:09.829 [INFO] Downloading: https://repo.maven.apache.org/maven2/org/apache/commons/commons-parent/35/commons-parent-35.pom
2017-09-28T19:36:09.863 [INFO] Downloaded: https://repo.maven.apache.org/maven2/org/apache/commons/commons-parent/35/commons-parent-35.pom
(57 KB at 1611.9 KB/sec)
2017-09-28T19:36:09.871 [INFO] Downloading: https://repo.maven.apache.org/maven2/org/apache/xbean/xbean-asm5-shaded/4.3/xbean-asm5-shaded-4.3.pom
2017-09-28T19:36:09.899 [INFO] Downloaded: https://repo.maven.apache.org/maven2/org/apache/xbean/xbean-asm5-shaded/4.3/xbean-asm5-shaded-4.3.pom
(4 KB at 116.8 KB/sec)
2017-09-28T19:36:09.901 [INFO] Downloading: https://repo.maven.apache.org/maven2/org/apache/xbean/xbean/4.3/xbean-4.3.pom
2017-09-28T19:36:09.932 [INFO] Downloaded: https://repo.maven.apache.org/maven2/org/apache/xbean/xbean/4.3/xbean-4.3.pom
(18 KB at 557.2 KB/sec)
2017-09-28T19:36:09.934 [INFO] Downloading: https://repo.maven.apache.org/maven2/org/apache/geronimo/genesis/genesis-java5-flava/2.1/genesis-java5-flava-2.1.pom
2017-09-28T19:36:09.963 [INFO] Downloaded: https://repo.maven.apache.org/maven2/org/apache/geronimo/genesis/genesis-java5-flava/2.1/genesis-java5-flava-2.1.pom
(6 KB at 184.7 KB/sec)
2017-09-28T19:36:09.965 [INFO] Downloading: https://repo.maven.apache.org/maven2/org/apache/geronimo/genesis/genesis-default-flava/2.1/genesis-default-flava-2.1.pom
2017-09-28T19:36:09.996 [INFO] Downloaded: https://repo.maven.apache.org/maven2/org/apache/geronimo/genesis/genesis-default-flava/2.1/genesis-default-flava-2.1.pom
(16 KB at 506.0 KB/sec)
2017-09-28T19:36:09.999 [INFO] Downloading: https://repo.maven.apache.org/maven2/org/apache/geronimo/genesis/genesis/2.1/genesis-2.1.pom
2017-09-28T19:36:10.030 [INFO] Downloaded: https://repo.maven.apache.org/maven2/org/apache/geronimo/genesis/genesis/2.1/genesis-2.1.pom
(14 KB at 449.2 KB/sec)
2017-09-28T19:36:10.035 [INFO] Downloading: https://repo.maven.apache.org/maven2/org/jctools/jctools-core/1.1/jctools-core-1.1.pom
2017-09-28T19:36:10.062 [INFO] Downloaded: https://repo.maven.apache.org/maven2/org/jctools/jctools-core/1.1/jctools-core-1.1.pom
(3 KB at 104.2 KB/sec)
[JENKINS] Archiving disabled
[JENKINS] Archiving disabled
[JENKINS] Archiving disabled
[JENKINS] Archiving disabled
[JENKINS] Archiving disabled
[JENKINS] Archiving disabled
[JENKINS] Archiving disabled
[JENKINS] Archiving disabled
[JENKINS] Archiving disabled
[JENKINS] Archiving disabled
[JENKINS] Archiving disabled
[JENKINS] Archiving disabled
[JENKINS] Archiving disabled
2017-09-28T19:36:17.841 [INFO] ------------------------------------------------------------------------
2017-09-28T19:36:17.841 [INFO] Reactor Summary:
2017-09-28T19:36:17.841 [INFO] 
2017-09-28T19:36:17.841 [INFO] Apache Beam :: Parent .............................. SUCCESS
[ 29.299 s]
2017-09-28T19:36:17.841 [INFO] Apache Beam :: SDKs :: Java :: Build Tools ......... SUCCESS
[ 16.160 s]
2017-09-28T19:36:17.841 [INFO] Apache Beam :: SDKs ................................ SUCCESS
[  3.357 s]
2017-09-28T19:36:17.841 [INFO] Apache Beam :: SDKs :: Common ...................... SUCCESS
[  2.550 s]
2017-09-28T19:36:17.841 [INFO] Apache Beam :: SDKs :: Common :: Runner API ........ SUCCESS
[ 23.118 s]
2017-09-28T19:36:17.842 [INFO] Apache Beam :: SDKs :: Common :: Fn API ............ SUCCESS
[ 11.585 s]
2017-09-28T19:36:17.842 [INFO] Apache Beam :: SDKs :: Java ........................ SUCCESS
[  3.830 s]
2017-09-28T19:36:17.842 [INFO] Apache Beam :: SDKs :: Java :: Core ................ SUCCESS
[03:00 min]
2017-09-28T19:36:17.842 [INFO] Apache Beam :: Runners ............................. SUCCESS
[  2.513 s]
2017-09-28T19:36:17.842 [INFO] Apache Beam :: Runners :: Core Construction Java ... SUCCESS
[ 22.225 s]
2017-09-28T19:36:17.842 [INFO] Apache Beam :: Runners :: Core Java ................ SUCCESS
[ 42.496 s]
2017-09-28T19:36:17.842 [INFO] Apache Beam :: Runners :: Apex ..................... FAILURE
[  5.303 s]
2017-09-28T19:36:17.842 [INFO] ------------------------------------------------------------------------
2017-09-28T19:36:17.842 [INFO] BUILD FAILURE
2017-09-28T19:36:17.843 [INFO] ------------------------------------------------------------------------
2017-09-28T19:36:17.843 [INFO] Total time: 06:41 min
2017-09-28T19:36:17.843 [INFO] Finished at: 2017-09-28T19:36:17+00:00
2017-09-28T19:36:18.613 [INFO] Final Memory: 125M/1507M
2017-09-28T19:36:18.614 [INFO] ------------------------------------------------------------------------
2017-09-28T19:36:18.614 [WARNING] The requested profile "validates-runner-tests" could not
be activated because it does not exist.
2017-09-28T19:36:18.620 [ERROR] Failed to execute goal on project beam-runners-apex: Could
not resolve dependencies for project org.apache.beam:beam-runners-apex:jar:2.2.0-SNAPSHOT:
Failed to collect dependencies at org.apache.apex:apex-common:jar:3.6.0: Failed to read artifact
descriptor for org.apache.apex:apex-common:jar:3.6.0: Could not transfer artifact org.apache.apex:apex-common:pom:3.6.0
from/to central (https://repo.maven.apache.org/maven2): Connection reset -> [Help 1]
2017-09-28T19:36:18.621 [ERROR] 
2017-09-28T19:36:18.621 [ERROR] To see the full stack trace of the errors, re-run Maven with
the -e switch.
2017-09-28T19:36:18.621 [ERROR] Re-run Maven using the -X switch to enable full debug logging.
2017-09-28T19:36:18.621 [ERROR] 
2017-09-28T19:36:18.621 [ERROR] For more information about the errors and possible solutions,
please read the following articles:
2017-09-28T19:36:18.621 [ERROR] [Help 1] http://cwiki.apache.org/confluence/display/MAVEN/DependencyResolutionException
2017-09-28T19:36:18.621 [ERROR] 
2017-09-28T19:36:18.621 [ERROR] After correcting the problems, you can resume the build with
the command
2017-09-28T19:36:18.621 [ERROR]   mvn <goals> -rf :beam-runners-apex
channel stopped

Mime
View raw message