beam-commits mailing list archives

Site index · List index
Message view « Date » · « Thread »
Top « Date » · « Thread »
From Apache Jenkins Server <jenk...@builds.apache.org>
Subject Build failed in Jenkins: beam_PostCommit_Java_ValidatesRunner_Apex #2435
Date Thu, 21 Sep 2017 12:04:18 GMT
See <https://builds.apache.org/job/beam_PostCommit_Java_ValidatesRunner_Apex/2435/display/redirect>

------------------------------------------
[...truncated 315.00 KB...]
2017-09-21T12:03:52.535 [INFO] Excluding org.apache.beam:beam-sdks-common-runner-api:jar:2.2.0-SNAPSHOT
from the shaded jar.
2017-09-21T12:03:52.535 [INFO] Including com.google.guava:guava:jar:20.0 in the shaded jar.
2017-09-21T12:03:52.535 [INFO] Excluding com.google.protobuf:protobuf-java:jar:3.2.0 from
the shaded jar.
2017-09-21T12:03:52.535 [INFO] Excluding io.grpc:grpc-core:jar:1.2.0 from the shaded jar.
2017-09-21T12:03:52.535 [INFO] Excluding com.google.errorprone:error_prone_annotations:jar:2.0.15
from the shaded jar.
2017-09-21T12:03:52.535 [INFO] Excluding com.google.code.findbugs:jsr305:jar:3.0.1 from the
shaded jar.
2017-09-21T12:03:52.535 [INFO] Excluding io.grpc:grpc-context:jar:1.2.0 from the shaded jar.
2017-09-21T12:03:52.535 [INFO] Excluding com.google.instrumentation:instrumentation-api:jar:0.3.0
from the shaded jar.
2017-09-21T12:03:52.535 [INFO] Excluding io.grpc:grpc-protobuf:jar:1.2.0 from the shaded jar.
2017-09-21T12:03:52.535 [INFO] Excluding com.google.protobuf:protobuf-java-util:jar:3.2.0
from the shaded jar.
2017-09-21T12:03:52.535 [INFO] Excluding com.google.code.gson:gson:jar:2.7 from the shaded
jar.
2017-09-21T12:03:52.535 [INFO] Excluding io.grpc:grpc-protobuf-lite:jar:1.2.0 from the shaded
jar.
2017-09-21T12:03:52.535 [INFO] Excluding io.grpc:grpc-stub:jar:1.2.0 from the shaded jar.
2017-09-21T12:03:55.222 [INFO] Replacing original artifact with shaded artifact.
2017-09-21T12:03:55.222 [INFO] Replacing <https://builds.apache.org/job/beam_PostCommit_Java_ValidatesRunner_Apex/ws/sdks/common/fn-api/target/beam-sdks-common-fn-api-2.2.0-SNAPSHOT.jar>
with <https://builds.apache.org/job/beam_PostCommit_Java_ValidatesRunner_Apex/ws/sdks/common/fn-api/target/beam-sdks-common-fn-api-2.2.0-SNAPSHOT-shaded.jar>
2017-09-21T12:03:55.222 [INFO] Replacing original test artifact with shaded test artifact.
2017-09-21T12:03:55.223 [INFO] Replacing <https://builds.apache.org/job/beam_PostCommit_Java_ValidatesRunner_Apex/ws/sdks/common/fn-api/target/beam-sdks-common-fn-api-2.2.0-SNAPSHOT-tests.jar>
with <https://builds.apache.org/job/beam_PostCommit_Java_ValidatesRunner_Apex/ws/sdks/common/fn-api/target/beam-sdks-common-fn-api-2.2.0-SNAPSHOT-shaded-tests.jar>
2017-09-21T12:03:55.488 [INFO] 
2017-09-21T12:03:55.489 [INFO] --- maven-dependency-plugin:3.0.1:analyze-only (default) @
beam-sdks-common-fn-api ---
2017-09-21T12:03:55.609 [INFO] No dependency problems found
[JENKINS] Archiving disabled
2017-09-21T12:03:57.315 [INFO]                                                           
             
2017-09-21T12:03:57.315 [INFO] ------------------------------------------------------------------------
2017-09-21T12:03:57.315 [INFO] Building Apache Beam :: SDKs :: Java 2.2.0-SNAPSHOT
2017-09-21T12:03:57.315 [INFO] ------------------------------------------------------------------------
2017-09-21T12:03:57.318 [INFO] 
2017-09-21T12:03:57.319 [INFO] --- maven-clean-plugin:3.0.0:clean (default-clean) @ beam-sdks-java-parent
---
2017-09-21T12:03:57.325 [INFO] Deleting <https://builds.apache.org/job/beam_PostCommit_Java_ValidatesRunner_Apex/ws/sdks/java>
(includes = [**/*.pyc, **/*.egg-info/, **/sdks/python/LICENSE, **/sdks/python/NOTICE, **/sdks/python/README.md],
excludes = [])
2017-09-21T12:03:57.552 [INFO] 
2017-09-21T12:03:57.552 [INFO] --- maven-enforcer-plugin:3.0.0-M1:enforce (enforce) @ beam-sdks-java-parent
---
2017-09-21T12:03:57.660 [INFO] 
2017-09-21T12:03:57.660 [INFO] --- maven-enforcer-plugin:3.0.0-M1:enforce (enforce-banned-dependencies)
@ beam-sdks-java-parent ---
2017-09-21T12:03:57.770 [INFO] 
2017-09-21T12:03:57.770 [INFO] --- maven-remote-resources-plugin:1.5:process (process-resource-bundles)
@ beam-sdks-java-parent ---
2017-09-21T12:03:57.900 [INFO] 
2017-09-21T12:03:57.900 [INFO] --- maven-checkstyle-plugin:2.17:check (default) @ beam-sdks-java-parent
---
2017-09-21T12:03:58.697 [INFO] Starting audit...
Audit done.
2017-09-21T12:03:58.804 [INFO] 
2017-09-21T12:03:58.804 [INFO] --- build-helper-maven-plugin:3.0.0:regex-properties (render-artifact-id)
@ beam-sdks-java-parent ---
2017-09-21T12:03:58.912 [INFO] 
2017-09-21T12:03:58.912 [INFO] --- maven-site-plugin:3.5.1:attach-descriptor (attach-descriptor)
@ beam-sdks-java-parent ---
2017-09-21T12:03:59.139 [INFO] 
2017-09-21T12:03:59.139 [INFO] --- maven-jar-plugin:3.0.2:jar (default-jar) @ beam-sdks-java-parent
---
2017-09-21T12:03:59.140 [INFO] Skipping packaging of the jar
2017-09-21T12:03:59.364 [INFO] 
2017-09-21T12:03:59.364 [INFO] --- maven-jar-plugin:3.0.2:test-jar (default-test-jar) @ beam-sdks-java-parent
---
2017-09-21T12:03:59.365 [INFO] Skipping packaging of the test-jar
2017-09-21T12:03:59.472 [INFO] 
2017-09-21T12:03:59.472 [INFO] --- maven-shade-plugin:3.0.0:shade (bundle-and-repackage) @
beam-sdks-java-parent ---
2017-09-21T12:03:59.477 [INFO] Replacing original artifact with shaded artifact.
2017-09-21T12:03:59.584 [INFO] 
2017-09-21T12:03:59.584 [INFO] --- maven-dependency-plugin:3.0.1:analyze-only (default) @
beam-sdks-java-parent ---
2017-09-21T12:03:59.585 [INFO] Skipping pom project
[JENKINS] Archiving disabled
2017-09-21T12:04:00.752 [INFO]                                                           
             
2017-09-21T12:04:00.752 [INFO] ------------------------------------------------------------------------
2017-09-21T12:04:00.752 [INFO] Building Apache Beam :: SDKs :: Java :: Core 2.2.0-SNAPSHOT
2017-09-21T12:04:00.752 [INFO] ------------------------------------------------------------------------
2017-09-21T12:04:00.754 [INFO] Downloading: https://repo.maven.apache.org/maven2/org/jacoco/jacoco-maven-plugin/0.7.8/jacoco-maven-plugin-0.7.8.pom
2017-09-21T12:04:00.790 [INFO] Downloaded: https://repo.maven.apache.org/maven2/org/jacoco/jacoco-maven-plugin/0.7.8/jacoco-maven-plugin-0.7.8.pom
(5 KB at 120.8 KB/sec)
2017-09-21T12:04:00.792 [INFO] Downloading: https://repo.maven.apache.org/maven2/org/jacoco/org.jacoco.build/0.7.8/org.jacoco.build-0.7.8.pom
2017-09-21T12:04:00.823 [INFO] Downloaded: https://repo.maven.apache.org/maven2/org/jacoco/org.jacoco.build/0.7.8/org.jacoco.build-0.7.8.pom
(35 KB at 1121.6 KB/sec)
2017-09-21T12:04:00.828 [INFO] Downloading: https://repo.maven.apache.org/maven2/org/jacoco/jacoco-maven-plugin/0.7.8/jacoco-maven-plugin-0.7.8.jar
2017-09-21T12:04:00.864 [INFO] Downloaded: https://repo.maven.apache.org/maven2/org/jacoco/jacoco-maven-plugin/0.7.8/jacoco-maven-plugin-0.7.8.jar
(52 KB at 1440.9 KB/sec)
2017-09-21T12:04:00.872 [INFO] Downloading: https://repo.maven.apache.org/maven2/org/apache/avro/avro-maven-plugin/1.8.2/avro-maven-plugin-1.8.2.pom
2017-09-21T12:04:00.910 [INFO] Downloaded: https://repo.maven.apache.org/maven2/org/apache/avro/avro-maven-plugin/1.8.2/avro-maven-plugin-1.8.2.pom
(4 KB at 89.2 KB/sec)
2017-09-21T12:04:00.912 [INFO] Downloading: https://repo.maven.apache.org/maven2/org/apache/avro/avro-parent/1.8.2/avro-parent-1.8.2.pom
2017-09-21T12:04:00.940 [INFO] Downloaded: https://repo.maven.apache.org/maven2/org/apache/avro/avro-parent/1.8.2/avro-parent-1.8.2.pom
(21 KB at 746.8 KB/sec)
2017-09-21T12:04:00.943 [INFO] Downloading: https://repo.maven.apache.org/maven2/org/apache/avro/avro-toplevel/1.8.2/avro-toplevel-1.8.2.pom
2017-09-21T12:04:00.972 [INFO] Downloaded: https://repo.maven.apache.org/maven2/org/apache/avro/avro-toplevel/1.8.2/avro-toplevel-1.8.2.pom
(16 KB at 527.0 KB/sec)
2017-09-21T12:04:00.977 [INFO] Downloading: https://repo.maven.apache.org/maven2/org/apache/avro/avro-maven-plugin/1.8.2/avro-maven-plugin-1.8.2.jar
2017-09-21T12:04:01.008 [INFO] Downloaded: https://repo.maven.apache.org/maven2/org/apache/avro/avro-maven-plugin/1.8.2/avro-maven-plugin-1.8.2.jar
(27 KB at 865.6 KB/sec)
2017-09-21T12:04:01.016 [INFO] Downloading: https://repo.maven.apache.org/maven2/com/google/guava/guava-testlib/20.0/guava-testlib-20.0.pom
2017-09-21T12:04:01.067 [INFO] Downloaded: https://repo.maven.apache.org/maven2/com/google/guava/guava-testlib/20.0/guava-testlib-20.0.pom
(3 KB at 55.2 KB/sec)
2017-09-21T12:04:01.073 [INFO] Downloading: https://repo.maven.apache.org/maven2/com/fasterxml/jackson/core/jackson-core/2.8.9/jackson-core-2.8.9.pom
2017-09-21T12:04:01.100 [INFO] Downloaded: https://repo.maven.apache.org/maven2/com/fasterxml/jackson/core/jackson-core/2.8.9/jackson-core-2.8.9.pom
(6 KB at 195.9 KB/sec)
2017-09-21T12:04:01.102 [INFO] Downloading: https://repo.maven.apache.org/maven2/com/fasterxml/jackson/jackson-parent/2.8/jackson-parent-2.8.pom
2017-09-21T12:04:01.130 [INFO] Downloaded: https://repo.maven.apache.org/maven2/com/fasterxml/jackson/jackson-parent/2.8/jackson-parent-2.8.pom
(8 KB at 278.0 KB/sec)
2017-09-21T12:04:01.132 [INFO] Downloading: https://repo.maven.apache.org/maven2/com/fasterxml/oss-parent/27/oss-parent-27.pom
2017-09-21T12:04:01.172 [INFO] Downloaded: https://repo.maven.apache.org/maven2/com/fasterxml/oss-parent/27/oss-parent-27.pom
(20 KB at 479.5 KB/sec)
2017-09-21T12:04:01.179 [INFO] Downloading: https://repo.maven.apache.org/maven2/com/fasterxml/jackson/core/jackson-annotations/2.8.9/jackson-annotations-2.8.9.pom
2017-09-21T12:04:01.209 [INFO] Downloaded: https://repo.maven.apache.org/maven2/com/fasterxml/jackson/core/jackson-annotations/2.8.9/jackson-annotations-2.8.9.pom
(2 KB at 60.2 KB/sec)
2017-09-21T12:04:01.215 [INFO] Downloading: https://repo.maven.apache.org/maven2/com/fasterxml/jackson/core/jackson-databind/2.8.9/jackson-databind-2.8.9.pom
2017-09-21T12:04:01.242 [INFO] Downloaded: https://repo.maven.apache.org/maven2/com/fasterxml/jackson/core/jackson-databind/2.8.9/jackson-databind-2.8.9.pom
(6 KB at 196.3 KB/sec)
2017-09-21T12:04:01.248 [INFO] Downloading: https://repo.maven.apache.org/maven2/org/slf4j/slf4j-api/1.7.25/slf4j-api-1.7.25.pom
2017-09-21T12:04:01.282 [INFO] Downloaded: https://repo.maven.apache.org/maven2/org/slf4j/slf4j-api/1.7.25/slf4j-api-1.7.25.pom
(4 KB at 110.1 KB/sec)
2017-09-21T12:04:01.284 [INFO] Downloading: https://repo.maven.apache.org/maven2/org/slf4j/slf4j-parent/1.7.25/slf4j-parent-1.7.25.pom
2017-09-21T12:04:01.314 [INFO] Downloaded: https://repo.maven.apache.org/maven2/org/slf4j/slf4j-parent/1.7.25/slf4j-parent-1.7.25.pom
(14 KB at 454.9 KB/sec)
2017-09-21T12:04:01.319 [INFO] Downloading: https://repo.maven.apache.org/maven2/net/bytebuddy/byte-buddy/1.6.8/byte-buddy-1.6.8.pom
2017-09-21T12:04:01.348 [INFO] Downloaded: https://repo.maven.apache.org/maven2/net/bytebuddy/byte-buddy/1.6.8/byte-buddy-1.6.8.pom
(12 KB at 396.8 KB/sec)
2017-09-21T12:04:01.351 [INFO] Downloading: https://repo.maven.apache.org/maven2/net/bytebuddy/byte-buddy-parent/1.6.8/byte-buddy-parent-1.6.8.pom
2017-09-21T12:04:01.382 [INFO] Downloaded: https://repo.maven.apache.org/maven2/net/bytebuddy/byte-buddy-parent/1.6.8/byte-buddy-parent-1.6.8.pom
(26 KB at 813.2 KB/sec)
2017-09-21T12:04:01.389 [INFO] Downloading: https://repo.maven.apache.org/maven2/org/apache/avro/avro/1.8.2/avro-1.8.2.pom
2017-09-21T12:04:01.418 [INFO] Downloaded: https://repo.maven.apache.org/maven2/org/apache/avro/avro/1.8.2/avro-1.8.2.pom
(7 KB at 238.7 KB/sec)
2017-09-21T12:04:01.424 [INFO] Downloading: https://repo.maven.apache.org/maven2/org/codehaus/jackson/jackson-core-asl/1.9.13/jackson-core-asl-1.9.13.pom
2017-09-21T12:04:01.497 [INFO] Downloaded: https://repo.maven.apache.org/maven2/org/codehaus/jackson/jackson-core-asl/1.9.13/jackson-core-asl-1.9.13.pom
(2 KB at 17.1 KB/sec)
2017-09-21T12:04:01.499 [INFO] Downloading: https://repo.maven.apache.org/maven2/org/codehaus/jackson/jackson-mapper-asl/1.9.13/jackson-mapper-asl-1.9.13.pom
2017-09-21T12:04:01.541 [INFO] Downloaded: https://repo.maven.apache.org/maven2/org/codehaus/jackson/jackson-mapper-asl/1.9.13/jackson-mapper-asl-1.9.13.pom
(2 KB at 35.0 KB/sec)
2017-09-21T12:04:01.543 [INFO] Downloading: https://repo.maven.apache.org/maven2/com/thoughtworks/paranamer/paranamer/2.7/paranamer-2.7.pom
2017-09-21T12:04:01.593 [INFO] Downloaded: https://repo.maven.apache.org/maven2/com/thoughtworks/paranamer/paranamer/2.7/paranamer-2.7.pom
(6 KB at 103.0 KB/sec)
2017-09-21T12:04:01.595 [INFO] Downloading: https://repo.maven.apache.org/maven2/com/thoughtworks/paranamer/paranamer-parent/2.7/paranamer-parent-2.7.pom
2017-09-21T12:04:01.643 [INFO] Downloaded: https://repo.maven.apache.org/maven2/com/thoughtworks/paranamer/paranamer-parent/2.7/paranamer-parent-2.7.pom
(12 KB at 234.0 KB/sec)
2017-09-21T12:04:01.655 [INFO] Downloading: https://repo.maven.apache.org/maven2/org/xerial/snappy/snappy-java/1.1.4/snappy-java-1.1.4.pom
2017-09-21T12:04:01.717 [INFO] Downloaded: https://repo.maven.apache.org/maven2/org/xerial/snappy/snappy-java/1.1.4/snappy-java-1.1.4.pom
(4 KB at 51.8 KB/sec)
2017-09-21T12:04:01.719 [INFO] Downloading: https://repo.maven.apache.org/maven2/org/apache/commons/commons-compress/1.14/commons-compress-1.14.pom
2017-09-21T12:04:01.761 [INFO] Downloaded: https://repo.maven.apache.org/maven2/org/apache/commons/commons-compress/1.14/commons-compress-1.14.pom
(13 KB at 305.6 KB/sec)
2017-09-21T12:04:01.763 [INFO] Downloading: https://repo.maven.apache.org/maven2/org/apache/commons/commons-parent/42/commons-parent-42.pom
2017-09-21T12:04:01.844 [INFO] Downloaded: https://repo.maven.apache.org/maven2/org/apache/commons/commons-parent/42/commons-parent-42.pom
(67 KB at 819.3 KB/sec)
2017-09-21T12:04:01.851 [INFO] Downloading: https://repo.maven.apache.org/maven2/org/apache/commons/commons-lang3/3.6/commons-lang3-3.6.pom
2017-09-21T12:04:01.895 [INFO] Downloaded: https://repo.maven.apache.org/maven2/org/apache/commons/commons-lang3/3.6/commons-lang3-3.6.pom
(27 KB at 610.2 KB/sec)
2017-09-21T12:04:01.904 [INFO] Downloading: https://repo.maven.apache.org/maven2/joda-time/joda-time/2.4/joda-time-2.4.pom
2017-09-21T12:04:01.935 [INFO] Downloaded: https://repo.maven.apache.org/maven2/joda-time/joda-time/2.4/joda-time-2.4.pom
(26 KB at 830.3 KB/sec)
2017-09-21T12:04:01.942 [INFO] Downloading: https://repo.maven.apache.org/maven2/com/google/auto/service/auto-service/1.0-rc2/auto-service-1.0-rc2.pom
2017-09-21T12:04:01.970 [INFO] Downloaded: https://repo.maven.apache.org/maven2/com/google/auto/service/auto-service/1.0-rc2/auto-service-1.0-rc2.pom
(3 KB at 95.8 KB/sec)
2017-09-21T12:04:01.973 [INFO] Downloading: https://repo.maven.apache.org/maven2/com/google/auto/auto-parent/2/auto-parent-2.pom
2017-09-21T12:04:02.000 [INFO] Downloaded: https://repo.maven.apache.org/maven2/com/google/auto/auto-parent/2/auto-parent-2.pom
(5 KB at 164.0 KB/sec)
2017-09-21T12:04:02.003 [INFO] Downloading: https://repo.maven.apache.org/maven2/com/google/auto/auto-common/0.3/auto-common-0.3.pom
2017-09-21T12:04:02.031 [INFO] Downloaded: https://repo.maven.apache.org/maven2/com/google/auto/auto-common/0.3/auto-common-0.3.pom
(3 KB at 82.0 KB/sec)
2017-09-21T12:04:02.034 [INFO] Downloading: https://repo.maven.apache.org/maven2/com/google/auto/value/auto-value/1.4.1/auto-value-1.4.1.pom
2017-09-21T12:04:02.062 [INFO] Downloaded: https://repo.maven.apache.org/maven2/com/google/auto/value/auto-value/1.4.1/auto-value-1.4.1.pom
(7 KB at 222.4 KB/sec)
2017-09-21T12:04:02.064 [INFO] Downloading: https://repo.maven.apache.org/maven2/com/google/auto/auto-parent/3/auto-parent-3.pom
2017-09-21T12:04:02.090 [INFO] Downloaded: https://repo.maven.apache.org/maven2/com/google/auto/auto-parent/3/auto-parent-3.pom
(4 KB at 144.2 KB/sec)
2017-09-21T12:04:02.094 [INFO] Downloading: https://repo.maven.apache.org/maven2/com/fasterxml/jackson/dataformat/jackson-dataformat-yaml/2.8.9/jackson-dataformat-yaml-2.8.9.pom
2017-09-21T12:04:02.121 [INFO] Downloaded: https://repo.maven.apache.org/maven2/com/fasterxml/jackson/dataformat/jackson-dataformat-yaml/2.8.9/jackson-dataformat-yaml-2.8.9.pom
(7 KB at 222.9 KB/sec)
2017-09-21T12:04:02.126 [INFO] Downloading: https://repo.maven.apache.org/maven2/org/yaml/snakeyaml/1.17/snakeyaml-1.17.pom
2017-09-21T12:04:02.157 [INFO] Downloaded: https://repo.maven.apache.org/maven2/org/yaml/snakeyaml/1.17/snakeyaml-1.17.pom
(28 KB at 882.2 KB/sec)
2017-09-21T12:04:02.162 [INFO] Downloading: https://repo.maven.apache.org/maven2/org/hamcrest/hamcrest-all/1.3/hamcrest-all-1.3.pom
2017-09-21T12:04:02.190 [INFO] Downloaded: https://repo.maven.apache.org/maven2/org/hamcrest/hamcrest-all/1.3/hamcrest-all-1.3.pom
(650 B at 22.7 KB/sec)
2017-09-21T12:04:02.192 [INFO] Downloading: https://repo.maven.apache.org/maven2/org/slf4j/slf4j-jdk14/1.7.25/slf4j-jdk14-1.7.25.pom
2017-09-21T12:04:02.217 [INFO] Downloaded: https://repo.maven.apache.org/maven2/org/slf4j/slf4j-jdk14/1.7.25/slf4j-jdk14-1.7.25.pom
(1008 B at 39.4 KB/sec)
2017-09-21T12:04:02.221 [INFO] Downloading: https://repo.maven.apache.org/maven2/org/mockito/mockito-all/1.9.5/mockito-all-1.9.5.pom
2017-09-21T12:04:02.247 [INFO] Downloaded: https://repo.maven.apache.org/maven2/org/mockito/mockito-all/1.9.5/mockito-all-1.9.5.pom
(2 KB at 39.1 KB/sec)
2017-09-21T12:04:02.249 [INFO] Downloading: https://repo.maven.apache.org/maven2/com/esotericsoftware/kryo/kryo/2.21/kryo-2.21.pom
2017-09-21T12:04:02.276 [INFO] Downloaded: https://repo.maven.apache.org/maven2/com/esotericsoftware/kryo/kryo/2.21/kryo-2.21.pom
(6 KB at 204.5 KB/sec)
2017-09-21T12:04:02.279 [INFO] Downloading: https://repo.maven.apache.org/maven2/com/esotericsoftware/reflectasm/reflectasm/1.07/reflectasm-1.07.pom
2017-09-21T12:04:02.305 [INFO] Downloaded: https://repo.maven.apache.org/maven2/com/esotericsoftware/reflectasm/reflectasm/1.07/reflectasm-1.07.pom
(4 KB at 115.7 KB/sec)
2017-09-21T12:04:02.308 [INFO] Downloading: https://repo.maven.apache.org/maven2/org/ow2/asm/asm/4.0/asm-4.0.pom
2017-09-21T12:04:02.352 [INFO] Downloaded: https://repo.maven.apache.org/maven2/org/ow2/asm/asm/4.0/asm-4.0.pom
(2 KB at 42.9 KB/sec)
2017-09-21T12:04:02.355 [INFO] Downloading: https://repo.maven.apache.org/maven2/org/ow2/asm/asm-parent/4.0/asm-parent-4.0.pom
2017-09-21T12:04:02.383 [INFO] Downloaded: https://repo.maven.apache.org/maven2/org/ow2/asm/asm-parent/4.0/asm-parent-4.0.pom
(6 KB at 191.6 KB/sec)
2017-09-21T12:04:02.385 [INFO] Downloading: https://repo.maven.apache.org/maven2/com/esotericsoftware/minlog/minlog/1.2/minlog-1.2.pom
2017-09-21T12:04:02.412 [INFO] Downloaded: https://repo.maven.apache.org/maven2/com/esotericsoftware/minlog/minlog/1.2/minlog-1.2.pom
(2 KB at 57.4 KB/sec)
2017-09-21T12:04:02.415 [INFO] Downloading: https://repo.maven.apache.org/maven2/org/objenesis/objenesis/1.2/objenesis-1.2.pom
2017-09-21T12:04:02.445 [INFO] Downloaded: https://repo.maven.apache.org/maven2/org/objenesis/objenesis/1.2/objenesis-1.2.pom
(3 KB at 97.9 KB/sec)
2017-09-21T12:04:02.446 [INFO] Downloading: https://repo.maven.apache.org/maven2/org/objenesis/objenesis-parent/1.2/objenesis-parent-1.2.pom
2017-09-21T12:04:02.473 [INFO] Downloaded: https://repo.maven.apache.org/maven2/org/objenesis/objenesis-parent/1.2/objenesis-parent-1.2.pom
(11 KB at 374.4 KB/sec)
2017-09-21T12:04:02.490 [INFO] Downloading: https://repo.maven.apache.org/maven2/com/google/guava/guava-testlib/20.0/guava-testlib-20.0.jar
2017-09-21T12:04:02.502 [INFO] Downloading: https://repo.maven.apache.org/maven2/com/fasterxml/jackson/core/jackson-core/2.8.9/jackson-core-2.8.9.jar
2017-09-21T12:04:02.508 [INFO] Downloading: https://repo.maven.apache.org/maven2/com/fasterxml/jackson/core/jackson-annotations/2.8.9/jackson-annotations-2.8.9.jar
2017-09-21T12:04:02.516 [INFO] Downloading: https://repo.maven.apache.org/maven2/com/fasterxml/jackson/core/jackson-databind/2.8.9/jackson-databind-2.8.9.jar
2017-09-21T12:04:02.524 [INFO] Downloading: https://repo.maven.apache.org/maven2/org/slf4j/slf4j-api/1.7.25/slf4j-api-1.7.25.jar
[INFO] I/O exception (java.net.SocketException) caught when processing request to {s}->https://repo.maven.apache.org:443:
Connection reset
[INFO] Retrying request to {s}->https://repo.maven.apache.org:443
2017-09-21T12:04:02.576 [INFO] Downloaded: https://repo.maven.apache.org/maven2/com/fasterxml/jackson/core/jackson-annotations/2.8.9/jackson-annotations-2.8.9.jar
(55 KB at 716.8 KB/sec)
2017-09-21T12:04:02.576 [INFO] Downloading: https://repo.maven.apache.org/maven2/net/bytebuddy/byte-buddy/1.6.8/byte-buddy-1.6.8.jar
2017-09-21T12:04:02.589 [INFO] Downloaded: https://repo.maven.apache.org/maven2/org/slf4j/slf4j-api/1.7.25/slf4j-api-1.7.25.jar
(41 KB at 551.2 KB/sec)
2017-09-21T12:04:02.589 [INFO] Downloading: https://repo.maven.apache.org/maven2/org/apache/avro/avro/1.8.2/avro-1.8.2.jar
2017-09-21T12:04:02.624 [INFO] Downloading: https://repo.maven.apache.org/maven2/org/codehaus/jackson/jackson-core-asl/1.9.13/jackson-core-asl-1.9.13.jar
2017-09-21T12:04:02.870 [INFO] Downloaded: https://repo.maven.apache.org/maven2/com/google/guava/guava-testlib/20.0/guava-testlib-20.0.jar
(749 KB at 1928.5 KB/sec)
2017-09-21T12:04:02.870 [INFO] Downloading: https://repo.maven.apache.org/maven2/org/codehaus/jackson/jackson-mapper-asl/1.9.13/jackson-mapper-asl-1.9.13.jar
2017-09-21T12:04:02.874 [INFO] Downloaded: https://repo.maven.apache.org/maven2/com/fasterxml/jackson/core/jackson-core/2.8.9/jackson-core-2.8.9.jar
(277 KB at 715.0 KB/sec)
2017-09-21T12:04:02.874 [INFO] Downloading: https://repo.maven.apache.org/maven2/com/thoughtworks/paranamer/paranamer/2.7/paranamer-2.7.jar
2017-09-21T12:04:02.889 [INFO] Downloaded: https://repo.maven.apache.org/maven2/org/codehaus/jackson/jackson-core-asl/1.9.13/jackson-core-asl-1.9.13.jar
(227 KB at 621.4 KB/sec)
2017-09-21T12:04:02.890 [INFO] Downloading: https://repo.maven.apache.org/maven2/org/xerial/snappy/snappy-java/1.1.4/snappy-java-1.1.4.jar
2017-09-21T12:04:02.906 [INFO] Downloaded: https://repo.maven.apache.org/maven2/com/thoughtworks/paranamer/paranamer/2.7/paranamer-2.7.jar
(34 KB at 88.5 KB/sec)
2017-09-21T12:04:02.906 [INFO] Downloading: https://repo.maven.apache.org/maven2/org/apache/commons/commons-compress/1.14/commons-compress-1.14.jar
2017-09-21T12:04:03.093 [INFO] Downloaded: https://repo.maven.apache.org/maven2/org/apache/commons/commons-compress/1.14/commons-compress-1.14.jar
(518 KB at 909.6 KB/sec)
2017-09-21T12:04:03.093 [INFO] Downloading: https://repo.maven.apache.org/maven2/org/apache/commons/commons-lang3/3.6/commons-lang3-3.6.jar
2017-09-21T12:04:03.104 [INFO] Downloaded: https://repo.maven.apache.org/maven2/org/codehaus/jackson/jackson-mapper-asl/1.9.13/jackson-mapper-asl-1.9.13.jar
(763 KB at 1314.4 KB/sec)
2017-09-21T12:04:03.104 [INFO] Downloading: https://repo.maven.apache.org/maven2/joda-time/joda-time/2.4/joda-time-2.4.jar
2017-09-21T12:04:03.126 [INFO] Downloaded: https://repo.maven.apache.org/maven2/org/apache/avro/avro/1.8.2/avro-1.8.2.jar
(1521 KB at 2525.5 KB/sec)
2017-09-21T12:04:03.126 [INFO] Downloading: https://repo.maven.apache.org/maven2/com/google/auto/service/auto-service/1.0-rc2/auto-service-1.0-rc2.jar
2017-09-21T12:04:03.154 [INFO] Downloaded: https://repo.maven.apache.org/maven2/com/google/auto/service/auto-service/1.0-rc2/auto-service-1.0-rc2.jar
(11 KB at 16.1 KB/sec)
2017-09-21T12:04:03.154 [INFO] Downloading: https://repo.maven.apache.org/maven2/com/google/auto/auto-common/0.3/auto-common-0.3.jar
2017-09-21T12:04:03.186 [INFO] Downloaded: https://repo.maven.apache.org/maven2/com/google/auto/auto-common/0.3/auto-common-0.3.jar
(39 KB at 57.5 KB/sec)
2017-09-21T12:04:03.187 [INFO] Downloading: https://repo.maven.apache.org/maven2/com/google/auto/value/auto-value/1.4.1/auto-value-1.4.1.jar
2017-09-21T12:04:03.256 [INFO] Downloaded: https://repo.maven.apache.org/maven2/org/apache/commons/commons-lang3/3.6/commons-lang3-3.6.jar
(484 KB at 660.2 KB/sec)
2017-09-21T12:04:03.256 [INFO] Downloading: https://repo.maven.apache.org/maven2/com/fasterxml/jackson/dataformat/jackson-dataformat-yaml/2.8.9/jackson-dataformat-yaml-2.8.9.jar
2017-09-21T12:04:03.288 [INFO] Downloaded: https://repo.maven.apache.org/maven2/com/fasterxml/jackson/dataformat/jackson-dataformat-yaml/2.8.9/jackson-dataformat-yaml-2.8.9.jar
(40 KB at 52.3 KB/sec)
2017-09-21T12:04:03.288 [INFO] Downloading: https://repo.maven.apache.org/maven2/org/yaml/snakeyaml/1.17/snakeyaml-1.17.jar
2017-09-21T12:04:03.298 [INFO] Downloaded: https://repo.maven.apache.org/maven2/net/bytebuddy/byte-buddy/1.6.8/byte-buddy-1.6.8.jar
(2706 KB at 3495.9 KB/sec)
2017-09-21T12:04:03.298 [INFO] Downloading: https://repo.maven.apache.org/maven2/org/hamcrest/hamcrest-all/1.3/hamcrest-all-1.3.jar
2017-09-21T12:04:03.361 [INFO] Downloaded: https://repo.maven.apache.org/maven2/joda-time/joda-time/2.4/joda-time-2.4.jar
(573 KB at 683.9 KB/sec)
2017-09-21T12:04:03.361 [INFO] Downloading: https://repo.maven.apache.org/maven2/org/slf4j/slf4j-jdk14/1.7.25/slf4j-jdk14-1.7.25.jar
2017-09-21T12:04:03.361 [INFO] Downloaded: https://repo.maven.apache.org/maven2/org/xerial/snappy/snappy-java/1.1.4/snappy-java-1.1.4.jar
(1471 KB at 1756.8 KB/sec)
2017-09-21T12:04:03.377 [INFO] Downloading: https://repo.maven.apache.org/maven2/org/mockito/mockito-all/1.9.5/mockito-all-1.9.5.jar
2017-09-21T12:04:03.377 [INFO] Downloaded: https://repo.maven.apache.org/maven2/org/yaml/snakeyaml/1.17/snakeyaml-1.17.jar
(268 KB at 313.2 KB/sec)
2017-09-21T12:04:03.377 [INFO] Downloading: https://repo.maven.apache.org/maven2/com/esotericsoftware/kryo/kryo/2.21/kryo-2.21.jar
2017-09-21T12:04:03.419 [INFO] Downloaded: https://repo.maven.apache.org/maven2/org/hamcrest/hamcrest-all/1.3/hamcrest-all-1.3.jar
(300 KB at 334.5 KB/sec)
2017-09-21T12:04:03.420 [INFO] Downloading: https://repo.maven.apache.org/maven2/com/esotericsoftware/reflectasm/reflectasm/1.07/reflectasm-1.07-shaded.jar
2017-09-21T12:04:03.449 [INFO] Downloaded: https://repo.maven.apache.org/maven2/org/slf4j/slf4j-jdk14/1.7.25/slf4j-jdk14-1.7.25.jar
(9 KB at 8.9 KB/sec)
2017-09-21T12:04:03.449 [INFO] Downloading: https://repo.maven.apache.org/maven2/org/ow2/asm/asm/4.0/asm-4.0.jar
2017-09-21T12:04:03.461 [INFO] Downloaded: https://repo.maven.apache.org/maven2/com/esotericsoftware/reflectasm/reflectasm/1.07/reflectasm-1.07-shaded.jar
(65 KB at 68.4 KB/sec)
2017-09-21T12:04:03.461 [INFO] Downloading: https://repo.maven.apache.org/maven2/com/esotericsoftware/minlog/minlog/1.2/minlog-1.2.jar
2017-09-21T12:04:03.487 [INFO] Downloaded: https://repo.maven.apache.org/maven2/com/esotericsoftware/minlog/minlog/1.2/minlog-1.2.jar
(5 KB at 5.0 KB/sec)
2017-09-21T12:04:03.487 [INFO] Downloading: https://repo.maven.apache.org/maven2/org/objenesis/objenesis/1.2/objenesis-1.2.jar
2017-09-21T12:04:03.509 [INFO] Downloaded: https://repo.maven.apache.org/maven2/org/ow2/asm/asm/4.0/asm-4.0.jar
(45 KB at 45.6 KB/sec)
2017-09-21T12:04:03.510 [INFO] Downloaded: https://repo.maven.apache.org/maven2/com/google/auto/value/auto-value/1.4.1/auto-value-1.4.1.jar
(1470 KB at 1490.3 KB/sec)
2017-09-21T12:04:03.517 [INFO] Downloaded: https://repo.maven.apache.org/maven2/org/objenesis/objenesis/1.2/objenesis-1.2.jar
(36 KB at 35.5 KB/sec)
2017-09-21T12:04:03.557 [INFO] Downloaded: https://repo.maven.apache.org/maven2/com/esotericsoftware/kryo/kryo/2.21/kryo-2.21.jar
(355 KB at 343.6 KB/sec)
2017-09-21T12:04:03.725 [INFO] Downloaded: https://repo.maven.apache.org/maven2/org/mockito/mockito-all/1.9.5/mockito-all-1.9.5.jar
(1545 KB at 1285.6 KB/sec)
[JENKINS] Archiving disabled
[JENKINS] Archiving disabled
[JENKINS] Archiving disabled
[JENKINS] Archiving disabled
[JENKINS] Archiving disabled
[JENKINS] Archiving disabled
[JENKINS] Archiving disabled
[JENKINS] Archiving disabled
[JENKINS] Archiving disabled
[JENKINS] Archiving disabled
[JENKINS] Archiving disabled
[JENKINS] Archiving disabled
[JENKINS] Archiving disabled
2017-09-21T12:04:09.976 [INFO] ------------------------------------------------------------------------
2017-09-21T12:04:09.976 [INFO] Reactor Summary:
2017-09-21T12:04:09.976 [INFO] 
2017-09-21T12:04:09.976 [INFO] Apache Beam :: Parent .............................. SUCCESS
[ 41.788 s]
2017-09-21T12:04:09.976 [INFO] Apache Beam :: SDKs :: Java :: Build Tools ......... SUCCESS
[ 10.398 s]
2017-09-21T12:04:09.976 [INFO] Apache Beam :: SDKs ................................ SUCCESS
[  3.482 s]
2017-09-21T12:04:09.976 [INFO] Apache Beam :: SDKs :: Common ...................... SUCCESS
[  4.104 s]
2017-09-21T12:04:09.976 [INFO] Apache Beam :: SDKs :: Common :: Runner API ........ SUCCESS
[ 27.661 s]
2017-09-21T12:04:09.977 [INFO] Apache Beam :: SDKs :: Common :: Fn API ............ SUCCESS
[  8.615 s]
2017-09-21T12:04:09.977 [INFO] Apache Beam :: SDKs :: Java ........................ SUCCESS
[  2.651 s]
2017-09-21T12:04:09.977 [INFO] Apache Beam :: SDKs :: Java :: Core ................ FAILURE
[  3.224 s]
2017-09-21T12:04:09.977 [INFO] Apache Beam :: Runners ............................. SKIPPED
2017-09-21T12:04:09.977 [INFO] Apache Beam :: Runners :: Core Construction Java ... SKIPPED
2017-09-21T12:04:09.977 [INFO] Apache Beam :: Runners :: Core Java ................ SKIPPED
2017-09-21T12:04:09.977 [INFO] Apache Beam :: Runners :: Apex ..................... SKIPPED
2017-09-21T12:04:09.977 [INFO] ------------------------------------------------------------------------
2017-09-21T12:04:09.977 [INFO] BUILD FAILURE
2017-09-21T12:04:09.977 [INFO] ------------------------------------------------------------------------
2017-09-21T12:04:09.977 [INFO] Total time: 02:36 min
2017-09-21T12:04:09.977 [INFO] Finished at: 2017-09-21T12:04:09+00:00
2017-09-21T12:04:10.480 [INFO] Final Memory: 98M/1380M
2017-09-21T12:04:10.480 [INFO] ------------------------------------------------------------------------
2017-09-21T12:04:10.480 [WARNING] The requested profile "validates-runner-tests" could not
be activated because it does not exist.
2017-09-21T12:04:10.484 [ERROR] Failed to execute goal on project beam-sdks-java-core: Could
not resolve dependencies for project org.apache.beam:beam-sdks-java-core:jar:2.2.0-SNAPSHOT:
Could not transfer artifact com.fasterxml.jackson.core:jackson-databind:jar:2.8.9 from/to
central (https://repo.maven.apache.org/maven2): GET request of: com/fasterxml/jackson/core/jackson-databind/2.8.9/jackson-databind-2.8.9.jar
from central failed: Connection reset -> [Help 1]
2017-09-21T12:04:10.485 [ERROR] 
2017-09-21T12:04:10.485 [ERROR] To see the full stack trace of the errors, re-run Maven with
the -e switch.
2017-09-21T12:04:10.485 [ERROR] Re-run Maven using the -X switch to enable full debug logging.
2017-09-21T12:04:10.485 [ERROR] 
2017-09-21T12:04:10.485 [ERROR] For more information about the errors and possible solutions,
please read the following articles:
2017-09-21T12:04:10.485 [ERROR] [Help 1] http://cwiki.apache.org/confluence/display/MAVEN/DependencyResolutionException
2017-09-21T12:04:10.485 [ERROR] 
2017-09-21T12:04:10.485 [ERROR] After correcting the problems, you can resume the build with
the command
2017-09-21T12:04:10.485 [ERROR]   mvn <goals> -rf :beam-sdks-java-core
channel stopped

Mime
View raw message