beam-commits mailing list archives

Site index · List index
Message view « Date » · « Thread »
Top « Date » · « Thread »
From Apache Jenkins Server <jenk...@builds.apache.org>
Subject Build failed in Jenkins: beam_PostCommit_Java_MavenInstall #4777
Date Tue, 12 Sep 2017 08:44:42 GMT
See <https://builds.apache.org/job/beam_PostCommit_Java_MavenInstall/4777/display/redirect?page=changes>

Changes:

[chamikara] Add first few BigtableWriteException to suppressed list when rethrowing

------------------------------------------
[...truncated 351.45 KB...]
2017-09-12T08:44:04.592 [INFO] Downloading: https://repo.maven.apache.org/maven2/io/grpc/grpc-protobuf-lite/1.2.0/grpc-protobuf-lite-1.2.0.pom
2017-09-12T08:44:04.618 [INFO] Downloaded: https://repo.maven.apache.org/maven2/io/grpc/grpc-protobuf-lite/1.2.0/grpc-protobuf-lite-1.2.0.pom
(3 KB at 79.8 KB/sec)
2017-09-12T08:44:04.619 [INFO] Downloading: https://repo.maven.apache.org/maven2/io/grpc/grpc-stub/1.2.0/grpc-stub-1.2.0.pom
2017-09-12T08:44:04.645 [INFO] Downloaded: https://repo.maven.apache.org/maven2/io/grpc/grpc-stub/1.2.0/grpc-stub-1.2.0.pom
(3 KB at 78.0 KB/sec)
2017-09-12T08:44:04.649 [INFO] Downloading: https://repo.maven.apache.org/maven2/com/google/protobuf/protobuf-java/3.2.0/protobuf-java-3.2.0.jar
2017-09-12T08:44:04.650 [INFO] Downloading: https://repo.maven.apache.org/maven2/io/grpc/grpc-core/1.2.0/grpc-core-1.2.0.jar
2017-09-12T08:44:04.650 [INFO] Downloading: https://repo.maven.apache.org/maven2/com/google/errorprone/error_prone_annotations/2.0.15/error_prone_annotations-2.0.15.jar
2017-09-12T08:44:04.651 [INFO] Downloading: https://repo.maven.apache.org/maven2/com/google/code/findbugs/jsr305/3.0.1/jsr305-3.0.1.jar
2017-09-12T08:44:04.651 [INFO] Downloading: https://repo.maven.apache.org/maven2/io/grpc/grpc-context/1.2.0/grpc-context-1.2.0.jar
2017-09-12T08:44:04.679 [INFO] Downloaded: https://repo.maven.apache.org/maven2/com/google/code/findbugs/jsr305/3.0.1/jsr305-3.0.1.jar
(20 KB at 671.6 KB/sec)
2017-09-12T08:44:04.679 [INFO] Downloading: https://repo.maven.apache.org/maven2/com/google/instrumentation/instrumentation-api/0.3.0/instrumentation-api-0.3.0.jar
2017-09-12T08:44:04.679 [INFO] Downloaded: https://repo.maven.apache.org/maven2/com/google/errorprone/error_prone_annotations/2.0.15/error_prone_annotations-2.0.15.jar
(11 KB at 365.9 KB/sec)
2017-09-12T08:44:04.679 [INFO] Downloading: https://repo.maven.apache.org/maven2/io/grpc/grpc-protobuf/1.2.0/grpc-protobuf-1.2.0.jar
2017-09-12T08:44:04.684 [INFO] Downloaded: https://repo.maven.apache.org/maven2/io/grpc/grpc-context/1.2.0/grpc-context-1.2.0.jar
(20 KB at 598.4 KB/sec)
2017-09-12T08:44:04.684 [INFO] Downloading: https://repo.maven.apache.org/maven2/com/google/protobuf/protobuf-java-util/3.2.0/protobuf-java-util-3.2.0.jar
2017-09-12T08:44:04.705 [INFO] Downloaded: https://repo.maven.apache.org/maven2/io/grpc/grpc-protobuf/1.2.0/grpc-protobuf-1.2.0.jar
(4 KB at 72.1 KB/sec)
2017-09-12T08:44:04.705 [INFO] Downloading: https://repo.maven.apache.org/maven2/com/google/code/gson/gson/2.7/gson-2.7.jar
2017-09-12T08:44:04.714 [INFO] Downloaded: https://repo.maven.apache.org/maven2/com/google/instrumentation/instrumentation-api/0.3.0/instrumentation-api-0.3.0.jar
(30 KB at 469.4 KB/sec)
2017-09-12T08:44:04.714 [INFO] Downloading: https://repo.maven.apache.org/maven2/io/grpc/grpc-protobuf-lite/1.2.0/grpc-protobuf-lite-1.2.0.jar
2017-09-12T08:44:04.722 [INFO] Downloaded: https://repo.maven.apache.org/maven2/com/google/protobuf/protobuf-java-util/3.2.0/protobuf-java-util-3.2.0.jar
(66 KB at 929.2 KB/sec)
2017-09-12T08:44:04.722 [INFO] Downloading: https://repo.maven.apache.org/maven2/io/grpc/grpc-stub/1.2.0/grpc-stub-1.2.0.jar
2017-09-12T08:44:04.741 [INFO] Downloaded: https://repo.maven.apache.org/maven2/io/grpc/grpc-core/1.2.0/grpc-core-1.2.0.jar
(414 KB at 4497.9 KB/sec)
2017-09-12T08:44:04.746 [INFO] Downloaded: https://repo.maven.apache.org/maven2/io/grpc/grpc-protobuf-lite/1.2.0/grpc-protobuf-lite-1.2.0.jar
(8 KB at 78.4 KB/sec)
2017-09-12T08:44:04.763 [INFO] Downloaded: https://repo.maven.apache.org/maven2/io/grpc/grpc-stub/1.2.0/grpc-stub-1.2.0.jar
(36 KB at 317.3 KB/sec)
2017-09-12T08:44:04.766 [INFO] Downloaded: https://repo.maven.apache.org/maven2/com/google/code/gson/gson/2.7/gson-2.7.jar
(227 KB at 1969.7 KB/sec)
[JENKINS] Archiving disabled
2017-09-12T08:44:05.501 [INFO]                                                           
             
2017-09-12T08:44:05.501 [INFO] ------------------------------------------------------------------------
2017-09-12T08:44:05.501 [INFO] Skipping Apache Beam :: Parent
2017-09-12T08:44:05.501 [INFO] This project has been banned from the build due to previous
failures.
2017-09-12T08:44:05.501 [INFO] ------------------------------------------------------------------------
[JENKINS] Archiving disabled
[JENKINS] Archiving disabled
[JENKINS] Archiving disabled
[JENKINS] Archiving disabled
[JENKINS] Archiving disabled
[JENKINS] Archiving disabled
[JENKINS] Archiving disabled
[JENKINS] Archiving disabled
[JENKINS] Archiving disabled
[JENKINS] Archiving disabled
[JENKINS] Archiving disabled
[JENKINS] Archiving disabled
[JENKINS] Archiving disabled
[JENKINS] Archiving disabled
[JENKINS] Archiving disabled
[JENKINS] Archiving disabled
[JENKINS] Archiving disabled
[JENKINS] Archiving disabled
[JENKINS] Archiving disabled
[JENKINS] Archiving disabled
[JENKINS] Archiving disabled
[JENKINS] Archiving disabled
[JENKINS] Archiving disabled
[JENKINS] Archiving disabled
[JENKINS] Archiving disabled
[JENKINS] Archiving disabled
[JENKINS] Archiving disabled
[JENKINS] Archiving disabled
[JENKINS] Archiving disabled
[JENKINS] Archiving disabled
[JENKINS] Archiving disabled
[JENKINS] Archiving disabled
[JENKINS] Archiving disabled
[JENKINS] Archiving disabled
[JENKINS] Archiving disabled
[JENKINS] Archiving disabled
[JENKINS] Archiving disabled
[JENKINS] Archiving disabled
[JENKINS] Archiving disabled
[JENKINS] Archiving disabled
[JENKINS] Archiving disabled
[JENKINS] Archiving disabled
[JENKINS] Archiving disabled
[JENKINS] Archiving disabled
[JENKINS] Archiving disabled
[JENKINS] Archiving disabled
[JENKINS] Archiving disabled
[JENKINS] Archiving disabled
[JENKINS] Archiving disabled
[JENKINS] Archiving disabled
[JENKINS] Archiving disabled
[JENKINS] Archiving disabled
[JENKINS] Archiving disabled
[JENKINS] Archiving disabled
[JENKINS] Archiving disabled
[JENKINS] Archiving disabled
[JENKINS] Archiving disabled
[JENKINS] Archiving disabled
2017-09-12T08:44:27.197 [INFO] ------------------------------------------------------------------------
2017-09-12T08:44:27.198 [INFO] Reactor Summary:
2017-09-12T08:44:27.198 [INFO] 
2017-09-12T08:44:27.198 [INFO] Apache Beam :: Parent .............................. SUCCESS
[ 24.694 s]
2017-09-12T08:44:27.198 [INFO] Apache Beam :: SDKs :: Java :: Build Tools ......... SUCCESS
[ 11.485 s]
2017-09-12T08:44:27.198 [INFO] Apache Beam :: SDKs ................................ SUCCESS
[  5.838 s]
2017-09-12T08:44:27.198 [INFO] Apache Beam :: SDKs :: Common ...................... SUCCESS
[  2.987 s]
2017-09-12T08:44:27.198 [INFO] Apache Beam :: SDKs :: Common :: Runner API ........ FAILURE
[  0.778 s]
2017-09-12T08:44:27.198 [INFO] Apache Beam :: SDKs :: Common :: Fn API ............ SKIPPED
2017-09-12T08:44:27.198 [INFO] Apache Beam :: SDKs :: Java ........................ SKIPPED
2017-09-12T08:44:27.198 [INFO] Apache Beam :: SDKs :: Java :: Core ................ SKIPPED
2017-09-12T08:44:27.198 [INFO] Apache Beam :: Runners ............................. SKIPPED
2017-09-12T08:44:27.198 [INFO] Apache Beam :: Runners :: Core Construction Java ... SKIPPED
2017-09-12T08:44:27.198 [INFO] Apache Beam :: Runners :: Core Java ................ SKIPPED
2017-09-12T08:44:27.198 [INFO] Apache Beam :: Runners :: Direct Java .............. SKIPPED
2017-09-12T08:44:27.198 [INFO] Apache Beam :: SDKs :: Java :: IO .................. SKIPPED
2017-09-12T08:44:27.198 [INFO] Apache Beam :: SDKs :: Java :: IO :: AMQP .......... SKIPPED
2017-09-12T08:44:27.198 [INFO] Apache Beam :: SDKs :: Java :: IO :: Common ........ SKIPPED
2017-09-12T08:44:27.198 [INFO] Apache Beam :: SDKs :: Java :: IO :: Cassandra ..... SKIPPED
2017-09-12T08:44:27.198 [INFO] Apache Beam :: SDKs :: Java :: IO :: Elasticsearch . SKIPPED
2017-09-12T08:44:27.198 [INFO] Apache Beam :: SDKs :: Java :: Extensions .......... SKIPPED
2017-09-12T08:44:27.198 [INFO] Apache Beam :: SDKs :: Java :: Extensions :: Google Cloud Platform
Core SKIPPED
2017-09-12T08:44:27.198 [INFO] Apache Beam :: SDKs :: Java :: Extensions :: Protobuf SKIPPED
2017-09-12T08:44:27.198 [INFO] Apache Beam :: SDKs :: Java :: IO :: Google Cloud Platform
SKIPPED
2017-09-12T08:44:27.198 [INFO] Apache Beam :: SDKs :: Java :: IO :: Hadoop Common . SKIPPED
2017-09-12T08:44:27.198 [INFO] Apache Beam :: SDKs :: Java :: IO :: Hadoop File System SKIPPED
2017-09-12T08:44:27.198 [INFO] Apache Beam :: SDKs :: Java :: IO :: Hadoop ........ SKIPPED
2017-09-12T08:44:27.198 [INFO] Apache Beam :: SDKs :: Java :: IO :: Hadoop :: input-format
SKIPPED
2017-09-12T08:44:27.198 [INFO] Apache Beam :: Runners :: Google Cloud Dataflow .... SKIPPED
2017-09-12T08:44:27.198 [INFO] Apache Beam :: SDKs :: Java :: IO :: Hadoop :: jdk1.8-tests
SKIPPED
2017-09-12T08:44:27.198 [INFO] Apache Beam :: SDKs :: Java :: IO :: HBase ......... SKIPPED
2017-09-12T08:44:27.198 [INFO] Apache Beam :: SDKs :: Java :: IO :: HCatalog ...... SKIPPED
2017-09-12T08:44:27.198 [INFO] Apache Beam :: SDKs :: Java :: IO :: JDBC .......... SKIPPED
2017-09-12T08:44:27.198 [INFO] Apache Beam :: SDKs :: Java :: IO :: JMS ........... SKIPPED
2017-09-12T08:44:27.198 [INFO] Apache Beam :: SDKs :: Java :: IO :: Kafka ......... SKIPPED
2017-09-12T08:44:27.198 [INFO] Apache Beam :: SDKs :: Java :: IO :: Kinesis ....... SKIPPED
2017-09-12T08:44:27.198 [INFO] Apache Beam :: SDKs :: Java :: IO :: MongoDB ....... SKIPPED
2017-09-12T08:44:27.198 [INFO] Apache Beam :: SDKs :: Java :: IO :: MQTT .......... SKIPPED
2017-09-12T08:44:27.198 [INFO] Apache Beam :: SDKs :: Java :: IO :: Solr .......... SKIPPED
2017-09-12T08:44:27.198 [INFO] Apache Beam :: SDKs :: Java :: IO :: Tika .......... SKIPPED
2017-09-12T08:44:27.198 [INFO] Apache Beam :: SDKs :: Java :: IO :: XML ........... SKIPPED
2017-09-12T08:44:27.198 [INFO] Apache Beam :: SDKs :: Java :: Maven Archetypes .... SKIPPED
2017-09-12T08:44:27.198 [INFO] Apache Beam :: SDKs :: Java :: Maven Archetypes :: Starter
SKIPPED
2017-09-12T08:44:27.198 [INFO] Apache Beam :: Examples ............................ SKIPPED
2017-09-12T08:44:27.198 [INFO] Apache Beam :: Examples :: Java .................... SKIPPED
2017-09-12T08:44:27.198 [INFO] Apache Beam :: SDKs :: Java :: Maven Archetypes :: Examples
SKIPPED
2017-09-12T08:44:27.198 [INFO] Apache Beam :: Examples :: Java 8 .................. SKIPPED
2017-09-12T08:44:27.198 [INFO] Apache Beam :: SDKs :: Java :: Maven Archetypes :: Examples
- Java 8 SKIPPED
2017-09-12T08:44:27.198 [INFO] Apache Beam :: SDKs :: Java :: Extensions :: Jackson SKIPPED
2017-09-12T08:44:27.198 [INFO] Apache Beam :: SDKs :: Java :: Extensions :: Join library SKIPPED
2017-09-12T08:44:27.198 [INFO] Apache Beam :: SDKs :: Java :: Extensions :: Sorter  SKIPPED
2017-09-12T08:44:27.198 [INFO] Apache Beam :: SDKs :: Java :: Extensions :: SQL ... SKIPPED
2017-09-12T08:44:27.198 [INFO] Apache Beam :: SDKs :: Java :: Nexmark ............. SKIPPED
2017-09-12T08:44:27.198 [INFO] Apache Beam :: SDKs :: Java :: Harness ............. SKIPPED
2017-09-12T08:44:27.198 [INFO] Apache Beam :: SDKs :: Java :: Java 8 Tests ........ SKIPPED
2017-09-12T08:44:27.198 [INFO] Apache Beam :: SDKs :: Python ...................... SKIPPED
2017-09-12T08:44:27.198 [INFO] Apache Beam :: Runners :: Flink .................... SKIPPED
2017-09-12T08:44:27.198 [INFO] Apache Beam :: Runners :: Spark .................... SKIPPED
2017-09-12T08:44:27.198 [INFO] Apache Beam :: Runners :: Apex ..................... SKIPPED
2017-09-12T08:44:27.198 [INFO] Apache Beam :: Runners :: Gearpump ................. SKIPPED
2017-09-12T08:44:27.198 [INFO] Apache Beam :: SDKs :: Java :: Aggregated Javadoc .. SKIPPED
2017-09-12T08:44:27.198 [INFO] ------------------------------------------------------------------------
2017-09-12T08:44:27.198 [INFO] BUILD FAILURE
2017-09-12T08:44:27.198 [INFO] ------------------------------------------------------------------------
2017-09-12T08:44:27.199 [INFO] Total time: 01:20 min
2017-09-12T08:44:27.199 [INFO] Finished at: 2017-09-12T08:44:27+00:00
2017-09-12T08:44:27.553 [INFO] Final Memory: 97M/1133M
2017-09-12T08:44:27.553 [INFO] ------------------------------------------------------------------------
2017-09-12T08:44:27.558 [ERROR] Failed to execute goal on project beam-sdks-common-runner-api:
Could not resolve dependencies for project org.apache.beam:beam-sdks-common-runner-api:jar:2.2.0-SNAPSHOT:
Could not transfer artifact com.google.protobuf:protobuf-java:jar:3.2.0 from/to central (https://repo.maven.apache.org/maven2):
GET request of: com/google/protobuf/protobuf-java/3.2.0/protobuf-java-3.2.0.jar from central
failed: Connection reset -> [Help 1]
org.apache.maven.lifecycle.LifecycleExecutionException: Failed to execute goal on project
beam-sdks-common-runner-api: Could not resolve dependencies for project org.apache.beam:beam-sdks-common-runner-api:jar:2.2.0-SNAPSHOT:
Could not transfer artifact com.google.protobuf:protobuf-java:jar:3.2.0 from/to central (https://repo.maven.apache.org/maven2):
GET request of: com/google/protobuf/protobuf-java/3.2.0/protobuf-java-3.2.0.jar from central
failed
	at org.apache.maven.lifecycle.internal.LifecycleDependencyResolver.getDependencies(LifecycleDependencyResolver.java:221)
	at org.apache.maven.lifecycle.internal.LifecycleDependencyResolver.resolveProjectDependencies(LifecycleDependencyResolver.java:127)
	at org.apache.maven.lifecycle.internal.MojoExecutor.ensureDependenciesAreResolved(MojoExecutor.java:257)
	at org.apache.maven.lifecycle.internal.MojoExecutor.execute(MojoExecutor.java:200)
	at org.apache.maven.lifecycle.internal.MojoExecutor.execute(MojoExecutor.java:153)
	at org.apache.maven.lifecycle.internal.MojoExecutor.execute(MojoExecutor.java:145)
	at org.apache.maven.lifecycle.internal.LifecycleModuleBuilder.buildProject(LifecycleModuleBuilder.java:116)
	at org.apache.maven.lifecycle.internal.LifecycleModuleBuilder.buildProject(LifecycleModuleBuilder.java:80)
	at org.apache.maven.lifecycle.internal.builder.singlethreaded.SingleThreadedBuilder.build(SingleThreadedBuilder.java:51)
	at org.apache.maven.lifecycle.internal.LifecycleStarter.execute(LifecycleStarter.java:128)
	at org.apache.maven.DefaultMaven.doExecute(DefaultMaven.java:307)
	at org.apache.maven.DefaultMaven.doExecute(DefaultMaven.java:193)
	at org.apache.maven.DefaultMaven.execute(DefaultMaven.java:106)
	at org.jvnet.hudson.maven3.launcher.Maven33Launcher.main(Maven33Launcher.java:129)
	at sun.reflect.NativeMethodAccessorImpl.invoke0(Native Method)
	at sun.reflect.NativeMethodAccessorImpl.invoke(NativeMethodAccessorImpl.java:62)
	at sun.reflect.DelegatingMethodAccessorImpl.invoke(DelegatingMethodAccessorImpl.java:43)
	at java.lang.reflect.Method.invoke(Method.java:498)
	at org.codehaus.plexus.classworlds.launcher.Launcher.launchStandard(Launcher.java:330)
	at org.codehaus.plexus.classworlds.launcher.Launcher.launch(Launcher.java:238)
	at jenkins.maven3.agent.Maven33Main.launch(Maven33Main.java:176)
	at sun.reflect.NativeMethodAccessorImpl.invoke0(Native Method)
	at sun.reflect.NativeMethodAccessorImpl.invoke(NativeMethodAccessorImpl.java:62)
	at sun.reflect.DelegatingMethodAccessorImpl.invoke(DelegatingMethodAccessorImpl.java:43)
	at java.lang.reflect.Method.invoke(Method.java:498)
	at hudson.maven.Maven3Builder.call(Maven3Builder.java:139)
	at hudson.maven.Maven3Builder.call(Maven3Builder.java:70)
	at hudson.remoting.UserRequest.perform(UserRequest.java:153)
	at hudson.remoting.UserRequest.perform(UserRequest.java:50)
	at hudson.remoting.Request$2.run(Request.java:336)
	at hudson.remoting.InterceptingExecutorService$1.call(InterceptingExecutorService.java:68)
	at java.util.concurrent.FutureTask.run(FutureTask.java:266)
	at java.util.concurrent.ThreadPoolExecutor.runWorker(ThreadPoolExecutor.java:1149)
	at java.util.concurrent.ThreadPoolExecutor$Worker.run(ThreadPoolExecutor.java:624)
	at java.lang.Thread.run(Thread.java:748)
Caused by: org.apache.maven.project.DependencyResolutionException: Could not resolve dependencies
for project org.apache.beam:beam-sdks-common-runner-api:jar:2.2.0-SNAPSHOT: Could not transfer
artifact com.google.protobuf:protobuf-java:jar:3.2.0 from/to central (https://repo.maven.apache.org/maven2):
GET request of: com/google/protobuf/protobuf-java/3.2.0/protobuf-java-3.2.0.jar from central
failed
	at org.apache.maven.project.DefaultProjectDependenciesResolver.resolve(DefaultProjectDependenciesResolver.java:211)
	at org.apache.maven.lifecycle.internal.LifecycleDependencyResolver.getDependencies(LifecycleDependencyResolver.java:195)
	... 34 more
Caused by: org.eclipse.aether.resolution.DependencyResolutionException: Could not transfer
artifact com.google.protobuf:protobuf-java:jar:3.2.0 from/to central (https://repo.maven.apache.org/maven2):
GET request of: com/google/protobuf/protobuf-java/3.2.0/protobuf-java-3.2.0.jar from central
failed
	at org.eclipse.aether.internal.impl.DefaultRepositorySystem.resolveDependencies(DefaultRepositorySystem.java:384)
	at org.apache.maven.project.DefaultProjectDependenciesResolver.resolve(DefaultProjectDependenciesResolver.java:205)
	... 35 more
Caused by: org.eclipse.aether.resolution.ArtifactResolutionException: Could not transfer artifact
com.google.protobuf:protobuf-java:jar:3.2.0 from/to central (https://repo.maven.apache.org/maven2):
GET request of: com/google/protobuf/protobuf-java/3.2.0/protobuf-java-3.2.0.jar from central
failed
	at org.eclipse.aether.internal.impl.DefaultArtifactResolver.resolve(DefaultArtifactResolver.java:444)
	at org.eclipse.aether.internal.impl.DefaultArtifactResolver.resolveArtifacts(DefaultArtifactResolver.java:246)
	at org.eclipse.aether.internal.impl.DefaultRepositorySystem.resolveDependencies(DefaultRepositorySystem.java:367)
	... 36 more
Caused by: org.eclipse.aether.transfer.ArtifactTransferException: Could not transfer artifact
com.google.protobuf:protobuf-java:jar:3.2.0 from/to central (https://repo.maven.apache.org/maven2):
GET request of: com/google/protobuf/protobuf-java/3.2.0/protobuf-java-3.2.0.jar from central
failed
	at org.eclipse.aether.connector.basic.ArtifactTransportListener.transferFailed(ArtifactTransportListener.java:43)
	at org.eclipse.aether.connector.basic.BasicRepositoryConnector$TaskRunner.run(BasicRepositoryConnector.java:355)
	at org.eclipse.aether.util.concurrency.RunnableErrorForwarder$1.run(RunnableErrorForwarder.java:67)
	... 3 more
Caused by: org.apache.maven.wagon.TransferFailedException: GET request of: com/google/protobuf/protobuf-java/3.2.0/protobuf-java-3.2.0.jar
from central failed
	at org.apache.maven.wagon.AbstractWagon.getTransfer(AbstractWagon.java:363)
	at org.apache.maven.wagon.AbstractWagon.getTransfer(AbstractWagon.java:316)
	at org.apache.maven.wagon.AbstractWagon.getTransfer(AbstractWagon.java:285)
	at org.apache.maven.wagon.StreamWagon.getIfNewer(StreamWagon.java:97)
	at org.apache.maven.wagon.StreamWagon.get(StreamWagon.java:61)
	at org.eclipse.aether.transport.wagon.WagonTransporter$GetTaskRunner.run(WagonTransporter.java:560)
	at org.eclipse.aether.transport.wagon.WagonTransporter.execute(WagonTransporter.java:427)
	at org.eclipse.aether.transport.wagon.WagonTransporter.get(WagonTransporter.java:404)
	at org.eclipse.aether.connector.basic.BasicRepositoryConnector$GetTaskRunner.runTask(BasicRepositoryConnector.java:447)
	at org.eclipse.aether.connector.basic.BasicRepositoryConnector$TaskRunner.run(BasicRepositoryConnector.java:350)
	... 4 more
Caused by: java.net.SocketException: Connection reset
	at java.net.SocketInputStream.read(SocketInputStream.java:210)
	at java.net.SocketInputStream.read(SocketInputStream.java:141)
	at sun.security.ssl.InputRecord.readFully(InputRecord.java:465)
	at sun.security.ssl.InputRecord.readV3Record(InputRecord.java:593)
	at sun.security.ssl.InputRecord.read(InputRecord.java:532)
	at sun.security.ssl.SSLSocketImpl.readRecord(SSLSocketImpl.java:983)
	at sun.security.ssl.SSLSocketImpl.readDataRecord(SSLSocketImpl.java:940)
	at sun.security.ssl.AppInputStream.read(AppInputStream.java:105)
	at org.apache.maven.wagon.providers.http.httpclient.impl.io.SessionInputBufferImpl.streamRead(SessionInputBufferImpl.java:136)
	at org.apache.maven.wagon.providers.http.httpclient.impl.io.SessionInputBufferImpl.read(SessionInputBufferImpl.java:195)
	at org.apache.maven.wagon.providers.http.httpclient.impl.io.ContentLengthInputStream.read(ContentLengthInputStream.java:178)
	at org.apache.maven.wagon.providers.http.httpclient.conn.EofSensorInputStream.read(EofSensorInputStream.java:137)
	at org.apache.maven.wagon.AbstractWagon.transfer(AbstractWagon.java:531)
	at org.apache.maven.wagon.AbstractWagon.getTransfer(AbstractWagon.java:353)
	... 13 more
2017-09-12T08:44:27.559 [ERROR] 
2017-09-12T08:44:27.559 [ERROR] Re-run Maven using the -X switch to enable full debug logging.
2017-09-12T08:44:27.559 [ERROR] 
2017-09-12T08:44:27.559 [ERROR] For more information about the errors and possible solutions,
please read the following articles:
2017-09-12T08:44:27.559 [ERROR] [Help 1] http://cwiki.apache.org/confluence/display/MAVEN/DependencyResolutionException
2017-09-12T08:44:27.560 [ERROR] 
2017-09-12T08:44:27.560 [ERROR] After correcting the problems, you can resume the build with
the command
2017-09-12T08:44:27.560 [ERROR]   mvn <goals> -rf :beam-sdks-common-runner-api
channel stopped

Mime
View raw message