beam-commits mailing list archives

Site index · List index
Message view « Date » · « Thread »
Top « Date » · « Thread »
From Apache Jenkins Server <jenk...@builds.apache.org>
Subject Build failed in Jenkins: beam_PostCommit_Java_ValidatesRunner_Flink #3791
Date Fri, 08 Sep 2017 18:07:05 GMT
See <https://builds.apache.org/job/beam_PostCommit_Java_ValidatesRunner_Flink/3791/display/redirect>

------------------------------------------
[...truncated 486.73 KB...]
2017-09-08T18:06:48.324 [INFO] Downloaded: https://repo.maven.apache.org/maven2/org/apache/curator/apache-curator/2.12.0/apache-curator-2.12.0.pom
(32 KB at 1052.4 KB/sec)
2017-09-08T18:06:48.328 [INFO] Downloading: https://repo.maven.apache.org/maven2/org/apache/zookeeper/zookeeper/3.4.8/zookeeper-3.4.8.pom
2017-09-08T18:06:48.354 [INFO] Downloaded: https://repo.maven.apache.org/maven2/org/apache/zookeeper/zookeeper/3.4.8/zookeeper-3.4.8.pom
(4 KB at 151.2 KB/sec)
2017-09-08T18:06:48.357 [INFO] Downloading: https://repo.maven.apache.org/maven2/log4j/log4j/1.2.16/log4j-1.2.16.pom
2017-09-08T18:06:48.394 [INFO] Downloaded: https://repo.maven.apache.org/maven2/log4j/log4j/1.2.16/log4j-1.2.16.pom
(20 KB at 536.8 KB/sec)
2017-09-08T18:06:48.398 [INFO] Downloading: https://repo.maven.apache.org/maven2/org/javassist/javassist/3.18.1-GA/javassist-3.18.1-GA.pom
2017-09-08T18:06:48.424 [INFO] Downloaded: https://repo.maven.apache.org/maven2/org/javassist/javassist/3.18.1-GA/javassist-3.18.1-GA.pom
(10 KB at 357.6 KB/sec)
2017-09-08T18:06:48.439 [INFO] Downloading: https://repo.maven.apache.org/maven2/org/apache/flink/flink-clients_2.10/1.3.0/flink-clients_2.10-1.3.0.jar
2017-09-08T18:06:48.440 [INFO] Downloading: https://repo.maven.apache.org/maven2/org/apache/flink/flink-optimizer_2.10/1.3.0/flink-optimizer_2.10-1.3.0.jar
2017-09-08T18:06:48.440 [INFO] Downloading: https://repo.maven.apache.org/maven2/org/apache/flink/force-shading/1.3.0/force-shading-1.3.0.jar
2017-09-08T18:06:48.441 [INFO] Downloading: https://repo.maven.apache.org/maven2/org/apache/flink/flink-core/1.3.0/flink-core-1.3.0.jar
2017-09-08T18:06:48.441 [INFO] Downloading: https://repo.maven.apache.org/maven2/org/apache/flink/flink-annotations/1.3.0/flink-annotations-1.3.0.jar
2017-09-08T18:06:48.475 [INFO] Downloaded: https://repo.maven.apache.org/maven2/org/apache/flink/flink-clients_2.10/1.3.0/flink-clients_2.10-1.3.0.jar
(89 KB at 2464.1 KB/sec)
2017-09-08T18:06:48.475 [INFO] Downloading: https://repo.maven.apache.org/maven2/com/esotericsoftware/kryo/kryo/2.24.0/kryo-2.24.0.jar
2017-09-08T18:06:48.525 [INFO] Downloaded: https://repo.maven.apache.org/maven2/com/esotericsoftware/kryo/kryo/2.24.0/kryo-2.24.0.jar
(332 KB at 3944.4 KB/sec)
2017-09-08T18:06:48.525 [INFO] Downloading: https://repo.maven.apache.org/maven2/org/objenesis/objenesis/2.1/objenesis-2.1.jar
2017-09-08T18:06:48.552 [INFO] Downloading: https://repo.maven.apache.org/maven2/org/apache/flink/flink-metrics-core/1.3.0/flink-metrics-core-1.3.0.jar
2017-09-08T18:06:48.556 [INFO] Downloaded: https://repo.maven.apache.org/maven2/org/objenesis/objenesis/2.1/objenesis-2.1.jar
(41 KB at 354.6 KB/sec)
2017-09-08T18:06:48.556 [INFO] Downloading: https://repo.maven.apache.org/maven2/org/apache/flink/flink-java/1.3.0/flink-java-1.3.0.jar
2017-09-08T18:06:48.565 [INFO] Downloaded: https://repo.maven.apache.org/maven2/org/apache/flink/force-shading/1.3.0/force-shading-1.3.0.jar
(8 KB at 56.9 KB/sec)
2017-09-08T18:06:48.566 [INFO] Downloading: https://repo.maven.apache.org/maven2/org/apache/flink/flink-shaded-hadoop2/1.3.0/flink-shaded-hadoop2-1.3.0.jar
2017-09-08T18:06:48.629 [INFO] Downloaded: https://repo.maven.apache.org/maven2/org/apache/flink/flink-core/1.3.0/flink-core-1.3.0.jar
(1362 KB at 7242.0 KB/sec)
2017-09-08T18:06:48.629 [INFO] Downloading: https://repo.maven.apache.org/maven2/xmlenc/xmlenc/0.52/xmlenc-0.52.jar
2017-09-08T18:06:48.657 [INFO] Downloaded: https://repo.maven.apache.org/maven2/xmlenc/xmlenc/0.52/xmlenc-0.52.jar
(15 KB at 67.9 KB/sec)
2017-09-08T18:06:48.657 [INFO] Downloading: https://repo.maven.apache.org/maven2/commons-codec/commons-codec/1.4/commons-codec-1.4.jar
2017-09-08T18:06:48.667 [INFO] Downloaded: https://repo.maven.apache.org/maven2/org/apache/flink/flink-java/1.3.0/flink-java-1.3.0.jar
(752 KB at 3326.9 KB/sec)
2017-09-08T18:06:48.667 [INFO] Downloading: https://repo.maven.apache.org/maven2/commons-net/commons-net/3.1/commons-net-3.1.jar
2017-09-08T18:06:48.678 [INFO] Downloaded: https://repo.maven.apache.org/maven2/org/apache/flink/flink-annotations/1.3.0/flink-annotations-1.3.0.jar
(8 KB at 30.3 KB/sec)
2017-09-08T18:06:48.678 [INFO] Downloading: https://repo.maven.apache.org/maven2/org/mortbay/jetty/jetty-util/6.1.26/jetty-util-6.1.26.jar
2017-09-08T18:06:48.689 [INFO] Downloaded: https://repo.maven.apache.org/maven2/commons-codec/commons-codec/1.4/commons-codec-1.4.jar
(57 KB at 229.0 KB/sec)
2017-09-08T18:06:48.689 [INFO] Downloading: https://repo.maven.apache.org/maven2/com/sun/jersey/jersey-core/1.9/jersey-core-1.9.jar
2017-09-08T18:06:48.718 [INFO] Downloaded: https://repo.maven.apache.org/maven2/commons-net/commons-net/3.1/commons-net-3.1.jar
(267 KB at 963.8 KB/sec)
2017-09-08T18:06:48.718 [INFO] Downloading: https://repo.maven.apache.org/maven2/commons-el/commons-el/1.0/commons-el-1.0.jar
2017-09-08T18:06:48.723 [INFO] Downloaded: https://repo.maven.apache.org/maven2/org/mortbay/jetty/jetty-util/6.1.26/jetty-util-6.1.26.jar
(173 KB at 613.4 KB/sec)
2017-09-08T18:06:48.723 [INFO] Downloading: https://repo.maven.apache.org/maven2/commons-logging/commons-logging/1.1.3/commons-logging-1.1.3.jar
2017-09-08T18:06:48.772 [INFO] Downloaded: https://repo.maven.apache.org/maven2/commons-logging/commons-logging/1.1.3/commons-logging-1.1.3.jar
(61 KB at 183.1 KB/sec)
2017-09-08T18:06:48.773 [INFO] Downloading: https://repo.maven.apache.org/maven2/com/jamesmurty/utils/java-xmlbuilder/0.4/java-xmlbuilder-0.4.jar
2017-09-08T18:06:48.773 [INFO] Downloaded: https://repo.maven.apache.org/maven2/commons-el/commons-el/1.0/commons-el-1.0.jar
(110 KB at 330.4 KB/sec)
2017-09-08T18:06:48.773 [INFO] Downloading: https://repo.maven.apache.org/maven2/commons-configuration/commons-configuration/1.7/commons-configuration-1.7.jar
2017-09-08T18:06:48.787 [INFO] Downloaded: https://repo.maven.apache.org/maven2/com/sun/jersey/jersey-core/1.9/jersey-core-1.9.jar
(448 KB at 1294.8 KB/sec)
2017-09-08T18:06:48.787 [INFO] Downloading: https://repo.maven.apache.org/maven2/commons-digester/commons-digester/1.8.1/commons-digester-1.8.1.jar
2017-09-08T18:06:48.801 [INFO] Downloaded: https://repo.maven.apache.org/maven2/com/jamesmurty/utils/java-xmlbuilder/0.4/java-xmlbuilder-0.4.jar
(19 KB at 50.2 KB/sec)
2017-09-08T18:06:48.801 [INFO] Downloading: https://repo.maven.apache.org/maven2/com/jcraft/jsch/0.1.42/jsch-0.1.42.jar
2017-09-08T18:06:48.820 [INFO] Downloaded: https://repo.maven.apache.org/maven2/org/apache/flink/flink-metrics-core/1.3.0/flink-metrics-core-1.3.0.jar
(16 KB at 41.2 KB/sec)
2017-09-08T18:06:48.820 [INFO] Downloading: https://repo.maven.apache.org/maven2/commons-beanutils/commons-beanutils-bean-collections/1.8.3/commons-beanutils-bean-collections-1.8.3.jar
2017-09-08T18:06:48.836 [INFO] Downloaded: https://repo.maven.apache.org/maven2/commons-configuration/commons-configuration/1.7/commons-configuration-1.7.jar
(343 KB at 866.1 KB/sec)
2017-09-08T18:06:48.836 [INFO] Downloading: https://repo.maven.apache.org/maven2/commons-daemon/commons-daemon/1.0.13/commons-daemon-1.0.13.jar
2017-09-08T18:06:48.840 [INFO] Downloaded: https://repo.maven.apache.org/maven2/commons-digester/commons-digester/1.8.1/commons-digester-1.8.1.jar
(143 KB at 357.6 KB/sec)
2017-09-08T18:06:48.840 [INFO] Downloading: https://repo.maven.apache.org/maven2/javax/xml/bind/jaxb-api/2.2.2/jaxb-api-2.2.2.jar
2017-09-08T18:06:48.851 [INFO] Downloaded: https://repo.maven.apache.org/maven2/commons-beanutils/commons-beanutils-bean-collections/1.8.3/commons-beanutils-bean-collections-1.8.3.jar
(26 KB at 63.3 KB/sec)
2017-09-08T18:06:48.851 [INFO] Downloading: https://repo.maven.apache.org/maven2/javax/xml/stream/stax-api/1.0-2/stax-api-1.0-2.jar
2017-09-08T18:06:48.856 [INFO] Downloaded: https://repo.maven.apache.org/maven2/com/jcraft/jsch/0.1.42/jsch-0.1.42.jar
(182 KB at 437.1 KB/sec)
2017-09-08T18:06:48.856 [INFO] Downloading: https://repo.maven.apache.org/maven2/javax/activation/activation/1.1/activation-1.1.jar
2017-09-08T18:06:48.866 [INFO] Downloaded: https://repo.maven.apache.org/maven2/commons-daemon/commons-daemon/1.0.13/commons-daemon-1.0.13.jar
(24 KB at 55.8 KB/sec)
2017-09-08T18:06:48.866 [INFO] Downloading: https://repo.maven.apache.org/maven2/org/apache/commons/commons-math3/3.5/commons-math3-3.5.jar
2017-09-08T18:06:48.880 [INFO] Downloaded: https://repo.maven.apache.org/maven2/javax/xml/stream/stax-api/1.0-2/stax-api-1.0-2.jar
(23 KB at 51.9 KB/sec)
2017-09-08T18:06:48.880 [INFO] Downloading: https://repo.maven.apache.org/maven2/org/apache/flink/flink-runtime_2.10/1.3.0/flink-runtime_2.10-1.3.0.jar
2017-09-08T18:06:48.891 [INFO] Downloaded: https://repo.maven.apache.org/maven2/javax/activation/activation/1.1/activation-1.1.jar
(62 KB at 136.7 KB/sec)
2017-09-08T18:06:48.891 [INFO] Downloading: https://repo.maven.apache.org/maven2/io/netty/netty-all/4.0.27.Final/netty-all-4.0.27.Final.jar
2017-09-08T18:06:48.896 [INFO] Downloaded: https://repo.maven.apache.org/maven2/javax/xml/bind/jaxb-api/2.2.2/jaxb-api-2.2.2.jar
(103 KB at 225.6 KB/sec)
2017-09-08T18:06:48.897 [INFO] Downloading: https://repo.maven.apache.org/maven2/org/javassist/javassist/3.18.2-GA/javassist-3.18.2-GA.jar
2017-09-08T18:06:49.069 [INFO] Downloaded: https://repo.maven.apache.org/maven2/org/javassist/javassist/3.18.2-GA/javassist-3.18.2-GA.jar
(698 KB at 1112.9 KB/sec)
2017-09-08T18:06:49.069 [INFO] Downloading: https://repo.maven.apache.org/maven2/org/scala-lang/scala-library/2.10.4/scala-library-2.10.4.jar
2017-09-08T18:06:49.139 [INFO] Downloaded: https://repo.maven.apache.org/maven2/org/apache/commons/commons-math3/3.5/commons-math3-3.5.jar
(1991 KB at 2852.0 KB/sec)
2017-09-08T18:06:49.139 [INFO] Downloading: https://repo.maven.apache.org/maven2/com/data-artisans/flakka-actor_2.10/2.3-custom/flakka-actor_2.10-2.3-custom.jar
2017-09-08T18:06:49.192 [INFO] Downloaded: https://repo.maven.apache.org/maven2/io/netty/netty-all/4.0.27.Final/netty-all-4.0.27.Final.jar
(1894 KB at 2521.9 KB/sec)
2017-09-08T18:06:49.193 [INFO] Downloading: https://repo.maven.apache.org/maven2/com/typesafe/config/1.2.1/config-1.2.1.jar
2017-09-08T18:06:49.276 [INFO] Downloaded: https://repo.maven.apache.org/maven2/com/typesafe/config/1.2.1/config-1.2.1.jar
(215 KB at 256.8 KB/sec)
2017-09-08T18:06:49.276 [INFO] Downloading: https://repo.maven.apache.org/maven2/com/data-artisans/flakka-remote_2.10/2.3-custom/flakka-remote_2.10-2.3-custom.jar
2017-09-08T18:06:49.612 [INFO] Downloaded: https://repo.maven.apache.org/maven2/com/data-artisans/flakka-actor_2.10/2.3-custom/flakka-actor_2.10-2.3-custom.jar
(2754 KB at 2351.4 KB/sec)
2017-09-08T18:06:49.612 [INFO] Downloading: https://repo.maven.apache.org/maven2/io/netty/netty/3.8.0.Final/netty-3.8.0.Final.jar
2017-09-08T18:06:49.640 [INFO] Downloaded: https://repo.maven.apache.org/maven2/com/data-artisans/flakka-remote_2.10/2.3-custom/flakka-remote_2.10-2.3-custom.jar
(1347 KB at 1123.4 KB/sec)
2017-09-08T18:06:49.640 [INFO] Downloading: https://repo.maven.apache.org/maven2/org/uncommons/maths/uncommons-maths/1.2.2a/uncommons-maths-1.2.2a.jar
2017-09-08T18:06:49.676 [INFO] Downloaded: https://repo.maven.apache.org/maven2/org/uncommons/maths/uncommons-maths/1.2.2a/uncommons-maths-1.2.2a.jar
(48 KB at 38.8 KB/sec)
2017-09-08T18:06:49.676 [INFO] Downloading: https://repo.maven.apache.org/maven2/com/data-artisans/flakka-slf4j_2.10/2.3-custom/flakka-slf4j_2.10-2.3-custom.jar
2017-09-08T18:06:49.706 [INFO] Downloaded: https://repo.maven.apache.org/maven2/com/data-artisans/flakka-slf4j_2.10/2.3-custom/flakka-slf4j_2.10-2.3-custom.jar
(16 KB at 12.0 KB/sec)
2017-09-08T18:06:49.706 [INFO] Downloading: https://repo.maven.apache.org/maven2/org/clapper/grizzled-slf4j_2.10/1.0.2/grizzled-slf4j_2.10-1.0.2.jar
2017-09-08T18:06:49.733 [INFO] Downloaded: https://repo.maven.apache.org/maven2/org/clapper/grizzled-slf4j_2.10/1.0.2/grizzled-slf4j_2.10-1.0.2.jar
(7 KB at 4.9 KB/sec)
2017-09-08T18:06:49.733 [INFO] Downloading: https://repo.maven.apache.org/maven2/com/github/scopt/scopt_2.10/3.5.0/scopt_2.10-3.5.0.jar
2017-09-08T18:06:49.793 [INFO] Downloaded: https://repo.maven.apache.org/maven2/com/github/scopt/scopt_2.10/3.5.0/scopt_2.10-3.5.0.jar
(140 KB at 103.3 KB/sec)
2017-09-08T18:06:49.793 [INFO] Downloading: https://repo.maven.apache.org/maven2/org/apache/zookeeper/zookeeper/3.4.6/zookeeper-3.4.6.jar
2017-09-08T18:06:49.845 [INFO] Downloaded: https://repo.maven.apache.org/maven2/io/netty/netty/3.8.0.Final/netty-3.8.0.Final.jar
(1202 KB at 855.7 KB/sec)
2017-09-08T18:06:49.845 [INFO] Downloading: https://repo.maven.apache.org/maven2/jline/jline/0.9.94/jline-0.9.94.jar
2017-09-08T18:06:49.896 [INFO] Downloaded: https://repo.maven.apache.org/maven2/jline/jline/0.9.94/jline-0.9.94.jar
(86 KB at 58.6 KB/sec)
2017-09-08T18:06:49.896 [INFO] Downloading: https://repo.maven.apache.org/maven2/com/twitter/chill_2.10/0.7.4/chill_2.10-0.7.4.jar
2017-09-08T18:06:49.974 [INFO] Downloaded: https://repo.maven.apache.org/maven2/com/twitter/chill_2.10/0.7.4/chill_2.10-0.7.4.jar
(217 KB at 140.9 KB/sec)
2017-09-08T18:06:49.974 [INFO] Downloading: https://repo.maven.apache.org/maven2/com/twitter/chill-java/0.7.4/chill-java-0.7.4.jar
2017-09-08T18:06:49.975 [INFO] Downloaded: https://repo.maven.apache.org/maven2/org/apache/zookeeper/zookeeper/3.4.6/zookeeper-3.4.6.jar
(775 KB at 504.8 KB/sec)
2017-09-08T18:06:49.975 [INFO] Downloading: https://repo.maven.apache.org/maven2/org/apache/flink/flink-streaming-java_2.10/1.3.0/flink-streaming-java_2.10-1.3.0.jar
2017-09-08T18:06:49.992 [INFO] Downloaded: https://repo.maven.apache.org/maven2/org/scala-lang/scala-library/2.10.4/scala-library-2.10.4.jar
(6960 KB at 4487.0 KB/sec)
2017-09-08T18:06:49.993 [INFO] Downloading: https://repo.maven.apache.org/maven2/org/apache/sling/org.apache.sling.commons.json/2.0.6/org.apache.sling.commons.json-2.0.6.jar
2017-09-08T18:06:50.006 [INFO] Downloaded: https://repo.maven.apache.org/maven2/com/twitter/chill-java/0.7.4/chill-java-0.7.4.jar
(50 KB at 31.4 KB/sec)
2017-09-08T18:06:50.007 [INFO] Downloading: https://repo.maven.apache.org/maven2/org/apache/flink/flink-core/1.3.0/flink-core-1.3.0-tests.jar
2017-09-08T18:06:50.029 [INFO] Downloaded: https://repo.maven.apache.org/maven2/org/apache/sling/org.apache.sling.commons.json/2.0.6/org.apache.sling.commons.json-2.0.6.jar
(47 KB at 29.4 KB/sec)
2017-09-08T18:06:50.029 [INFO] Downloading: https://repo.maven.apache.org/maven2/org/apache/flink/flink-runtime_2.10/1.3.0/flink-runtime_2.10-1.3.0-tests.jar
2017-09-08T18:06:50.136 [INFO] Downloaded: https://repo.maven.apache.org/maven2/org/apache/flink/flink-core/1.3.0/flink-core-1.3.0-tests.jar
(753 KB at 443.7 KB/sec)
2017-09-08T18:06:50.136 [INFO] Downloading: https://repo.maven.apache.org/maven2/com/google/apis/google-api-services-bigquery/v2-rev355-1.22.0/google-api-services-bigquery-v2-rev355-1.22.0.jar
2017-09-08T18:06:50.186 [INFO] Downloaded: https://repo.maven.apache.org/maven2/com/google/apis/google-api-services-bigquery/v2-rev355-1.22.0/google-api-services-bigquery-v2-rev355-1.22.0.jar
(107 KB at 61.3 KB/sec)
2017-09-08T18:06:50.186 [INFO] Downloading: https://repo.maven.apache.org/maven2/com/google/api-client/google-api-client/1.22.0/google-api-client-1.22.0.jar
2017-09-08T18:06:50.187 [INFO] Downloaded: https://repo.maven.apache.org/maven2/org/apache/flink/flink-runtime_2.10/1.3.0/flink-runtime_2.10-1.3.0.jar
(9005 KB at 5157.0 KB/sec)
2017-09-08T18:06:50.188 [INFO] Downloading: https://repo.maven.apache.org/maven2/com/google/oauth-client/google-oauth-client/1.22.0/google-oauth-client-1.22.0.jar
2017-09-08T18:06:50.236 [INFO] Downloaded: https://repo.maven.apache.org/maven2/com/google/oauth-client/google-oauth-client/1.22.0/google-oauth-client-1.22.0.jar
(60 KB at 33.4 KB/sec)
2017-09-08T18:06:50.236 [INFO] Downloading: https://repo.maven.apache.org/maven2/com/google/http-client/google-http-client/1.22.0/google-http-client-1.22.0.jar
2017-09-08T18:06:50.239 [INFO] Downloaded: https://repo.maven.apache.org/maven2/com/google/api-client/google-api-client/1.22.0/google-api-client-1.22.0.jar
(195 KB at 108.1 KB/sec)
2017-09-08T18:06:50.239 [INFO] Downloading: https://repo.maven.apache.org/maven2/org/apache/httpcomponents/httpclient/4.0.1/httpclient-4.0.1.jar
2017-09-08T18:06:50.308 [INFO] Downloaded: https://repo.maven.apache.org/maven2/com/google/http-client/google-http-client/1.22.0/google-http-client-1.22.0.jar
(349 KB at 186.7 KB/sec)
2017-09-08T18:06:50.308 [INFO] Downloading: https://repo.maven.apache.org/maven2/com/google/http-client/google-http-client-jackson2/1.22.0/google-http-client-jackson2-1.22.0.jar
2017-09-08T18:06:50.324 [INFO] Downloaded: https://repo.maven.apache.org/maven2/org/apache/httpcomponents/httpclient/4.0.1/httpclient-4.0.1.jar
(285 KB at 150.9 KB/sec)
2017-09-08T18:06:50.324 [INFO] Downloading: https://repo.maven.apache.org/maven2/org/apache/flink/flink-streaming-java_2.10/1.3.0/flink-streaming-java_2.10-1.3.0-tests.jar
2017-09-08T18:06:50.335 [INFO] Downloaded: https://repo.maven.apache.org/maven2/com/google/http-client/google-http-client-jackson2/1.22.0/google-http-client-jackson2-1.22.0.jar
(7 KB at 3.5 KB/sec)
2017-09-08T18:06:50.335 [INFO] Downloading: https://repo.maven.apache.org/maven2/org/apache/flink/flink-test-utils_2.10/1.3.0/flink-test-utils_2.10-1.3.0.jar
2017-09-08T18:06:50.460 [INFO] Downloaded: https://repo.maven.apache.org/maven2/org/apache/flink/flink-streaming-java_2.10/1.3.0/flink-streaming-java_2.10-1.3.0.jar
(3128 KB at 1549.0 KB/sec)
2017-09-08T18:06:50.460 [INFO] Downloading: https://repo.maven.apache.org/maven2/org/apache/flink/flink-test-utils-junit/1.3.0/flink-test-utils-junit-1.3.0.jar
2017-09-08T18:06:50.490 [INFO] Downloaded: https://repo.maven.apache.org/maven2/org/apache/flink/flink-test-utils-junit/1.3.0/flink-test-utils-junit-1.3.0.jar
(26 KB at 12.4 KB/sec)
2017-09-08T18:06:50.490 [INFO] Downloading: https://repo.maven.apache.org/maven2/org/apache/curator/curator-test/2.12.0/curator-test-2.12.0.jar
2017-09-08T18:06:50.499 [INFO] Downloaded: https://repo.maven.apache.org/maven2/org/apache/flink/flink-streaming-java_2.10/1.3.0/flink-streaming-java_2.10-1.3.0-tests.jar
(1133 KB at 550.4 KB/sec)
2017-09-08T18:06:50.517 [INFO] Downloaded: https://repo.maven.apache.org/maven2/org/apache/flink/flink-runtime_2.10/1.3.0/flink-runtime_2.10-1.3.0-tests.jar
(2841 KB at 1368.3 KB/sec)
2017-09-08T18:06:50.664 [INFO] Downloaded: https://repo.maven.apache.org/maven2/org/apache/flink/flink-shaded-hadoop2/1.3.0/flink-shaded-hadoop2-1.3.0.jar
(16586 KB at 7460.8 KB/sec)
2017-09-08T18:06:50.696 [INFO] Downloaded: https://repo.maven.apache.org/maven2/org/apache/flink/flink-test-utils_2.10/1.3.0/flink-test-utils_2.10-1.3.0.jar
(2365 KB at 1048.5 KB/sec)
2017-09-08T18:06:50.778 [INFO] Downloaded: https://repo.maven.apache.org/maven2/org/apache/curator/curator-test/2.12.0/curator-test-2.12.0.jar
(2368 KB at 1013.1 KB/sec)
[JENKINS] Archiving disabled
[JENKINS] Archiving disabled
[JENKINS] Archiving disabled
[JENKINS] Archiving disabled
[JENKINS] Archiving disabled
[JENKINS] Archiving disabled
[JENKINS] Archiving disabled
[JENKINS] Archiving disabled
[JENKINS] Archiving disabled
[JENKINS] Archiving disabled
[JENKINS] Archiving disabled
[JENKINS] Archiving disabled
[JENKINS] Archiving disabled
2017-09-08T18:06:58.373 [INFO] ------------------------------------------------------------------------
2017-09-08T18:06:58.373 [INFO] Reactor Summary:
2017-09-08T18:06:58.373 [INFO] 
2017-09-08T18:06:58.373 [INFO] Apache Beam :: Parent .............................. SUCCESS
[ 38.040 s]
2017-09-08T18:06:58.373 [INFO] Apache Beam :: SDKs :: Java :: Build Tools ......... SUCCESS
[ 10.799 s]
2017-09-08T18:06:58.373 [INFO] Apache Beam :: SDKs ................................ SUCCESS
[  2.594 s]
2017-09-08T18:06:58.374 [INFO] Apache Beam :: SDKs :: Common ...................... SUCCESS
[  2.322 s]
2017-09-08T18:06:58.374 [INFO] Apache Beam :: SDKs :: Common :: Runner API ........ SUCCESS
[ 15.118 s]
2017-09-08T18:06:58.374 [INFO] Apache Beam :: SDKs :: Common :: Fn API ............ SUCCESS
[  8.016 s]
2017-09-08T18:06:58.374 [INFO] Apache Beam :: SDKs :: Java ........................ SUCCESS
[  2.823 s]
2017-09-08T18:06:58.374 [INFO] Apache Beam :: SDKs :: Java :: Core ................ SUCCESS
[01:27 min]
2017-09-08T18:06:58.374 [INFO] Apache Beam :: Runners ............................. SUCCESS
[  3.238 s]
2017-09-08T18:06:58.374 [INFO] Apache Beam :: Runners :: Core Construction Java ... SUCCESS
[ 14.476 s]
2017-09-08T18:06:58.374 [INFO] Apache Beam :: Runners :: Core Java ................ SUCCESS
[ 28.251 s]
2017-09-08T18:06:58.374 [INFO] Apache Beam :: Runners :: Flink .................... FAILURE
[  5.228 s]
2017-09-08T18:06:58.374 [INFO] ------------------------------------------------------------------------
2017-09-08T18:06:58.374 [INFO] BUILD FAILURE
2017-09-08T18:06:58.374 [INFO] ------------------------------------------------------------------------
2017-09-08T18:06:58.374 [INFO] Total time: 04:33 min
2017-09-08T18:06:58.374 [INFO] Finished at: 2017-09-08T18:06:58+00:00
2017-09-08T18:06:58.951 [INFO] Final Memory: 120M/1453M
2017-09-08T18:06:58.951 [INFO] ------------------------------------------------------------------------
2017-09-08T18:06:58.951 [WARNING] The requested profile "validates-runner-tests" could not
be activated because it does not exist.
Waiting for Jenkins to finish collecting data
2017-09-08T18:06:59.313 [ERROR] Failed to execute goal on project beam-runners-flink_2.10:
Could not resolve dependencies for project org.apache.beam:beam-runners-flink_2.10:jar:2.2.0-SNAPSHOT:
Could not transfer artifact org.apache.flink:flink-optimizer_2.10:jar:1.3.0 from/to central
(https://repo.maven.apache.org/maven2): GET request of: org/apache/flink/flink-optimizer_2.10/1.3.0/flink-optimizer_2.10-1.3.0.jar
from central failed: Connection reset -> [Help 1]
org.apache.maven.lifecycle.LifecycleExecutionException: Failed to execute goal on project
beam-runners-flink_2.10: Could not resolve dependencies for project org.apache.beam:beam-runners-flink_2.10:jar:2.2.0-SNAPSHOT:
Could not transfer artifact org.apache.flink:flink-optimizer_2.10:jar:1.3.0 from/to central
(https://repo.maven.apache.org/maven2): GET request of: org/apache/flink/flink-optimizer_2.10/1.3.0/flink-optimizer_2.10-1.3.0.jar
from central failed
	at org.apache.maven.lifecycle.internal.LifecycleDependencyResolver.getDependencies(LifecycleDependencyResolver.java:221)
	at org.apache.maven.lifecycle.internal.LifecycleDependencyResolver.resolveProjectDependencies(LifecycleDependencyResolver.java:127)
	at org.apache.maven.lifecycle.internal.MojoExecutor.ensureDependenciesAreResolved(MojoExecutor.java:257)
	at org.apache.maven.lifecycle.internal.MojoExecutor.execute(MojoExecutor.java:200)
	at org.apache.maven.lifecycle.internal.MojoExecutor.execute(MojoExecutor.java:153)
	at org.apache.maven.lifecycle.internal.MojoExecutor.execute(MojoExecutor.java:145)
	at org.apache.maven.lifecycle.internal.LifecycleModuleBuilder.buildProject(LifecycleModuleBuilder.java:116)
	at org.apache.maven.lifecycle.internal.LifecycleModuleBuilder.buildProject(LifecycleModuleBuilder.java:80)
	at org.apache.maven.lifecycle.internal.builder.singlethreaded.SingleThreadedBuilder.build(SingleThreadedBuilder.java:51)
	at org.apache.maven.lifecycle.internal.LifecycleStarter.execute(LifecycleStarter.java:128)
	at org.apache.maven.DefaultMaven.doExecute(DefaultMaven.java:307)
	at org.apache.maven.DefaultMaven.doExecute(DefaultMaven.java:193)
	at org.apache.maven.DefaultMaven.execute(DefaultMaven.java:106)
	at org.jvnet.hudson.maven3.launcher.Maven33Launcher.main(Maven33Launcher.java:129)
	at sun.reflect.NativeMethodAccessorImpl.invoke0(Native Method)
	at sun.reflect.NativeMethodAccessorImpl.invoke(NativeMethodAccessorImpl.java:62)
	at sun.reflect.DelegatingMethodAccessorImpl.invoke(DelegatingMethodAccessorImpl.java:43)
	at java.lang.reflect.Method.invoke(Method.java:498)
	at org.codehaus.plexus.classworlds.launcher.Launcher.launchStandard(Launcher.java:330)
	at org.codehaus.plexus.classworlds.launcher.Launcher.launch(Launcher.java:238)
	at jenkins.maven3.agent.Maven33Main.launch(Maven33Main.java:176)
	at sun.reflect.NativeMethodAccessorImpl.invoke0(Native Method)
	at sun.reflect.NativeMethodAccessorImpl.invoke(NativeMethodAccessorImpl.java:62)
	at sun.reflect.DelegatingMethodAccessorImpl.invoke(DelegatingMethodAccessorImpl.java:43)
	at java.lang.reflect.Method.invoke(Method.java:498)
	at hudson.maven.Maven3Builder.call(Maven3Builder.java:139)
	at hudson.maven.Maven3Builder.call(Maven3Builder.java:70)
	at hudson.remoting.UserRequest.perform(UserRequest.java:153)
	at hudson.remoting.UserRequest.perform(UserRequest.java:50)
	at hudson.remoting.Request$2.run(Request.java:336)
	at hudson.remoting.InterceptingExecutorService$1.call(InterceptingExecutorService.java:68)
	at java.util.concurrent.FutureTask.run(FutureTask.java:266)
	at java.util.concurrent.ThreadPoolExecutor.runWorker(ThreadPoolExecutor.java:1149)
	at java.util.concurrent.ThreadPoolExecutor$Worker.run(ThreadPoolExecutor.java:624)
	at java.lang.Thread.run(Thread.java:748)
Caused by: org.apache.maven.project.DependencyResolutionException: Could not resolve dependencies
for project org.apache.beam:beam-runners-flink_2.10:jar:2.2.0-SNAPSHOT: Could not transfer
artifact org.apache.flink:flink-optimizer_2.10:jar:1.3.0 from/to central (https://repo.maven.apache.org/maven2):
GET request of: org/apache/flink/flink-optimizer_2.10/1.3.0/flink-optimizer_2.10-1.3.0.jar
from central failed
	at org.apache.maven.project.DefaultProjectDependenciesResolver.resolve(DefaultProjectDependenciesResolver.java:211)
	at org.apache.maven.lifecycle.internal.LifecycleDependencyResolver.getDependencies(LifecycleDependencyResolver.java:195)
	... 34 more
Caused by: org.eclipse.aether.resolution.DependencyResolutionException: Could not transfer
artifact org.apache.flink:flink-optimizer_2.10:jar:1.3.0 from/to central (https://repo.maven.apache.org/maven2):
GET request of: org/apache/flink/flink-optimizer_2.10/1.3.0/flink-optimizer_2.10-1.3.0.jar
from central failed
	at org.eclipse.aether.internal.impl.DefaultRepositorySystem.resolveDependencies(DefaultRepositorySystem.java:384)
	at org.apache.maven.project.DefaultProjectDependenciesResolver.resolve(DefaultProjectDependenciesResolver.java:205)
	... 35 more
Caused by: org.eclipse.aether.resolution.ArtifactResolutionException: Could not transfer artifact
org.apache.flink:flink-optimizer_2.10:jar:1.3.0 from/to central (https://repo.maven.apache.org/maven2):
GET request of: org/apache/flink/flink-optimizer_2.10/1.3.0/flink-optimizer_2.10-1.3.0.jar
from central failed
	at org.eclipse.aether.internal.impl.DefaultArtifactResolver.resolve(DefaultArtifactResolver.java:444)
	at org.eclipse.aether.internal.impl.DefaultArtifactResolver.resolveArtifacts(DefaultArtifactResolver.java:246)
	at org.eclipse.aether.internal.impl.DefaultRepositorySystem.resolveDependencies(DefaultRepositorySystem.java:367)
	... 36 more
Caused by: org.eclipse.aether.transfer.ArtifactTransferException: Could not transfer artifact
org.apache.flink:flink-optimizer_2.10:jar:1.3.0 from/to central (https://repo.maven.apache.org/maven2):
GET request of: org/apache/flink/flink-optimizer_2.10/1.3.0/flink-optimizer_2.10-1.3.0.jar
from central failed
	at org.eclipse.aether.connector.basic.ArtifactTransportListener.transferFailed(ArtifactTransportListener.java:43)
	at org.eclipse.aether.connector.basic.BasicRepositoryConnector$TaskRunner.run(BasicRepositoryConnector.java:355)
	at org.eclipse.aether.util.concurrency.RunnableErrorForwarder$1.run(RunnableErrorForwarder.java:67)
	... 3 more
Caused by: org.apache.maven.wagon.TransferFailedException: GET request of: org/apache/flink/flink-optimizer_2.10/1.3.0/flink-optimizer_2.10-1.3.0.jar
from central failed
	at org.apache.maven.wagon.AbstractWagon.getTransfer(AbstractWagon.java:363)
	at org.apache.maven.wagon.AbstractWagon.getTransfer(AbstractWagon.java:316)
	at org.apache.maven.wagon.AbstractWagon.getTransfer(AbstractWagon.java:285)
	at org.apache.maven.wagon.StreamWagon.getIfNewer(StreamWagon.java:97)
	at org.apache.maven.wagon.StreamWagon.get(StreamWagon.java:61)
	at org.eclipse.aether.transport.wagon.WagonTransporter$GetTaskRunner.run(WagonTransporter.java:560)
	at org.eclipse.aether.transport.wagon.WagonTransporter.execute(WagonTransporter.java:427)
	at org.eclipse.aether.transport.wagon.WagonTransporter.get(WagonTransporter.java:404)
	at org.eclipse.aether.connector.basic.BasicRepositoryConnector$GetTaskRunner.runTask(BasicRepositoryConnector.java:447)
	at org.eclipse.aether.connector.basic.BasicRepositoryConnector$TaskRunner.run(BasicRepositoryConnector.java:350)
	... 4 more
Caused by: java.net.SocketException: Connection reset
	at java.net.SocketInputStream.read(SocketInputStream.java:210)
	at java.net.SocketInputStream.read(SocketInputStream.java:141)
	at sun.security.ssl.InputRecord.readFully(InputRecord.java:465)
	at sun.security.ssl.InputRecord.readV3Record(InputRecord.java:593)
	at sun.security.ssl.InputRecord.read(InputRecord.java:532)
	at sun.security.ssl.SSLSocketImpl.readRecord(SSLSocketImpl.java:983)
	at sun.security.ssl.SSLSocketImpl.readDataRecord(SSLSocketImpl.java:940)
	at sun.security.ssl.AppInputStream.read(AppInputStream.java:105)
	at org.apache.maven.wagon.providers.http.httpclient.impl.io.SessionInputBufferImpl.streamRead(SessionInputBufferImpl.java:136)
	at org.apache.maven.wagon.providers.http.httpclient.impl.io.SessionInputBufferImpl.read(SessionInputBufferImpl.java:195)
	at org.apache.maven.wagon.providers.http.httpclient.impl.io.ContentLengthInputStream.read(ContentLengthInputStream.java:178)
	at org.apache.maven.wagon.providers.http.httpclient.conn.EofSensorInputStream.read(EofSensorInputStream.java:137)
	at org.apache.maven.wagon.AbstractWagon.transfer(AbstractWagon.java:531)
	at org.apache.maven.wagon.AbstractWagon.getTransfer(AbstractWagon.java:353)
	... 13 more
2017-09-08T18:06:59.316 [ERROR] 
2017-09-08T18:06:59.316 [ERROR] Re-run Maven using the -X switch to enable full debug logging.
2017-09-08T18:06:59.316 [ERROR] 
2017-09-08T18:06:59.316 [ERROR] For more information about the errors and possible solutions,
please read the following articles:
2017-09-08T18:06:59.316 [ERROR] [Help 1] http://cwiki.apache.org/confluence/display/MAVEN/DependencyResolutionException
2017-09-08T18:06:59.316 [ERROR] 
2017-09-08T18:06:59.316 [ERROR] After correcting the problems, you can resume the build with
the command
2017-09-08T18:06:59.316 [ERROR]   mvn <goals> -rf :beam-runners-flink_2.10
channel stopped

Mime
View raw message