beam-commits mailing list archives

Site index · List index
Message view « Date » · « Thread »
Top « Date » · « Thread »
From Apache Jenkins Server <jenk...@builds.apache.org>
Subject Build failed in Jenkins: beam_PostCommit_Java_MavenInstall #4819
Date Tue, 19 Sep 2017 07:19:43 GMT
See <https://builds.apache.org/job/beam_PostCommit_Java_MavenInstall/4819/display/redirect>

------------------------------------------
[...truncated 3.63 MB...]
    from apitools.base.protorpclite import messages
  File "<https://builds.apache.org/job/beam_PostCommit_Java_MavenInstall/ws/sdks/python/target/.tox/py27gcp/local/lib/python2.7/site-packages/apitools/base/protorpclite/messages.py",>
line 1165, in <module>
    class Field(six.with_metaclass(_FieldMeta, object)):
TypeError: Error when calling the metaclass bases
    metaclass conflict: the metaclass of a derived class must be a (non-strict) subclass of
the metaclasses of all its bases
ERROR: InvocationError: '<https://builds.apache.org/job/beam_PostCommit_Java_MavenInstall/ws/sdks/python/target/.tox/py27gcp/bin/python>
apache_beam/examples/complete/autocomplete_test.py'
___________________________________ summary ____________________________________
ERROR:   docs: commands failed
  lint: commands succeeded
  py27: commands succeeded
  py27cython: commands succeeded
ERROR:   py27gcp: commands failed
2017-09-19T07:18:38.271 [ERROR] Command execution failed.
org.apache.commons.exec.ExecuteException: Process exited with an error: 1 (Exit value: 1)
	at org.apache.commons.exec.DefaultExecutor.executeInternal(DefaultExecutor.java:404)
	at org.apache.commons.exec.DefaultExecutor.execute(DefaultExecutor.java:166)
	at org.codehaus.mojo.exec.ExecMojo.executeCommandLine(ExecMojo.java:764)
	at org.codehaus.mojo.exec.ExecMojo.executeCommandLine(ExecMojo.java:711)
	at org.codehaus.mojo.exec.ExecMojo.execute(ExecMojo.java:289)
	at org.apache.maven.plugin.DefaultBuildPluginManager.executeMojo(DefaultBuildPluginManager.java:134)
	at org.apache.maven.lifecycle.internal.MojoExecutor.execute(MojoExecutor.java:208)
	at org.apache.maven.lifecycle.internal.MojoExecutor.execute(MojoExecutor.java:153)
	at org.apache.maven.lifecycle.internal.MojoExecutor.execute(MojoExecutor.java:145)
	at org.apache.maven.lifecycle.internal.LifecycleModuleBuilder.buildProject(LifecycleModuleBuilder.java:116)
	at org.apache.maven.lifecycle.internal.LifecycleModuleBuilder.buildProject(LifecycleModuleBuilder.java:80)
	at org.apache.maven.lifecycle.internal.builder.singlethreaded.SingleThreadedBuilder.build(SingleThreadedBuilder.java:51)
	at org.apache.maven.lifecycle.internal.LifecycleStarter.execute(LifecycleStarter.java:128)
	at org.apache.maven.DefaultMaven.doExecute(DefaultMaven.java:307)
	at org.apache.maven.DefaultMaven.doExecute(DefaultMaven.java:193)
	at org.apache.maven.DefaultMaven.execute(DefaultMaven.java:106)
	at org.jvnet.hudson.maven3.launcher.Maven33Launcher.main(Maven33Launcher.java:129)
	at sun.reflect.NativeMethodAccessorImpl.invoke0(Native Method)
	at sun.reflect.NativeMethodAccessorImpl.invoke(NativeMethodAccessorImpl.java:62)
	at sun.reflect.DelegatingMethodAccessorImpl.invoke(DelegatingMethodAccessorImpl.java:43)
	at java.lang.reflect.Method.invoke(Method.java:498)
	at org.codehaus.plexus.classworlds.launcher.Launcher.launchStandard(Launcher.java:330)
	at org.codehaus.plexus.classworlds.launcher.Launcher.launch(Launcher.java:238)
	at jenkins.maven3.agent.Maven33Main.launch(Maven33Main.java:176)
	at sun.reflect.NativeMethodAccessorImpl.invoke0(Native Method)
	at sun.reflect.NativeMethodAccessorImpl.invoke(NativeMethodAccessorImpl.java:62)
	at sun.reflect.DelegatingMethodAccessorImpl.invoke(DelegatingMethodAccessorImpl.java:43)
	at java.lang.reflect.Method.invoke(Method.java:498)
	at hudson.maven.Maven3Builder.call(Maven3Builder.java:139)
	at hudson.maven.Maven3Builder.call(Maven3Builder.java:70)
	at hudson.remoting.UserRequest.perform(UserRequest.java:153)
	at hudson.remoting.UserRequest.perform(UserRequest.java:50)
	at hudson.remoting.Request$2.run(Request.java:336)
	at hudson.remoting.InterceptingExecutorService$1.call(InterceptingExecutorService.java:68)
	at java.util.concurrent.FutureTask.run(FutureTask.java:266)
	at java.util.concurrent.ThreadPoolExecutor.runWorker(ThreadPoolExecutor.java:1149)
	at java.util.concurrent.ThreadPoolExecutor$Worker.run(ThreadPoolExecutor.java:624)
	at java.lang.Thread.run(Thread.java:748)
[JENKINS] Archiving disabled
2017-09-19T07:18:39.185 [INFO]                                                           
             
2017-09-19T07:18:39.185 [INFO] ------------------------------------------------------------------------
2017-09-19T07:18:39.185 [INFO] Skipping Apache Beam :: Parent
2017-09-19T07:18:39.185 [INFO] This project has been banned from the build due to previous
failures.
2017-09-19T07:18:39.185 [INFO] ------------------------------------------------------------------------
[JENKINS] Archiving disabled
[JENKINS] Archiving disabled
[JENKINS] Archiving disabled
[JENKINS] Archiving disabled
[JENKINS] Archiving disabled
[JENKINS] Archiving disabled
[JENKINS] Archiving disabled
[JENKINS] Archiving disabled
[JENKINS] Archiving disabled
[JENKINS] Archiving disabled
[JENKINS] Archiving disabled
[JENKINS] Archiving disabled
[JENKINS] Archiving disabled
[JENKINS] Archiving disabled
[JENKINS] Archiving disabled
[JENKINS] Archiving disabled
[JENKINS] Archiving disabled
[JENKINS] Archiving disabled
[JENKINS] Archiving disabled
[JENKINS] Archiving disabled
[JENKINS] Archiving disabled
[JENKINS] Archiving disabled
[JENKINS] Archiving disabled
[JENKINS] Archiving disabled
[JENKINS] Archiving disabled
[JENKINS] Archiving disabled
[JENKINS] Archiving disabled
[JENKINS] Archiving disabled
[JENKINS] Archiving disabled
[JENKINS] Archiving disabled
[JENKINS] Archiving disabled
[JENKINS] Archiving disabled
[JENKINS] Archiving disabled
[JENKINS] Archiving disabled
[JENKINS] Archiving disabled
[JENKINS] Archiving disabled
[JENKINS] Archiving disabled
[JENKINS] Archiving disabled
[JENKINS] Archiving disabled
[JENKINS] Archiving disabled
[JENKINS] Archiving disabled
[JENKINS] Archiving disabled
[JENKINS] Archiving disabled
[JENKINS] Archiving disabled
[JENKINS] Archiving disabled
[JENKINS] Archiving disabled
[JENKINS] Archiving disabled
[JENKINS] Archiving disabled
[JENKINS] Archiving disabled
[JENKINS] Archiving disabled
[JENKINS] Archiving disabled
[JENKINS] Archiving disabled
[JENKINS] Archiving disabled
[JENKINS] Archiving disabled
[JENKINS] Archiving disabled
[JENKINS] Archiving disabled
[JENKINS] Archiving disabled
[JENKINS] Archiving disabled
[JENKINS] Archiving disabled
[JENKINS] Archiving disabled
[JENKINS] Archiving disabled
[JENKINS] Archiving disabled
2017-09-19T07:19:33.057 [INFO] ------------------------------------------------------------------------
2017-09-19T07:19:33.057 [INFO] Reactor Summary:
2017-09-19T07:19:33.057 [INFO] 
2017-09-19T07:19:33.057 [INFO] Apache Beam :: Parent .............................. SUCCESS
[ 31.127 s]
2017-09-19T07:19:33.057 [INFO] Apache Beam :: SDKs :: Java :: Build Tools ......... SUCCESS
[ 11.662 s]
2017-09-19T07:19:33.057 [INFO] Apache Beam :: SDKs ................................ SUCCESS
[  5.542 s]
2017-09-19T07:19:33.057 [INFO] Apache Beam :: SDKs :: Common ...................... SUCCESS
[  2.926 s]
2017-09-19T07:19:33.057 [INFO] Apache Beam :: SDKs :: Common :: Runner API ........ SUCCESS
[ 40.460 s]
2017-09-19T07:19:33.057 [INFO] Apache Beam :: SDKs :: Common :: Fn API ............ SUCCESS
[ 21.014 s]
2017-09-19T07:19:33.057 [INFO] Apache Beam :: SDKs :: Java ........................ SUCCESS
[  3.569 s]
2017-09-19T07:19:33.057 [INFO] Apache Beam :: SDKs :: Java :: Core ................ SUCCESS
[03:26 min]
2017-09-19T07:19:33.057 [INFO] Apache Beam :: Runners ............................. SUCCESS
[  2.961 s]
2017-09-19T07:19:33.057 [INFO] Apache Beam :: Runners :: Core Construction Java ... SUCCESS
[ 39.504 s]
2017-09-19T07:19:33.057 [INFO] Apache Beam :: Runners :: Core Java ................ SUCCESS
[01:00 min]
2017-09-19T07:19:33.057 [INFO] Apache Beam :: Runners :: Direct Java .............. SUCCESS
[04:27 min]
2017-09-19T07:19:33.057 [INFO] Apache Beam :: SDKs :: Java :: IO .................. SUCCESS
[  3.388 s]
2017-09-19T07:19:33.057 [INFO] Apache Beam :: SDKs :: Java :: IO :: AMQP .......... SUCCESS
[ 40.432 s]
2017-09-19T07:19:33.057 [INFO] Apache Beam :: SDKs :: Java :: IO :: Common ........ SUCCESS
[  6.939 s]
2017-09-19T07:19:33.057 [INFO] Apache Beam :: SDKs :: Java :: IO :: Cassandra ..... SUCCESS
[ 33.420 s]
2017-09-19T07:19:33.057 [INFO] Apache Beam :: SDKs :: Java :: IO :: Elasticsearch . SUCCESS
[ 18.182 s]
2017-09-19T07:19:33.057 [INFO] Apache Beam :: SDKs :: Java :: IO :: Elasticsearch-Tests SUCCESS
[  4.147 s]
2017-09-19T07:19:33.057 [INFO] Apache Beam :: SDKs :: Java :: IO :: Elasticsearch-Tests ::
Common SUCCESS [  5.229 s]
2017-09-19T07:19:33.058 [INFO] Apache Beam :: SDKs :: Java :: IO :: Elasticsearch-Tests ::
2.x SUCCESS [ 26.985 s]
2017-09-19T07:19:33.058 [INFO] Apache Beam :: SDKs :: Java :: IO :: Elasticsearch-Tests ::
5.x SUCCESS [ 42.127 s]
2017-09-19T07:19:33.058 [INFO] Apache Beam :: SDKs :: Java :: Extensions .......... SUCCESS
[  2.888 s]
2017-09-19T07:19:33.058 [INFO] Apache Beam :: SDKs :: Java :: Extensions :: Google Cloud Platform
Core SUCCESS [ 32.821 s]
2017-09-19T07:19:33.058 [INFO] Apache Beam :: SDKs :: Java :: Extensions :: Protobuf SUCCESS
[ 24.875 s]
2017-09-19T07:19:33.058 [INFO] Apache Beam :: SDKs :: Java :: IO :: Google Cloud Platform
SUCCESS [01:39 min]
2017-09-19T07:19:33.058 [INFO] Apache Beam :: SDKs :: Java :: IO :: Hadoop Common . SUCCESS
[ 24.254 s]
2017-09-19T07:19:33.058 [INFO] Apache Beam :: SDKs :: Java :: IO :: Hadoop File System SUCCESS
[ 52.959 s]
2017-09-19T07:19:33.058 [INFO] Apache Beam :: SDKs :: Java :: IO :: Hadoop ........ SUCCESS
[  5.240 s]
2017-09-19T07:19:33.058 [INFO] Apache Beam :: SDKs :: Java :: IO :: Hadoop :: input-format
SUCCESS [ 25.811 s]
2017-09-19T07:19:33.058 [INFO] Apache Beam :: Runners :: Google Cloud Dataflow .... SUCCESS
[08:10 min]
2017-09-19T07:19:33.058 [INFO] Apache Beam :: SDKs :: Java :: IO :: Hadoop :: jdk1.8-tests
SUCCESS [01:36 min]
2017-09-19T07:19:33.058 [INFO] Apache Beam :: SDKs :: Java :: IO :: HBase ......... SUCCESS
[01:45 min]
2017-09-19T07:19:33.058 [INFO] Apache Beam :: SDKs :: Java :: IO :: HCatalog ...... SUCCESS
[01:13 min]
2017-09-19T07:19:33.058 [INFO] Apache Beam :: SDKs :: Java :: IO :: JDBC .......... SUCCESS
[ 43.498 s]
2017-09-19T07:19:33.058 [INFO] Apache Beam :: SDKs :: Java :: IO :: JMS ........... SUCCESS
[ 26.074 s]
2017-09-19T07:19:33.058 [INFO] Apache Beam :: SDKs :: Java :: IO :: Kafka ......... SUCCESS
[ 43.780 s]
2017-09-19T07:19:33.058 [INFO] Apache Beam :: SDKs :: Java :: IO :: Kinesis ....... SUCCESS
[ 29.253 s]
2017-09-19T07:19:33.058 [INFO] Apache Beam :: SDKs :: Java :: IO :: MongoDB ....... SUCCESS
[ 44.139 s]
2017-09-19T07:19:33.058 [INFO] Apache Beam :: SDKs :: Java :: IO :: MQTT .......... SUCCESS
[ 25.524 s]
2017-09-19T07:19:33.058 [INFO] Apache Beam :: SDKs :: Java :: IO :: Solr .......... SUCCESS
[ 46.329 s]
2017-09-19T07:19:33.058 [INFO] Apache Beam :: SDKs :: Java :: IO :: Tika .......... SUCCESS
[ 34.312 s]
2017-09-19T07:19:33.058 [INFO] Apache Beam :: SDKs :: Java :: IO :: XML ........... SUCCESS
[ 31.098 s]
2017-09-19T07:19:33.058 [INFO] Apache Beam :: SDKs :: Java :: Maven Archetypes .... SUCCESS
[  2.476 s]
2017-09-19T07:19:33.058 [INFO] Apache Beam :: SDKs :: Java :: Maven Archetypes :: Starter
SUCCESS [ 15.836 s]
2017-09-19T07:19:33.058 [INFO] Apache Beam :: Examples ............................ SUCCESS
[  2.881 s]
2017-09-19T07:19:33.058 [INFO] Apache Beam :: Examples :: Java .................... SUCCESS
[07:16 min]
2017-09-19T07:19:33.058 [INFO] Apache Beam :: SDKs :: Java :: Maven Archetypes :: Examples
SUCCESS [ 50.467 s]
2017-09-19T07:19:33.058 [INFO] Apache Beam :: Examples :: Java 8 .................. SUCCESS
[ 37.246 s]
2017-09-19T07:19:33.058 [INFO] Apache Beam :: SDKs :: Java :: Maven Archetypes :: Examples
- Java 8 SUCCESS [ 44.442 s]
2017-09-19T07:19:33.058 [INFO] Apache Beam :: SDKs :: Java :: Extensions :: Jackson SUCCESS
[ 20.018 s]
2017-09-19T07:19:33.058 [INFO] Apache Beam :: SDKs :: Java :: Extensions :: Join library SUCCESS
[ 18.600 s]
2017-09-19T07:19:33.058 [INFO] Apache Beam :: SDKs :: Java :: Extensions :: Sorter  SUCCESS
[ 49.361 s]
2017-09-19T07:19:33.058 [INFO] Apache Beam :: SDKs :: Java :: Extensions :: SQL ... SUCCESS
[01:08 min]
2017-09-19T07:19:33.058 [INFO] Apache Beam :: SDKs :: Java :: Nexmark ............. SUCCESS
[01:23 min]
2017-09-19T07:19:33.058 [INFO] Apache Beam :: SDKs :: Java :: Harness ............. SUCCESS
[ 49.244 s]
2017-09-19T07:19:33.058 [INFO] Apache Beam :: SDKs :: Java :: Java 8 Tests ........ SUCCESS
[ 17.891 s]
2017-09-19T07:19:33.058 [INFO] Apache Beam :: SDKs :: Python ...................... FAILURE
[23:47 min]
2017-09-19T07:19:33.059 [INFO] Apache Beam :: Runners :: Flink .................... SKIPPED
2017-09-19T07:19:33.059 [INFO] Apache Beam :: Runners :: Spark .................... SKIPPED
2017-09-19T07:19:33.059 [INFO] Apache Beam :: Runners :: Apex ..................... SKIPPED
2017-09-19T07:19:33.059 [INFO] Apache Beam :: Runners :: Gearpump ................. SKIPPED
2017-09-19T07:19:33.059 [INFO] Apache Beam :: SDKs :: Java :: Aggregated Javadoc .. SKIPPED
2017-09-19T07:19:33.059 [INFO] ------------------------------------------------------------------------
2017-09-19T07:19:33.059 [INFO] BUILD FAILURE
2017-09-19T07:19:33.059 [INFO] ------------------------------------------------------------------------
2017-09-19T07:19:33.059 [INFO] Total time: 01:18 h
2017-09-19T07:19:33.059 [INFO] Finished at: 2017-09-19T07:19:33+00:00
2017-09-19T07:19:33.874 [INFO] Final Memory: 311M/1768M
2017-09-19T07:19:33.874 [INFO] ------------------------------------------------------------------------
2017-09-19T07:19:33.881 [ERROR] Failed to execute goal org.codehaus.mojo:exec-maven-plugin:1.5.0:exec
(setuptools-test) on project beam-sdks-python: Command execution failed. Process exited with
an error: 1 (Exit value: 1) -> [Help 1]
org.apache.maven.lifecycle.LifecycleExecutionException: Failed to execute goal org.codehaus.mojo:exec-maven-plugin:1.5.0:exec
(setuptools-test) on project beam-sdks-python: Command execution failed.
	at org.apache.maven.lifecycle.internal.MojoExecutor.execute(MojoExecutor.java:216)
	at org.apache.maven.lifecycle.internal.MojoExecutor.execute(MojoExecutor.java:153)
	at org.apache.maven.lifecycle.internal.MojoExecutor.execute(MojoExecutor.java:145)
	at org.apache.maven.lifecycle.internal.LifecycleModuleBuilder.buildProject(LifecycleModuleBuilder.java:116)
	at org.apache.maven.lifecycle.internal.LifecycleModuleBuilder.buildProject(LifecycleModuleBuilder.java:80)
	at org.apache.maven.lifecycle.internal.builder.singlethreaded.SingleThreadedBuilder.build(SingleThreadedBuilder.java:51)
	at org.apache.maven.lifecycle.internal.LifecycleStarter.execute(LifecycleStarter.java:128)
	at org.apache.maven.DefaultMaven.doExecute(DefaultMaven.java:307)
	at org.apache.maven.DefaultMaven.doExecute(DefaultMaven.java:193)
	at org.apache.maven.DefaultMaven.execute(DefaultMaven.java:106)
	at org.jvnet.hudson.maven3.launcher.Maven33Launcher.main(Maven33Launcher.java:129)
	at sun.reflect.NativeMethodAccessorImpl.invoke0(Native Method)
	at sun.reflect.NativeMethodAccessorImpl.invoke(NativeMethodAccessorImpl.java:62)
	at sun.reflect.DelegatingMethodAccessorImpl.invoke(DelegatingMethodAccessorImpl.java:43)
	at java.lang.reflect.Method.invoke(Method.java:498)
	at org.codehaus.plexus.classworlds.launcher.Launcher.launchStandard(Launcher.java:330)
	at org.codehaus.plexus.classworlds.launcher.Launcher.launch(Launcher.java:238)
	at jenkins.maven3.agent.Maven33Main.launch(Maven33Main.java:176)
	at sun.reflect.NativeMethodAccessorImpl.invoke0(Native Method)
	at sun.reflect.NativeMethodAccessorImpl.invoke(NativeMethodAccessorImpl.java:62)
	at sun.reflect.DelegatingMethodAccessorImpl.invoke(DelegatingMethodAccessorImpl.java:43)
	at java.lang.reflect.Method.invoke(Method.java:498)
	at hudson.maven.Maven3Builder.call(Maven3Builder.java:139)
	at hudson.maven.Maven3Builder.call(Maven3Builder.java:70)
	at hudson.remoting.UserRequest.perform(UserRequest.java:153)
	at hudson.remoting.UserRequest.perform(UserRequest.java:50)
	at hudson.remoting.Request$2.run(Request.java:336)
	at hudson.remoting.InterceptingExecutorService$1.call(InterceptingExecutorService.java:68)
	at java.util.concurrent.FutureTask.run(FutureTask.java:266)
	at java.util.concurrent.ThreadPoolExecutor.runWorker(ThreadPoolExecutor.java:1149)
	at java.util.concurrent.ThreadPoolExecutor$Worker.run(ThreadPoolExecutor.java:624)
	at java.lang.Thread.run(Thread.java:748)
Caused by: org.apache.maven.plugin.MojoExecutionException: Command execution failed.
	at org.codehaus.mojo.exec.ExecMojo.execute(ExecMojo.java:302)
	at org.apache.maven.plugin.DefaultBuildPluginManager.executeMojo(DefaultBuildPluginManager.java:134)
	at org.apache.maven.lifecycle.internal.MojoExecutor.execute(MojoExecutor.java:208)
	... 31 more
Caused by: org.apache.commons.exec.ExecuteException: Process exited with an error: 1 (Exit
value: 1)
	at org.apache.commons.exec.DefaultExecutor.executeInternal(DefaultExecutor.java:404)
	at org.apache.commons.exec.DefaultExecutor.execute(DefaultExecutor.java:166)
	at org.codehaus.mojo.exec.ExecMojo.executeCommandLine(ExecMojo.java:764)
	at org.codehaus.mojo.exec.ExecMojo.executeCommandLine(ExecMojo.java:711)
	at org.codehaus.mojo.exec.ExecMojo.execute(ExecMojo.java:289)
	... 33 more
2017-09-19T07:19:33.882 [ERROR] 
2017-09-19T07:19:33.882 [ERROR] Re-run Maven using the -X switch to enable full debug logging.
2017-09-19T07:19:33.882 [ERROR] 
2017-09-19T07:19:33.882 [ERROR] For more information about the errors and possible solutions,
please read the following articles:
2017-09-19T07:19:33.882 [ERROR] [Help 1] http://cwiki.apache.org/confluence/display/MAVEN/MojoExecutionException
2017-09-19T07:19:33.882 [ERROR] 
2017-09-19T07:19:33.882 [ERROR] After correcting the problems, you can resume the build with
the command
2017-09-19T07:19:33.882 [ERROR]   mvn <goals> -rf :beam-sdks-python
channel stopped
Not sending mail to unregistered user echauchot@gmail.com+jbonofre@apache.org
Not sending mail to unregistered user kirpichov@google.com

Mime
View raw message