beam-commits mailing list archives

Site index · List index
Message view « Date » · « Thread »
Top « Date » · « Thread »
From Apache Jenkins Server <jenk...@builds.apache.org>
Subject Build failed in Jenkins: beam_PostCommit_Java_MavenInstall #4798
Date Fri, 15 Sep 2017 12:03:06 GMT
See <https://builds.apache.org/job/beam_PostCommit_Java_MavenInstall/4798/display/redirect>

------------------------------------------
[...truncated 356.58 KB...]
2017-09-15T12:02:29.964 [INFO] --- maven-enforcer-plugin:3.0.0-M1:enforce (enforce) @ beam-sdks-common-runner-api
---
2017-09-15T12:02:30.331 [INFO] 
2017-09-15T12:02:30.331 [INFO] --- maven-enforcer-plugin:3.0.0-M1:enforce (enforce-banned-dependencies)
@ beam-sdks-common-runner-api ---
2017-09-15T12:02:30.443 [INFO] 
2017-09-15T12:02:30.443 [INFO] --- protobuf-maven-plugin:0.5.0:compile (default) @ beam-sdks-common-runner-api
---
2017-09-15T12:02:30.446 [INFO] Downloading: https://repo.maven.apache.org/maven2/com/google/guava/guava/18.0/guava-18.0.pom
2017-09-15T12:02:30.472 [INFO] Downloaded: https://repo.maven.apache.org/maven2/com/google/guava/guava/18.0/guava-18.0.pom
(6 KB at 212.8 KB/sec)
2017-09-15T12:02:30.474 [INFO] Downloading: https://repo.maven.apache.org/maven2/com/google/guava/guava-parent/18.0/guava-parent-18.0.pom
2017-09-15T12:02:30.499 [INFO] Downloaded: https://repo.maven.apache.org/maven2/com/google/guava/guava-parent/18.0/guava-parent-18.0.pom
(8 KB at 300.2 KB/sec)
2017-09-15T12:02:30.502 [INFO] Downloading: https://repo.maven.apache.org/maven2/org/apache/maven/plugin-tools/maven-plugin-annotations/3.4/maven-plugin-annotations-3.4.pom
2017-09-15T12:02:30.528 [INFO] Downloaded: https://repo.maven.apache.org/maven2/org/apache/maven/plugin-tools/maven-plugin-annotations/3.4/maven-plugin-annotations-3.4.pom
(2 KB at 61.2 KB/sec)
2017-09-15T12:02:30.534 [INFO] Downloading: https://repo.maven.apache.org/maven2/com/google/guava/guava/18.0/guava-18.0.jar
2017-09-15T12:02:30.535 [INFO] Downloading: https://repo.maven.apache.org/maven2/org/apache/maven/plugin-tools/maven-plugin-annotations/3.4/maven-plugin-annotations-3.4.jar
2017-09-15T12:02:30.562 [INFO] Downloaded: https://repo.maven.apache.org/maven2/org/apache/maven/plugin-tools/maven-plugin-annotations/3.4/maven-plugin-annotations-3.4.jar
(14 KB at 515.3 KB/sec)
[WARNING] Failed to getClass for org.xolstice.maven.plugin.protobuf.ProtocCompileMojo
[JENKINS] Archiving disabled
2017-09-15T12:02:31.536 [INFO]                                                           
             
2017-09-15T12:02:31.536 [INFO] ------------------------------------------------------------------------
2017-09-15T12:02:31.536 [INFO] Skipping Apache Beam :: Parent
2017-09-15T12:02:31.536 [INFO] This project has been banned from the build due to previous
failures.
2017-09-15T12:02:31.536 [INFO] ------------------------------------------------------------------------
[JENKINS] Archiving disabled
[JENKINS] Archiving disabled
[JENKINS] Archiving disabled
[JENKINS] Archiving disabled
[JENKINS] Archiving disabled
[JENKINS] Archiving disabled
[JENKINS] Archiving disabled
[JENKINS] Archiving disabled
[JENKINS] Archiving disabled
[JENKINS] Archiving disabled
[JENKINS] Archiving disabled
[JENKINS] Archiving disabled
[JENKINS] Archiving disabled
[JENKINS] Archiving disabled
[JENKINS] Archiving disabled
[JENKINS] Archiving disabled
[JENKINS] Archiving disabled
[JENKINS] Archiving disabled
[JENKINS] Archiving disabled
[JENKINS] Archiving disabled
[JENKINS] Archiving disabled
[JENKINS] Archiving disabled
[JENKINS] Archiving disabled
[JENKINS] Archiving disabled
[JENKINS] Archiving disabled
[JENKINS] Archiving disabled
[JENKINS] Archiving disabled
[JENKINS] Archiving disabled
[JENKINS] Archiving disabled
[JENKINS] Archiving disabled
[JENKINS] Archiving disabled
[JENKINS] Archiving disabled
[JENKINS] Archiving disabled
[JENKINS] Archiving disabled
[JENKINS] Archiving disabled
[JENKINS] Archiving disabled
[JENKINS] Archiving disabled
[JENKINS] Archiving disabled
[JENKINS] Archiving disabled
[JENKINS] Archiving disabled
[JENKINS] Archiving disabled
[JENKINS] Archiving disabled
[JENKINS] Archiving disabled
[JENKINS] Archiving disabled
[JENKINS] Archiving disabled
[JENKINS] Archiving disabled
[JENKINS] Archiving disabled
[JENKINS] Archiving disabled
[JENKINS] Archiving disabled
[JENKINS] Archiving disabled
[JENKINS] Archiving disabled
[JENKINS] Archiving disabled
[JENKINS] Archiving disabled
[JENKINS] Archiving disabled
[JENKINS] Archiving disabled
[JENKINS] Archiving disabled
[JENKINS] Archiving disabled
[JENKINS] Archiving disabled
[JENKINS] Archiving disabled
[JENKINS] Archiving disabled
[JENKINS] Archiving disabled
[JENKINS] Archiving disabled
2017-09-15T12:02:54.466 [INFO] ------------------------------------------------------------------------
2017-09-15T12:02:54.466 [INFO] Reactor Summary:
2017-09-15T12:02:54.466 [INFO] 
2017-09-15T12:02:54.466 [INFO] Apache Beam :: Parent .............................. SUCCESS
[ 26.979 s]
2017-09-15T12:02:54.466 [INFO] Apache Beam :: SDKs :: Java :: Build Tools ......... SUCCESS
[ 11.459 s]
2017-09-15T12:02:54.466 [INFO] Apache Beam :: SDKs ................................ SUCCESS
[  5.586 s]
2017-09-15T12:02:54.466 [INFO] Apache Beam :: SDKs :: Common ...................... SUCCESS
[  2.875 s]
2017-09-15T12:02:54.466 [INFO] Apache Beam :: SDKs :: Common :: Runner API ........ FAILURE
[  1.704 s]
2017-09-15T12:02:54.466 [INFO] Apache Beam :: SDKs :: Common :: Fn API ............ SKIPPED
2017-09-15T12:02:54.466 [INFO] Apache Beam :: SDKs :: Java ........................ SKIPPED
2017-09-15T12:02:54.467 [INFO] Apache Beam :: SDKs :: Java :: Core ................ SKIPPED
2017-09-15T12:02:54.467 [INFO] Apache Beam :: Runners ............................. SKIPPED
2017-09-15T12:02:54.467 [INFO] Apache Beam :: Runners :: Core Construction Java ... SKIPPED
2017-09-15T12:02:54.467 [INFO] Apache Beam :: Runners :: Core Java ................ SKIPPED
2017-09-15T12:02:54.467 [INFO] Apache Beam :: Runners :: Direct Java .............. SKIPPED
2017-09-15T12:02:54.467 [INFO] Apache Beam :: SDKs :: Java :: IO .................. SKIPPED
2017-09-15T12:02:54.467 [INFO] Apache Beam :: SDKs :: Java :: IO :: AMQP .......... SKIPPED
2017-09-15T12:02:54.467 [INFO] Apache Beam :: SDKs :: Java :: IO :: Common ........ SKIPPED
2017-09-15T12:02:54.467 [INFO] Apache Beam :: SDKs :: Java :: IO :: Cassandra ..... SKIPPED
2017-09-15T12:02:54.467 [INFO] Apache Beam :: SDKs :: Java :: IO :: Elasticsearch . SKIPPED
2017-09-15T12:02:54.467 [INFO] Apache Beam :: SDKs :: Java :: IO :: Elasticsearch-Tests SKIPPED
2017-09-15T12:02:54.467 [INFO] Apache Beam :: SDKs :: Java :: IO :: Elasticsearch-Tests ::
Common SKIPPED
2017-09-15T12:02:54.467 [INFO] Apache Beam :: SDKs :: Java :: IO :: Elasticsearch-Tests ::
2.x SKIPPED
2017-09-15T12:02:54.467 [INFO] Apache Beam :: SDKs :: Java :: IO :: Elasticsearch-Tests ::
5.x SKIPPED
2017-09-15T12:02:54.467 [INFO] Apache Beam :: SDKs :: Java :: Extensions .......... SKIPPED
2017-09-15T12:02:54.467 [INFO] Apache Beam :: SDKs :: Java :: Extensions :: Google Cloud Platform
Core SKIPPED
2017-09-15T12:02:54.467 [INFO] Apache Beam :: SDKs :: Java :: Extensions :: Protobuf SKIPPED
2017-09-15T12:02:54.467 [INFO] Apache Beam :: SDKs :: Java :: IO :: Google Cloud Platform
SKIPPED
2017-09-15T12:02:54.467 [INFO] Apache Beam :: SDKs :: Java :: IO :: Hadoop Common . SKIPPED
2017-09-15T12:02:54.467 [INFO] Apache Beam :: SDKs :: Java :: IO :: Hadoop File System SKIPPED
2017-09-15T12:02:54.467 [INFO] Apache Beam :: SDKs :: Java :: IO :: Hadoop ........ SKIPPED
2017-09-15T12:02:54.467 [INFO] Apache Beam :: SDKs :: Java :: IO :: Hadoop :: input-format
SKIPPED
2017-09-15T12:02:54.467 [INFO] Apache Beam :: Runners :: Google Cloud Dataflow .... SKIPPED
2017-09-15T12:02:54.467 [INFO] Apache Beam :: SDKs :: Java :: IO :: Hadoop :: jdk1.8-tests
SKIPPED
2017-09-15T12:02:54.467 [INFO] Apache Beam :: SDKs :: Java :: IO :: HBase ......... SKIPPED
2017-09-15T12:02:54.467 [INFO] Apache Beam :: SDKs :: Java :: IO :: HCatalog ...... SKIPPED
2017-09-15T12:02:54.467 [INFO] Apache Beam :: SDKs :: Java :: IO :: JDBC .......... SKIPPED
2017-09-15T12:02:54.467 [INFO] Apache Beam :: SDKs :: Java :: IO :: JMS ........... SKIPPED
2017-09-15T12:02:54.467 [INFO] Apache Beam :: SDKs :: Java :: IO :: Kafka ......... SKIPPED
2017-09-15T12:02:54.467 [INFO] Apache Beam :: SDKs :: Java :: IO :: Kinesis ....... SKIPPED
2017-09-15T12:02:54.467 [INFO] Apache Beam :: SDKs :: Java :: IO :: MongoDB ....... SKIPPED
2017-09-15T12:02:54.467 [INFO] Apache Beam :: SDKs :: Java :: IO :: MQTT .......... SKIPPED
2017-09-15T12:02:54.467 [INFO] Apache Beam :: SDKs :: Java :: IO :: Solr .......... SKIPPED
2017-09-15T12:02:54.467 [INFO] Apache Beam :: SDKs :: Java :: IO :: Tika .......... SKIPPED
2017-09-15T12:02:54.467 [INFO] Apache Beam :: SDKs :: Java :: IO :: XML ........... SKIPPED
2017-09-15T12:02:54.467 [INFO] Apache Beam :: SDKs :: Java :: Maven Archetypes .... SKIPPED
2017-09-15T12:02:54.467 [INFO] Apache Beam :: SDKs :: Java :: Maven Archetypes :: Starter
SKIPPED
2017-09-15T12:02:54.467 [INFO] Apache Beam :: Examples ............................ SKIPPED
2017-09-15T12:02:54.467 [INFO] Apache Beam :: Examples :: Java .................... SKIPPED
2017-09-15T12:02:54.467 [INFO] Apache Beam :: SDKs :: Java :: Maven Archetypes :: Examples
SKIPPED
2017-09-15T12:02:54.467 [INFO] Apache Beam :: Examples :: Java 8 .................. SKIPPED
2017-09-15T12:02:54.467 [INFO] Apache Beam :: SDKs :: Java :: Maven Archetypes :: Examples
- Java 8 SKIPPED
2017-09-15T12:02:54.467 [INFO] Apache Beam :: SDKs :: Java :: Extensions :: Jackson SKIPPED
2017-09-15T12:02:54.467 [INFO] Apache Beam :: SDKs :: Java :: Extensions :: Join library SKIPPED
2017-09-15T12:02:54.467 [INFO] Apache Beam :: SDKs :: Java :: Extensions :: Sorter  SKIPPED
2017-09-15T12:02:54.467 [INFO] Apache Beam :: SDKs :: Java :: Extensions :: SQL ... SKIPPED
2017-09-15T12:02:54.467 [INFO] Apache Beam :: SDKs :: Java :: Nexmark ............. SKIPPED
2017-09-15T12:02:54.467 [INFO] Apache Beam :: SDKs :: Java :: Harness ............. SKIPPED
2017-09-15T12:02:54.467 [INFO] Apache Beam :: SDKs :: Java :: Java 8 Tests ........ SKIPPED
2017-09-15T12:02:54.467 [INFO] Apache Beam :: SDKs :: Python ...................... SKIPPED
2017-09-15T12:02:54.467 [INFO] Apache Beam :: Runners :: Flink .................... SKIPPED
2017-09-15T12:02:54.467 [INFO] Apache Beam :: Runners :: Spark .................... SKIPPED
2017-09-15T12:02:54.467 [INFO] Apache Beam :: Runners :: Apex ..................... SKIPPED
2017-09-15T12:02:54.467 [INFO] Apache Beam :: Runners :: Gearpump ................. SKIPPED
2017-09-15T12:02:54.467 [INFO] Apache Beam :: SDKs :: Java :: Aggregated Javadoc .. SKIPPED
2017-09-15T12:02:54.467 [INFO] ------------------------------------------------------------------------
2017-09-15T12:02:54.467 [INFO] BUILD FAILURE
2017-09-15T12:02:54.467 [INFO] ------------------------------------------------------------------------
2017-09-15T12:02:54.467 [INFO] Total time: 01:25 min
2017-09-15T12:02:54.467 [INFO] Finished at: 2017-09-15T12:02:54+00:00
2017-09-15T12:02:55.011 [INFO] Final Memory: 111M/1048M
2017-09-15T12:02:55.011 [INFO] ------------------------------------------------------------------------
2017-09-15T12:02:55.016 [ERROR] Failed to execute goal org.xolstice.maven.plugins:protobuf-maven-plugin:0.5.0:compile
(default) on project beam-sdks-common-runner-api: Execution default of goal org.xolstice.maven.plugins:protobuf-maven-plugin:0.5.0:compile
failed: Plugin org.xolstice.maven.plugins:protobuf-maven-plugin:0.5.0 or one of its dependencies
could not be resolved: Could not transfer artifact com.google.guava:guava:jar:18.0 from/to
central (https://repo.maven.apache.org/maven2): GET request of: com/google/guava/guava/18.0/guava-18.0.jar
from central failed: Connection reset -> [Help 1]
org.apache.maven.lifecycle.LifecycleExecutionException: Failed to execute goal org.xolstice.maven.plugins:protobuf-maven-plugin:0.5.0:compile
(default) on project beam-sdks-common-runner-api: Execution default of goal org.xolstice.maven.plugins:protobuf-maven-plugin:0.5.0:compile
failed: Plugin org.xolstice.maven.plugins:protobuf-maven-plugin:0.5.0 or one of its dependencies
could not be resolved: Could not transfer artifact com.google.guava:guava:jar:18.0 from/to
central (https://repo.maven.apache.org/maven2): GET request of: com/google/guava/guava/18.0/guava-18.0.jar
from central failed
	at org.apache.maven.lifecycle.internal.MojoExecutor.execute(MojoExecutor.java:224)
	at org.apache.maven.lifecycle.internal.MojoExecutor.execute(MojoExecutor.java:153)
	at org.apache.maven.lifecycle.internal.MojoExecutor.execute(MojoExecutor.java:145)
	at org.apache.maven.lifecycle.internal.LifecycleModuleBuilder.buildProject(LifecycleModuleBuilder.java:116)
	at org.apache.maven.lifecycle.internal.LifecycleModuleBuilder.buildProject(LifecycleModuleBuilder.java:80)
	at org.apache.maven.lifecycle.internal.builder.singlethreaded.SingleThreadedBuilder.build(SingleThreadedBuilder.java:51)
	at org.apache.maven.lifecycle.internal.LifecycleStarter.execute(LifecycleStarter.java:128)
	at org.apache.maven.DefaultMaven.doExecute(DefaultMaven.java:307)
	at org.apache.maven.DefaultMaven.doExecute(DefaultMaven.java:193)
	at org.apache.maven.DefaultMaven.execute(DefaultMaven.java:106)
	at org.jvnet.hudson.maven3.launcher.Maven33Launcher.main(Maven33Launcher.java:129)
	at sun.reflect.NativeMethodAccessorImpl.invoke0(Native Method)
	at sun.reflect.NativeMethodAccessorImpl.invoke(NativeMethodAccessorImpl.java:62)
	at sun.reflect.DelegatingMethodAccessorImpl.invoke(DelegatingMethodAccessorImpl.java:43)
	at java.lang.reflect.Method.invoke(Method.java:498)
	at org.codehaus.plexus.classworlds.launcher.Launcher.launchStandard(Launcher.java:330)
	at org.codehaus.plexus.classworlds.launcher.Launcher.launch(Launcher.java:238)
	at jenkins.maven3.agent.Maven33Main.launch(Maven33Main.java:176)
	at sun.reflect.NativeMethodAccessorImpl.invoke0(Native Method)
	at sun.reflect.NativeMethodAccessorImpl.invoke(NativeMethodAccessorImpl.java:62)
	at sun.reflect.DelegatingMethodAccessorImpl.invoke(DelegatingMethodAccessorImpl.java:43)
	at java.lang.reflect.Method.invoke(Method.java:498)
	at hudson.maven.Maven3Builder.call(Maven3Builder.java:139)
	at hudson.maven.Maven3Builder.call(Maven3Builder.java:70)
	at hudson.remoting.UserRequest.perform(UserRequest.java:153)
	at hudson.remoting.UserRequest.perform(UserRequest.java:50)
	at hudson.remoting.Request$2.run(Request.java:336)
	at hudson.remoting.InterceptingExecutorService$1.call(InterceptingExecutorService.java:68)
	at java.util.concurrent.FutureTask.run(FutureTask.java:266)
	at java.util.concurrent.ThreadPoolExecutor.runWorker(ThreadPoolExecutor.java:1149)
	at java.util.concurrent.ThreadPoolExecutor$Worker.run(ThreadPoolExecutor.java:624)
	at java.lang.Thread.run(Thread.java:748)
Caused by: org.apache.maven.plugin.PluginExecutionException: Execution default of goal org.xolstice.maven.plugins:protobuf-maven-plugin:0.5.0:compile
failed: Plugin org.xolstice.maven.plugins:protobuf-maven-plugin:0.5.0 or one of its dependencies
could not be resolved: Could not transfer artifact com.google.guava:guava:jar:18.0 from/to
central (https://repo.maven.apache.org/maven2): GET request of: com/google/guava/guava/18.0/guava-18.0.jar
from central failed
	at org.apache.maven.plugin.DefaultBuildPluginManager.executeMojo(DefaultBuildPluginManager.java:106)
	at org.apache.maven.lifecycle.internal.MojoExecutor.execute(MojoExecutor.java:208)
	... 31 more
Caused by: org.apache.maven.plugin.PluginResolutionException: Plugin org.xolstice.maven.plugins:protobuf-maven-plugin:0.5.0
or one of its dependencies could not be resolved: Could not transfer artifact com.google.guava:guava:jar:18.0
from/to central (https://repo.maven.apache.org/maven2): GET request of: com/google/guava/guava/18.0/guava-18.0.jar
from central failed
	at org.apache.maven.plugin.internal.DefaultPluginDependenciesResolver.resolveInternal(DefaultPluginDependenciesResolver.java:218)
	at org.apache.maven.plugin.internal.DefaultPluginDependenciesResolver.resolve(DefaultPluginDependenciesResolver.java:149)
	at org.apache.maven.plugin.internal.DefaultMavenPluginManager.createPluginRealm(DefaultMavenPluginManager.java:422)
	at org.apache.maven.plugin.internal.DefaultMavenPluginManager.setupPluginRealm(DefaultMavenPluginManager.java:385)
	at org.apache.maven.plugin.DefaultBuildPluginManager.getPluginRealm(DefaultBuildPluginManager.java:231)
	at org.apache.maven.plugin.DefaultBuildPluginManager.executeMojo(DefaultBuildPluginManager.java:102)
	... 32 more
Caused by: org.eclipse.aether.resolution.ArtifactResolutionException: Could not transfer artifact
com.google.guava:guava:jar:18.0 from/to central (https://repo.maven.apache.org/maven2): GET
request of: com/google/guava/guava/18.0/guava-18.0.jar from central failed
	at org.eclipse.aether.internal.impl.DefaultArtifactResolver.resolve(DefaultArtifactResolver.java:444)
	at org.eclipse.aether.internal.impl.DefaultArtifactResolver.resolveArtifacts(DefaultArtifactResolver.java:246)
	at org.eclipse.aether.internal.impl.DefaultRepositorySystem.resolveDependencies(DefaultRepositorySystem.java:367)
	at org.apache.maven.plugin.internal.DefaultPluginDependenciesResolver.resolveInternal(DefaultPluginDependenciesResolver.java:210)
	... 37 more
Caused by: org.eclipse.aether.transfer.ArtifactTransferException: Could not transfer artifact
com.google.guava:guava:jar:18.0 from/to central (https://repo.maven.apache.org/maven2): GET
request of: com/google/guava/guava/18.0/guava-18.0.jar from central failed
	at org.eclipse.aether.connector.basic.ArtifactTransportListener.transferFailed(ArtifactTransportListener.java:43)
	at org.eclipse.aether.connector.basic.BasicRepositoryConnector$TaskRunner.run(BasicRepositoryConnector.java:355)
	at org.eclipse.aether.util.concurrency.RunnableErrorForwarder$1.run(RunnableErrorForwarder.java:67)
	... 3 more
Caused by: org.apache.maven.wagon.TransferFailedException: GET request of: com/google/guava/guava/18.0/guava-18.0.jar
from central failed
	at org.apache.maven.wagon.AbstractWagon.getTransfer(AbstractWagon.java:363)
	at org.apache.maven.wagon.AbstractWagon.getTransfer(AbstractWagon.java:316)
	at org.apache.maven.wagon.AbstractWagon.getTransfer(AbstractWagon.java:285)
	at org.apache.maven.wagon.StreamWagon.getIfNewer(StreamWagon.java:97)
	at org.apache.maven.wagon.StreamWagon.get(StreamWagon.java:61)
	at org.eclipse.aether.transport.wagon.WagonTransporter$GetTaskRunner.run(WagonTransporter.java:560)
	at org.eclipse.aether.transport.wagon.WagonTransporter.execute(WagonTransporter.java:427)
	at org.eclipse.aether.transport.wagon.WagonTransporter.get(WagonTransporter.java:404)
	at org.eclipse.aether.connector.basic.BasicRepositoryConnector$GetTaskRunner.runTask(BasicRepositoryConnector.java:447)
	at org.eclipse.aether.connector.basic.BasicRepositoryConnector$TaskRunner.run(BasicRepositoryConnector.java:350)
	... 4 more
Caused by: java.net.SocketException: Connection reset
	at java.net.SocketInputStream.read(SocketInputStream.java:210)
	at java.net.SocketInputStream.read(SocketInputStream.java:141)
	at sun.security.ssl.InputRecord.readFully(InputRecord.java:465)
	at sun.security.ssl.InputRecord.readV3Record(InputRecord.java:593)
	at sun.security.ssl.InputRecord.read(InputRecord.java:532)
	at sun.security.ssl.SSLSocketImpl.readRecord(SSLSocketImpl.java:983)
	at sun.security.ssl.SSLSocketImpl.readDataRecord(SSLSocketImpl.java:940)
	at sun.security.ssl.AppInputStream.read(AppInputStream.java:105)
	at org.apache.maven.wagon.providers.http.httpclient.impl.io.SessionInputBufferImpl.streamRead(SessionInputBufferImpl.java:136)
	at org.apache.maven.wagon.providers.http.httpclient.impl.io.SessionInputBufferImpl.read(SessionInputBufferImpl.java:195)
	at org.apache.maven.wagon.providers.http.httpclient.impl.io.ContentLengthInputStream.read(ContentLengthInputStream.java:178)
	at org.apache.maven.wagon.providers.http.httpclient.conn.EofSensorInputStream.read(EofSensorInputStream.java:137)
	at org.apache.maven.wagon.AbstractWagon.transfer(AbstractWagon.java:531)
	at org.apache.maven.wagon.AbstractWagon.getTransfer(AbstractWagon.java:353)
	... 13 more
2017-09-15T12:02:55.022 [ERROR] 
2017-09-15T12:02:55.022 [ERROR] Re-run Maven using the -X switch to enable full debug logging.
2017-09-15T12:02:55.022 [ERROR] 
2017-09-15T12:02:55.022 [ERROR] For more information about the errors and possible solutions,
please read the following articles:
2017-09-15T12:02:55.022 [ERROR] [Help 1] http://cwiki.apache.org/confluence/display/MAVEN/PluginResolutionException
2017-09-15T12:02:55.023 [ERROR] 
2017-09-15T12:02:55.023 [ERROR] After correcting the problems, you can resume the build with
the command
2017-09-15T12:02:55.023 [ERROR]   mvn <goals> -rf :beam-sdks-common-runner-api
channel stopped

Mime
View raw message