beam-commits mailing list archives

Site index · List index
Message view « Date » · « Thread »
Top « Date » · « Thread »
From Apache Jenkins Server <jenk...@builds.apache.org>
Subject Build failed in Jenkins: beam_PostCommit_Java_ValidatesRunner_Dataflow #3989
Date Mon, 18 Sep 2017 13:34:41 GMT
See <https://builds.apache.org/job/beam_PostCommit_Java_ValidatesRunner_Dataflow/3989/display/redirect?page=changes>

Changes:

[echauchot] [BEAM-2957] Fix flaky ElasticsearchIOTest.testSplit in

------------------------------------------
[...truncated 290.92 KB...]
2017-09-18T13:34:21.598 [INFO] Downloaded: https://repo.maven.apache.org/maven2/org/apache/apache/1/apache-1.pom
(4 KB at 123.3 KB/sec)
2017-09-18T13:34:21.601 [INFO] Downloading: https://repo.maven.apache.org/maven2/commons-httpclient/commons-httpclient/3.1/commons-httpclient-3.1.pom
2017-09-18T13:34:21.629 [INFO] Downloaded: https://repo.maven.apache.org/maven2/commons-httpclient/commons-httpclient/3.1/commons-httpclient-3.1.pom
(8 KB at 270.8 KB/sec)
2017-09-18T13:34:21.631 [INFO] Downloading: https://repo.maven.apache.org/maven2/commons-codec/commons-codec/1.2/commons-codec-1.2.pom
2017-09-18T13:34:21.660 [INFO] Downloaded: https://repo.maven.apache.org/maven2/commons-codec/commons-codec/1.2/commons-codec-1.2.pom
(4 KB at 128.8 KB/sec)
2017-09-18T13:34:21.662 [INFO] Downloading: https://repo.maven.apache.org/maven2/org/apache/maven/doxia/doxia-site-renderer/1.1.2/doxia-site-renderer-1.1.2.pom
2017-09-18T13:34:21.691 [INFO] Downloaded: https://repo.maven.apache.org/maven2/org/apache/maven/doxia/doxia-site-renderer/1.1.2/doxia-site-renderer-1.1.2.pom
(6 KB at 206.1 KB/sec)
2017-09-18T13:34:21.693 [INFO] Downloading: https://repo.maven.apache.org/maven2/org/apache/maven/doxia/doxia-sitetools/1.1.2/doxia-sitetools-1.1.2.pom
2017-09-18T13:34:21.723 [INFO] Downloaded: https://repo.maven.apache.org/maven2/org/apache/maven/doxia/doxia-sitetools/1.1.2/doxia-sitetools-1.1.2.pom
(15 KB at 497.5 KB/sec)
2017-09-18T13:34:21.727 [INFO] Downloading: https://repo.maven.apache.org/maven2/org/apache/maven/doxia/doxia-decoration-model/1.1.2/doxia-decoration-model-1.1.2.pom
2017-09-18T13:34:21.756 [INFO] Downloaded: https://repo.maven.apache.org/maven2/org/apache/maven/doxia/doxia-decoration-model/1.1.2/doxia-decoration-model-1.1.2.pom
(3 KB at 100.2 KB/sec)
2017-09-18T13:34:21.758 [INFO] Downloading: https://repo.maven.apache.org/maven2/org/apache/maven/doxia/doxia-module-xhtml/1.1.2/doxia-module-xhtml-1.1.2.pom
2017-09-18T13:34:21.786 [INFO] Downloaded: https://repo.maven.apache.org/maven2/org/apache/maven/doxia/doxia-module-xhtml/1.1.2/doxia-module-xhtml-1.1.2.pom
(2 KB at 55.9 KB/sec)
2017-09-18T13:34:21.787 [INFO] Downloading: https://repo.maven.apache.org/maven2/org/apache/maven/doxia/doxia-modules/1.1.2/doxia-modules-1.1.2.pom
2017-09-18T13:34:21.815 [INFO] Downloaded: https://repo.maven.apache.org/maven2/org/apache/maven/doxia/doxia-modules/1.1.2/doxia-modules-1.1.2.pom
(3 KB at 85.0 KB/sec)
2017-09-18T13:34:21.819 [INFO] Downloading: https://repo.maven.apache.org/maven2/org/apache/maven/doxia/doxia-module-fml/1.1.2/doxia-module-fml-1.1.2.pom
2017-09-18T13:34:21.847 [INFO] Downloaded: https://repo.maven.apache.org/maven2/org/apache/maven/doxia/doxia-module-fml/1.1.2/doxia-module-fml-1.1.2.pom
(6 KB at 191.7 KB/sec)
2017-09-18T13:34:21.850 [INFO] Downloading: https://repo.maven.apache.org/maven2/commons-validator/commons-validator/1.2.0/commons-validator-1.2.0.pom
2017-09-18T13:34:21.882 [INFO] Downloaded: https://repo.maven.apache.org/maven2/commons-validator/commons-validator/1.2.0/commons-validator-1.2.0.pom
(9 KB at 277.2 KB/sec)
2017-09-18T13:34:21.885 [INFO] Downloading: https://repo.maven.apache.org/maven2/xml-apis/xml-apis/2.0.2/xml-apis-2.0.2.pom
2017-09-18T13:34:21.913 [INFO] Downloaded: https://repo.maven.apache.org/maven2/xml-apis/xml-apis/2.0.2/xml-apis-2.0.2.pom
(346 B at 12.1 KB/sec)
2017-09-18T13:34:21.920 [INFO] Downloading: https://repo.maven.apache.org/maven2/org/apache/maven/maven-plugin-api/2.0/maven-plugin-api-2.0.pom
2017-09-18T13:34:21.946 [INFO] Downloaded: https://repo.maven.apache.org/maven2/org/apache/maven/maven-plugin-api/2.0/maven-plugin-api-2.0.pom
(601 B at 22.6 KB/sec)
2017-09-18T13:34:21.948 [INFO] Downloading: https://repo.maven.apache.org/maven2/org/apache/maven/maven/2.0/maven-2.0.pom
2017-09-18T13:34:21.975 [INFO] Downloaded: https://repo.maven.apache.org/maven2/org/apache/maven/maven/2.0/maven-2.0.pom
(9 KB at 317.1 KB/sec)
2017-09-18T13:34:21.980 [INFO] Downloading: https://repo.maven.apache.org/maven2/org/apache/maven/shared/maven-doxia-tools/1.2.1/maven-doxia-tools-1.2.1.pom
2017-09-18T13:34:22.019 [INFO] Downloaded: https://repo.maven.apache.org/maven2/org/apache/maven/shared/maven-doxia-tools/1.2.1/maven-doxia-tools-1.2.1.pom
(7 KB at 154.1 KB/sec)
2017-09-18T13:34:22.023 [INFO] Downloading: https://repo.maven.apache.org/maven2/org/apache/maven/doxia/doxia-logging-api/1.1.3/doxia-logging-api-1.1.3.pom
2017-09-18T13:34:22.054 [INFO] Downloaded: https://repo.maven.apache.org/maven2/org/apache/maven/doxia/doxia-logging-api/1.1.3/doxia-logging-api-1.1.3.pom
(2 KB at 49.8 KB/sec)
2017-09-18T13:34:22.056 [INFO] Downloading: https://repo.maven.apache.org/maven2/org/apache/maven/doxia/doxia/1.1.3/doxia-1.1.3.pom
2017-09-18T13:34:22.084 [INFO] Downloaded: https://repo.maven.apache.org/maven2/org/apache/maven/doxia/doxia/1.1.3/doxia-1.1.3.pom
(19 KB at 648.9 KB/sec)
2017-09-18T13:34:22.087 [INFO] Downloading: https://repo.maven.apache.org/maven2/org/apache/maven/doxia/doxia-decoration-model/1.1.3/doxia-decoration-model-1.1.3.pom
2017-09-18T13:34:22.115 [INFO] Downloaded: https://repo.maven.apache.org/maven2/org/apache/maven/doxia/doxia-decoration-model/1.1.3/doxia-decoration-model-1.1.3.pom
(3 KB at 103.8 KB/sec)
2017-09-18T13:34:22.116 [INFO] Downloading: https://repo.maven.apache.org/maven2/org/apache/maven/doxia/doxia-sitetools/1.1.3/doxia-sitetools-1.1.3.pom
2017-09-18T13:34:22.146 [INFO] Downloaded: https://repo.maven.apache.org/maven2/org/apache/maven/doxia/doxia-sitetools/1.1.3/doxia-sitetools-1.1.3.pom
(16 KB at 512.4 KB/sec)
2017-09-18T13:34:22.159 [INFO] Downloading: https://repo.maven.apache.org/maven2/com/google/code/findbugs/findbugs/3.0.1/findbugs-3.0.1.jar
2017-09-18T13:34:22.159 [INFO] Downloading: https://repo.maven.apache.org/maven2/net/jcip/jcip-annotations/1.0/jcip-annotations-1.0.jar
2017-09-18T13:34:22.160 [INFO] Downloading: https://repo.maven.apache.org/maven2/com/google/code/findbugs/bcel-findbugs/6.0/bcel-findbugs-6.0.jar
2017-09-18T13:34:22.160 [INFO] Downloading: https://repo.maven.apache.org/maven2/com/google/code/findbugs/jFormatString/2.0.1/jFormatString-2.0.1.jar
2017-09-18T13:34:22.160 [INFO] Downloading: https://repo.maven.apache.org/maven2/dom4j/dom4j/1.6.1/dom4j-1.6.1.jar
2017-09-18T13:34:22.189 [INFO] Downloaded: https://repo.maven.apache.org/maven2/net/jcip/jcip-annotations/1.0/jcip-annotations-1.0.jar
(3 KB at 71.0 KB/sec)
2017-09-18T13:34:22.189 [INFO] Downloading: https://repo.maven.apache.org/maven2/xml-apis/xml-apis/1.0.b2/xml-apis-1.0.b2.jar
2017-09-18T13:34:22.190 [INFO] Downloaded: https://repo.maven.apache.org/maven2/com/google/code/findbugs/jFormatString/2.0.1/jFormatString-2.0.1.jar
(27 KB at 887.7 KB/sec)
2017-09-18T13:34:22.191 [INFO] Downloading: https://repo.maven.apache.org/maven2/org/ow2/asm/asm-debug-all/5.0.2/asm-debug-all-5.0.2.jar
2017-09-18T13:34:22.217 [INFO] Downloaded: https://repo.maven.apache.org/maven2/dom4j/dom4j/1.6.1/dom4j-1.6.1.jar
(307 KB at 5377.9 KB/sec)
2017-09-18T13:34:22.217 [INFO] Downloading: https://repo.maven.apache.org/maven2/org/ow2/asm/asm-commons/5.0.2/asm-commons-5.0.2.jar
2017-09-18T13:34:22.228 [INFO] Downloaded: https://repo.maven.apache.org/maven2/xml-apis/xml-apis/1.0.b2/xml-apis-1.0.b2.jar
(107 KB at 1569.9 KB/sec)
2017-09-18T13:34:22.228 [INFO] Downloading: https://repo.maven.apache.org/maven2/org/ow2/asm/asm-tree/5.0.2/asm-tree-5.0.2.jar
2017-09-18T13:34:22.247 [INFO] Downloaded: https://repo.maven.apache.org/maven2/org/ow2/asm/asm-commons/5.0.2/asm-commons-5.0.2.jar
(41 KB at 468.3 KB/sec)
2017-09-18T13:34:22.247 [INFO] Downloading: https://repo.maven.apache.org/maven2/jaxen/jaxen/1.1.6/jaxen-1.1.6.jar
2017-09-18T13:34:22.248 [INFO] Downloaded: https://repo.maven.apache.org/maven2/org/ow2/asm/asm-debug-all/5.0.2/asm-debug-all-5.0.2.jar
(372 KB at 4220.4 KB/sec)
2017-09-18T13:34:22.248 [INFO] Downloading: https://repo.maven.apache.org/maven2/org/apache/ant/ant/1.9.4/ant-1.9.4.jar
2017-09-18T13:34:22.257 [INFO] Downloaded: https://repo.maven.apache.org/maven2/org/ow2/asm/asm-tree/5.0.2/asm-tree-5.0.2.jar
(29 KB at 292.3 KB/sec)
2017-09-18T13:34:22.257 [INFO] Downloading: https://repo.maven.apache.org/maven2/org/apache/ant/ant-launcher/1.9.4/ant-launcher-1.9.4.jar
2017-09-18T13:34:22.285 [INFO] Downloaded: https://repo.maven.apache.org/maven2/org/apache/ant/ant-launcher/1.9.4/ant-launcher-1.9.4.jar
(18 KB at 143.6 KB/sec)
2017-09-18T13:34:22.285 [INFO] Downloading: https://repo.maven.apache.org/maven2/org/codehaus/groovy/groovy/2.4.7/groovy-2.4.7.jar
2017-09-18T13:34:22.289 [INFO] Downloaded: https://repo.maven.apache.org/maven2/com/google/code/findbugs/bcel-findbugs/6.0/bcel-findbugs-6.0.jar
(599 KB at 4600.2 KB/sec)
2017-09-18T13:34:22.289 [INFO] Downloading: https://repo.maven.apache.org/maven2/org/codehaus/groovy/groovy-ant/2.4.7/groovy-ant-2.4.7.jar
2017-09-18T13:34:22.290 [INFO] Downloaded: https://repo.maven.apache.org/maven2/jaxen/jaxen/1.1.6/jaxen-1.1.6.jar
(227 KB at 1741.9 KB/sec)
2017-09-18T13:34:22.290 [INFO] Downloading: https://repo.maven.apache.org/maven2/org/apache/ant/ant-antlr/1.9.4/ant-antlr-1.9.4.jar
2017-09-18T13:34:22.314 [INFO] Downloading: https://repo.maven.apache.org/maven2/org/codehaus/groovy/groovy-groovydoc/2.4.7/groovy-groovydoc-2.4.7.jar
2017-09-18T13:34:22.317 [INFO] Downloaded: https://repo.maven.apache.org/maven2/org/apache/ant/ant-antlr/1.9.4/ant-antlr-1.9.4.jar
(12 KB at 72.2 KB/sec)
2017-09-18T13:34:22.317 [INFO] Downloading: https://repo.maven.apache.org/maven2/org/codehaus/groovy/groovy-templates/2.4.7/groovy-templates-2.4.7.jar
2017-09-18T13:34:22.339 [INFO] Downloaded: https://repo.maven.apache.org/maven2/org/codehaus/groovy/groovy-ant/2.4.7/groovy-ant-2.4.7.jar
(69 KB at 380.1 KB/sec)
2017-09-18T13:34:22.339 [INFO] Downloading: https://repo.maven.apache.org/maven2/org/apache/ant/ant-junit/1.9.4/ant-junit-1.9.4.jar
2017-09-18T13:34:22.354 [INFO] Downloaded: https://repo.maven.apache.org/maven2/org/codehaus/groovy/groovy-templates/2.4.7/groovy-templates-2.4.7.jar
(96 KB at 492.6 KB/sec)
2017-09-18T13:34:22.355 [INFO] Downloading: https://repo.maven.apache.org/maven2/org/codehaus/groovy/groovy-xml/2.4.7/groovy-xml-2.4.7.jar
2017-09-18T13:34:22.386 [INFO] Downloaded: https://repo.maven.apache.org/maven2/org/apache/ant/ant-junit/1.9.4/ant-junit-1.9.4.jar
(116 KB at 508.9 KB/sec)
2017-09-18T13:34:22.386 [INFO] Downloading: https://repo.maven.apache.org/maven2/org/apache/maven/reporting/maven-reporting-impl/2.1/maven-reporting-impl-2.1.jar
2017-09-18T13:34:22.411 [INFO] Downloaded: https://repo.maven.apache.org/maven2/org/codehaus/groovy/groovy-groovydoc/2.4.7/groovy-groovydoc-2.4.7.jar
(133 KB at 526.0 KB/sec)
2017-09-18T13:34:22.411 [INFO] Downloading: https://repo.maven.apache.org/maven2/org/apache/maven/maven-project/2.0.10/maven-project-2.0.10.jar
2017-09-18T13:34:22.416 [INFO] Downloaded: https://repo.maven.apache.org/maven2/org/apache/maven/reporting/maven-reporting-impl/2.1/maven-reporting-impl-2.1.jar
(17 KB at 63.2 KB/sec)
2017-09-18T13:34:22.417 [INFO] Downloading: https://repo.maven.apache.org/maven2/org/apache/maven/maven-settings/2.0.10/maven-settings-2.0.10.jar
2017-09-18T13:34:22.416 [INFO] Downloaded: https://repo.maven.apache.org/maven2/org/codehaus/groovy/groovy-xml/2.4.7/groovy-xml-2.4.7.jar
(211 KB at 821.9 KB/sec)
2017-09-18T13:34:22.417 [INFO] Downloading: https://repo.maven.apache.org/maven2/org/apache/maven/maven-profile/2.0.10/maven-profile-2.0.10.jar
2017-09-18T13:34:22.450 [INFO] Downloaded: https://repo.maven.apache.org/maven2/org/apache/maven/maven-settings/2.0.10/maven-settings-2.0.10.jar
(50 KB at 171.8 KB/sec)
2017-09-18T13:34:22.451 [INFO] Downloading: https://repo.maven.apache.org/maven2/org/apache/maven/maven-plugin-registry/2.0.10/maven-plugin-registry-2.0.10.jar
2017-09-18T13:34:22.452 [INFO] Downloaded: https://repo.maven.apache.org/maven2/org/apache/maven/maven-project/2.0.10/maven-project-2.0.10.jar
(121 KB at 412.0 KB/sec)
2017-09-18T13:34:22.453 [INFO] Downloading: https://repo.maven.apache.org/maven2/org/codehaus/plexus/plexus-interpolation/1.1/plexus-interpolation-1.1.jar
2017-09-18T13:34:22.453 [INFO] Downloaded: https://repo.maven.apache.org/maven2/org/apache/maven/maven-profile/2.0.10/maven-profile-2.0.10.jar
(37 KB at 123.0 KB/sec)
2017-09-18T13:34:22.453 [INFO] Downloading: https://repo.maven.apache.org/maven2/commons-validator/commons-validator/1.2.0/commons-validator-1.2.0.jar
2017-09-18T13:34:22.483 [INFO] Downloaded: https://repo.maven.apache.org/maven2/org/apache/maven/maven-plugin-registry/2.0.10/maven-plugin-registry-2.0.10.jar
(30 KB at 91.9 KB/sec)
2017-09-18T13:34:22.483 [INFO] Downloading: https://repo.maven.apache.org/maven2/org/apache/maven/maven-plugin-api/2.0/maven-plugin-api-2.0.jar
2017-09-18T13:34:22.485 [INFO] Downloaded: https://repo.maven.apache.org/maven2/org/codehaus/plexus/plexus-interpolation/1.1/plexus-interpolation-1.1.jar
(35 KB at 106.6 KB/sec)
2017-09-18T13:34:22.486 [INFO] Downloading: https://repo.maven.apache.org/maven2/org/apache/maven/doxia/doxia-core/1.4/doxia-core-1.4.jar
2017-09-18T13:34:22.490 [INFO] Downloaded: https://repo.maven.apache.org/maven2/commons-validator/commons-validator/1.2.0/commons-validator-1.2.0.jar
(89 KB at 269.6 KB/sec)
2017-09-18T13:34:22.491 [INFO] Downloading: https://repo.maven.apache.org/maven2/org/apache/maven/shared/maven-doxia-tools/1.2.1/maven-doxia-tools-1.2.1.jar
2017-09-18T13:34:22.511 [INFO] Downloaded: https://repo.maven.apache.org/maven2/org/apache/maven/maven-plugin-api/2.0/maven-plugin-api-2.0.jar
(10 KB at 28.2 KB/sec)
2017-09-18T13:34:22.511 [INFO] Downloading: https://repo.maven.apache.org/maven2/org/apache/maven/maven-artifact-manager/2.0.6/maven-artifact-manager-2.0.6.jar
2017-09-18T13:34:22.523 [INFO] Downloaded: https://repo.maven.apache.org/maven2/org/apache/maven/shared/maven-doxia-tools/1.2.1/maven-doxia-tools-1.2.1.jar
(43 KB at 116.2 KB/sec)
2017-09-18T13:34:22.523 [INFO] Downloading: https://repo.maven.apache.org/maven2/org/apache/maven/maven-repository-metadata/2.0.6/maven-repository-metadata-2.0.6.jar
2017-09-18T13:34:22.537 [INFO] Downloaded: https://repo.maven.apache.org/maven2/org/apache/maven/doxia/doxia-core/1.4/doxia-core-1.4.jar
(162 KB at 427.1 KB/sec)
2017-09-18T13:34:22.537 [INFO] Downloading: https://repo.maven.apache.org/maven2/org/apache/maven/maven-model/2.0.6/maven-model-2.0.6.jar
2017-09-18T13:34:22.546 [INFO] Downloaded: https://repo.maven.apache.org/maven2/org/apache/maven/maven-artifact-manager/2.0.6/maven-artifact-manager-2.0.6.jar
(56 KB at 143.0 KB/sec)
2017-09-18T13:34:22.546 [INFO] Downloading: https://repo.maven.apache.org/maven2/org/codehaus/plexus/plexus-utils/1.5.6/plexus-utils-1.5.6.jar
2017-09-18T13:34:22.553 [INFO] Downloaded: https://repo.maven.apache.org/maven2/org/apache/maven/maven-repository-metadata/2.0.6/maven-repository-metadata-2.0.6.jar
(24 KB at 60.8 KB/sec)
2017-09-18T13:34:22.577 [INFO] Downloaded: https://repo.maven.apache.org/maven2/org/apache/maven/maven-model/2.0.6/maven-model-2.0.6.jar
(85 KB at 202.3 KB/sec)
2017-09-18T13:34:22.605 [INFO] Downloaded: https://repo.maven.apache.org/maven2/org/codehaus/plexus/plexus-utils/1.5.6/plexus-utils-1.5.6.jar
(245 KB at 549.8 KB/sec)
2017-09-18T13:34:22.607 [INFO] Downloaded: https://repo.maven.apache.org/maven2/com/google/code/findbugs/findbugs/3.0.1/findbugs-3.0.1.jar
(3711 KB at 8264.2 KB/sec)
2017-09-18T13:34:22.688 [INFO] Downloaded: https://repo.maven.apache.org/maven2/org/codehaus/groovy/groovy/2.4.7/groovy-2.4.7.jar
(4445 KB at 8433.1 KB/sec)
[WARNING] Failed to getClass for org.codehaus.mojo.findbugs.FindBugsMojo
[WARNING] Failed to getClass for org.codehaus.mojo.findbugs.FindbugsViolationCheckMojo
[WARNING] Failed to getClass for org.codehaus.mojo.findbugs.FindbugsViolationCheckMojo
[JENKINS] Archiving disabled
[JENKINS] Archiving disabled
[JENKINS] Archiving disabled
[JENKINS] Archiving disabled
[JENKINS] Archiving disabled
[JENKINS] Archiving disabled
[JENKINS] Archiving disabled
[JENKINS] Archiving disabled
[JENKINS] Archiving disabled
[JENKINS] Archiving disabled
[JENKINS] Archiving disabled
[JENKINS] Archiving disabled
[JENKINS] Archiving disabled
[JENKINS] Archiving disabled
[JENKINS] Archiving disabled
[JENKINS] Archiving disabled
[JENKINS] Archiving disabled
[JENKINS] Archiving disabled
[JENKINS] Archiving disabled
2017-09-18T13:34:30.658 [INFO] ------------------------------------------------------------------------
2017-09-18T13:34:30.658 [INFO] Reactor Summary:
2017-09-18T13:34:30.658 [INFO] 
2017-09-18T13:34:30.658 [INFO] Apache Beam :: Parent .............................. SUCCESS
[ 31.927 s]
2017-09-18T13:34:30.658 [INFO] Apache Beam :: SDKs :: Java :: Build Tools ......... SUCCESS
[ 10.430 s]
2017-09-18T13:34:30.658 [INFO] Apache Beam :: SDKs ................................ SUCCESS
[  2.485 s]
2017-09-18T13:34:30.658 [INFO] Apache Beam :: SDKs :: Common ...................... SUCCESS
[  2.101 s]
2017-09-18T13:34:30.658 [INFO] Apache Beam :: SDKs :: Common :: Runner API ........ FAILURE
[ 10.232 s]
2017-09-18T13:34:30.658 [INFO] Apache Beam :: SDKs :: Common :: Fn API ............ SKIPPED
2017-09-18T13:34:30.658 [INFO] Apache Beam :: SDKs :: Java ........................ SKIPPED
2017-09-18T13:34:30.658 [INFO] Apache Beam :: SDKs :: Java :: Core ................ SKIPPED
2017-09-18T13:34:30.658 [INFO] Apache Beam :: Runners ............................. SKIPPED
2017-09-18T13:34:30.658 [INFO] Apache Beam :: Runners :: Core Construction Java ... SKIPPED
2017-09-18T13:34:30.658 [INFO] Apache Beam :: Runners :: Core Java ................ SKIPPED
2017-09-18T13:34:30.658 [INFO] Apache Beam :: Runners :: Direct Java .............. SKIPPED
2017-09-18T13:34:30.658 [INFO] Apache Beam :: SDKs :: Java :: IO .................. SKIPPED
2017-09-18T13:34:30.658 [INFO] Apache Beam :: SDKs :: Java :: Extensions .......... SKIPPED
2017-09-18T13:34:30.658 [INFO] Apache Beam :: SDKs :: Java :: Extensions :: Google Cloud Platform
Core SKIPPED
2017-09-18T13:34:30.658 [INFO] Apache Beam :: SDKs :: Java :: Extensions :: Protobuf SKIPPED
2017-09-18T13:34:30.658 [INFO] Apache Beam :: SDKs :: Java :: IO :: Google Cloud Platform
SKIPPED
2017-09-18T13:34:30.658 [INFO] Apache Beam :: Runners :: Google Cloud Dataflow .... SKIPPED
2017-09-18T13:34:30.659 [INFO] ------------------------------------------------------------------------
2017-09-18T13:34:30.659 [INFO] BUILD FAILURE
2017-09-18T13:34:30.659 [INFO] ------------------------------------------------------------------------
2017-09-18T13:34:30.659 [INFO] Total time: 01:42 min
2017-09-18T13:34:30.659 [INFO] Finished at: 2017-09-18T13:34:30+00:00
2017-09-18T13:34:30.992 [INFO] Final Memory: 81M/1092M
2017-09-18T13:34:30.992 [INFO] ------------------------------------------------------------------------
2017-09-18T13:34:30.996 [ERROR] Failed to execute goal org.codehaus.mojo:findbugs-maven-plugin:3.0.4:findbugs
(findbugs) on project beam-sdks-common-runner-api: Execution findbugs of goal org.codehaus.mojo:findbugs-maven-plugin:3.0.4:findbugs
failed: Plugin org.codehaus.mojo:findbugs-maven-plugin:3.0.4 or one of its dependencies could
not be resolved: Could not transfer artifact org.apache.ant:ant:jar:1.9.4 from/to central
(https://repo.maven.apache.org/maven2): GET request of: org/apache/ant/ant/1.9.4/ant-1.9.4.jar
from central failed: Connection reset -> [Help 1]
org.apache.maven.lifecycle.LifecycleExecutionException: Failed to execute goal org.codehaus.mojo:findbugs-maven-plugin:3.0.4:findbugs
(findbugs) on project beam-sdks-common-runner-api: Execution findbugs of goal org.codehaus.mojo:findbugs-maven-plugin:3.0.4:findbugs
failed: Plugin org.codehaus.mojo:findbugs-maven-plugin:3.0.4 or one of its dependencies could
not be resolved: Could not transfer artifact org.apache.ant:ant:jar:1.9.4 from/to central
(https://repo.maven.apache.org/maven2): GET request of: org/apache/ant/ant/1.9.4/ant-1.9.4.jar
from central failed
	at org.apache.maven.lifecycle.internal.MojoExecutor.execute(MojoExecutor.java:224)
	at org.apache.maven.lifecycle.internal.MojoExecutor.execute(MojoExecutor.java:153)
	at org.apache.maven.lifecycle.internal.MojoExecutor.execute(MojoExecutor.java:145)
	at org.apache.maven.lifecycle.internal.MojoExecutor.executeForkedExecutions(MojoExecutor.java:364)
	at org.apache.maven.lifecycle.internal.MojoExecutor.execute(MojoExecutor.java:198)
	at org.apache.maven.lifecycle.internal.MojoExecutor.execute(MojoExecutor.java:153)
	at org.apache.maven.lifecycle.internal.MojoExecutor.execute(MojoExecutor.java:145)
	at org.apache.maven.lifecycle.internal.LifecycleModuleBuilder.buildProject(LifecycleModuleBuilder.java:116)
	at org.apache.maven.lifecycle.internal.LifecycleModuleBuilder.buildProject(LifecycleModuleBuilder.java:80)
	at org.apache.maven.lifecycle.internal.builder.singlethreaded.SingleThreadedBuilder.build(SingleThreadedBuilder.java:51)
	at org.apache.maven.lifecycle.internal.LifecycleStarter.execute(LifecycleStarter.java:128)
	at org.apache.maven.DefaultMaven.doExecute(DefaultMaven.java:307)
	at org.apache.maven.DefaultMaven.doExecute(DefaultMaven.java:193)
	at org.apache.maven.DefaultMaven.execute(DefaultMaven.java:106)
	at org.jvnet.hudson.maven3.launcher.Maven33Launcher.main(Maven33Launcher.java:129)
	at sun.reflect.NativeMethodAccessorImpl.invoke0(Native Method)
	at sun.reflect.NativeMethodAccessorImpl.invoke(NativeMethodAccessorImpl.java:62)
	at sun.reflect.DelegatingMethodAccessorImpl.invoke(DelegatingMethodAccessorImpl.java:43)
	at java.lang.reflect.Method.invoke(Method.java:498)
	at org.codehaus.plexus.classworlds.launcher.Launcher.launchStandard(Launcher.java:330)
	at org.codehaus.plexus.classworlds.launcher.Launcher.launch(Launcher.java:238)
	at jenkins.maven3.agent.Maven33Main.launch(Maven33Main.java:176)
	at sun.reflect.NativeMethodAccessorImpl.invoke0(Native Method)
	at sun.reflect.NativeMethodAccessorImpl.invoke(NativeMethodAccessorImpl.java:62)
	at sun.reflect.DelegatingMethodAccessorImpl.invoke(DelegatingMethodAccessorImpl.java:43)
	at java.lang.reflect.Method.invoke(Method.java:498)
	at hudson.maven.Maven3Builder.call(Maven3Builder.java:139)
	at hudson.maven.Maven3Builder.call(Maven3Builder.java:70)
	at hudson.remoting.UserRequest.perform(UserRequest.java:153)
	at hudson.remoting.UserRequest.perform(UserRequest.java:50)
	at hudson.remoting.Request$2.run(Request.java:336)
	at hudson.remoting.InterceptingExecutorService$1.call(InterceptingExecutorService.java:68)
	at java.util.concurrent.FutureTask.run(FutureTask.java:266)
	at java.util.concurrent.ThreadPoolExecutor.runWorker(ThreadPoolExecutor.java:1149)
	at java.util.concurrent.ThreadPoolExecutor$Worker.run(ThreadPoolExecutor.java:624)
	at java.lang.Thread.run(Thread.java:748)
Caused by: org.apache.maven.plugin.PluginExecutionException: Execution findbugs of goal org.codehaus.mojo:findbugs-maven-plugin:3.0.4:findbugs
failed: Plugin org.codehaus.mojo:findbugs-maven-plugin:3.0.4 or one of its dependencies could
not be resolved: Could not transfer artifact org.apache.ant:ant:jar:1.9.4 from/to central
(https://repo.maven.apache.org/maven2): GET request of: org/apache/ant/ant/1.9.4/ant-1.9.4.jar
from central failed
	at org.apache.maven.plugin.DefaultBuildPluginManager.executeMojo(DefaultBuildPluginManager.java:106)
	at org.apache.maven.lifecycle.internal.MojoExecutor.execute(MojoExecutor.java:208)
	... 35 more
Caused by: org.apache.maven.plugin.PluginResolutionException: Plugin org.codehaus.mojo:findbugs-maven-plugin:3.0.4
or one of its dependencies could not be resolved: Could not transfer artifact org.apache.ant:ant:jar:1.9.4
from/to central (https://repo.maven.apache.org/maven2): GET request of: org/apache/ant/ant/1.9.4/ant-1.9.4.jar
from central failed
	at org.apache.maven.plugin.internal.DefaultPluginDependenciesResolver.resolveInternal(DefaultPluginDependenciesResolver.java:218)
	at org.apache.maven.plugin.internal.DefaultPluginDependenciesResolver.resolve(DefaultPluginDependenciesResolver.java:149)
	at org.apache.maven.plugin.internal.DefaultMavenPluginManager.createPluginRealm(DefaultMavenPluginManager.java:422)
	at org.apache.maven.plugin.internal.DefaultMavenPluginManager.setupPluginRealm(DefaultMavenPluginManager.java:385)
	at org.apache.maven.plugin.DefaultBuildPluginManager.getPluginRealm(DefaultBuildPluginManager.java:231)
	at org.apache.maven.plugin.DefaultBuildPluginManager.executeMojo(DefaultBuildPluginManager.java:102)
	... 36 more
Caused by: org.eclipse.aether.resolution.ArtifactResolutionException: Could not transfer artifact
org.apache.ant:ant:jar:1.9.4 from/to central (https://repo.maven.apache.org/maven2): GET request
of: org/apache/ant/ant/1.9.4/ant-1.9.4.jar from central failed
	at org.eclipse.aether.internal.impl.DefaultArtifactResolver.resolve(DefaultArtifactResolver.java:444)
	at org.eclipse.aether.internal.impl.DefaultArtifactResolver.resolveArtifacts(DefaultArtifactResolver.java:246)
	at org.eclipse.aether.internal.impl.DefaultRepositorySystem.resolveDependencies(DefaultRepositorySystem.java:367)
	at org.apache.maven.plugin.internal.DefaultPluginDependenciesResolver.resolveInternal(DefaultPluginDependenciesResolver.java:210)
	... 41 more
Caused by: org.eclipse.aether.transfer.ArtifactTransferException: Could not transfer artifact
org.apache.ant:ant:jar:1.9.4 from/to central (https://repo.maven.apache.org/maven2): GET request
of: org/apache/ant/ant/1.9.4/ant-1.9.4.jar from central failed
	at org.eclipse.aether.connector.basic.ArtifactTransportListener.transferFailed(ArtifactTransportListener.java:43)
	at org.eclipse.aether.connector.basic.BasicRepositoryConnector$TaskRunner.run(BasicRepositoryConnector.java:355)
	at org.eclipse.aether.util.concurrency.RunnableErrorForwarder$1.run(RunnableErrorForwarder.java:67)
	... 3 more
Caused by: org.apache.maven.wagon.TransferFailedException: GET request of: org/apache/ant/ant/1.9.4/ant-1.9.4.jar
from central failed
	at org.apache.maven.wagon.AbstractWagon.getTransfer(AbstractWagon.java:363)
	at org.apache.maven.wagon.AbstractWagon.getTransfer(AbstractWagon.java:316)
	at org.apache.maven.wagon.AbstractWagon.getTransfer(AbstractWagon.java:285)
	at org.apache.maven.wagon.StreamWagon.getIfNewer(StreamWagon.java:97)
	at org.apache.maven.wagon.StreamWagon.get(StreamWagon.java:61)
	at org.eclipse.aether.transport.wagon.WagonTransporter$GetTaskRunner.run(WagonTransporter.java:560)
	at org.eclipse.aether.transport.wagon.WagonTransporter.execute(WagonTransporter.java:427)
	at org.eclipse.aether.transport.wagon.WagonTransporter.get(WagonTransporter.java:404)
	at org.eclipse.aether.connector.basic.BasicRepositoryConnector$GetTaskRunner.runTask(BasicRepositoryConnector.java:447)
	at org.eclipse.aether.connector.basic.BasicRepositoryConnector$TaskRunner.run(BasicRepositoryConnector.java:350)
	... 4 more
Caused by: java.net.SocketException: Connection reset
	at java.net.SocketInputStream.read(SocketInputStream.java:210)
	at java.net.SocketInputStream.read(SocketInputStream.java:141)
	at sun.security.ssl.InputRecord.readFully(InputRecord.java:465)
	at sun.security.ssl.InputRecord.readV3Record(InputRecord.java:593)
	at sun.security.ssl.InputRecord.read(InputRecord.java:532)
	at sun.security.ssl.SSLSocketImpl.readRecord(SSLSocketImpl.java:983)
	at sun.security.ssl.SSLSocketImpl.readDataRecord(SSLSocketImpl.java:940)
	at sun.security.ssl.AppInputStream.read(AppInputStream.java:105)
	at org.apache.maven.wagon.providers.http.httpclient.impl.io.SessionInputBufferImpl.streamRead(SessionInputBufferImpl.java:136)
	at org.apache.maven.wagon.providers.http.httpclient.impl.io.SessionInputBufferImpl.read(SessionInputBufferImpl.java:195)
	at org.apache.maven.wagon.providers.http.httpclient.impl.io.ContentLengthInputStream.read(ContentLengthInputStream.java:178)
	at org.apache.maven.wagon.providers.http.httpclient.conn.EofSensorInputStream.read(EofSensorInputStream.java:137)
	at org.apache.maven.wagon.AbstractWagon.transfer(AbstractWagon.java:531)
	at org.apache.maven.wagon.AbstractWagon.getTransfer(AbstractWagon.java:353)
	... 13 more
2017-09-18T13:34:30.998 [ERROR] 
2017-09-18T13:34:30.998 [ERROR] Re-run Maven using the -X switch to enable full debug logging.
2017-09-18T13:34:30.998 [ERROR] 
2017-09-18T13:34:30.998 [ERROR] For more information about the errors and possible solutions,
please read the following articles:
2017-09-18T13:34:30.998 [ERROR] [Help 1] http://cwiki.apache.org/confluence/display/MAVEN/PluginResolutionException
2017-09-18T13:34:30.998 [ERROR] 
2017-09-18T13:34:30.998 [ERROR] After correcting the problems, you can resume the build with
the command
2017-09-18T13:34:30.998 [ERROR]   mvn <goals> -rf :beam-sdks-common-runner-api
channel stopped
Not sending mail to unregistered user echauchot@gmail.com+jbonofre@apache.org

Mime
View raw message