beam-commits mailing list archives

Site index · List index
Message view « Date » · « Thread »
Top « Date » · « Thread »
From Apache Jenkins Server <jenk...@builds.apache.org>
Subject Build failed in Jenkins: beam_PostCommit_Java_MavenInstall #4758
Date Sun, 10 Sep 2017 05:40:13 GMT
See <https://builds.apache.org/job/beam_PostCommit_Java_MavenInstall/4758/display/redirect?page=changes>

Changes:

[jbonofre] Add license-maven-plugin and some default license merges

------------------------------------------
[...truncated 1.26 MB...]
2017-09-10T05:39:20.320 [INFO] Downloading: https://repo.maven.apache.org/maven2/org/iq80/snappy/snappy/0.2/snappy-0.2.jar
2017-09-10T05:39:20.350 [INFO] Downloaded: https://repo.maven.apache.org/maven2/org/iq80/snappy/snappy/0.2/snappy-0.2.jar
(48 KB at 19.9 KB/sec)
2017-09-10T05:39:20.350 [INFO] Downloading: https://repo.maven.apache.org/maven2/org/apache/logging/log4j/log4j-web/2.4.1/log4j-web-2.4.1.jar
2017-09-10T05:39:20.379 [INFO] Downloaded: https://repo.maven.apache.org/maven2/org/apache/logging/log4j/log4j-web/2.4.1/log4j-web-2.4.1.jar
(24 KB at 9.6 KB/sec)
2017-09-10T05:39:20.379 [INFO] Downloading: https://repo.maven.apache.org/maven2/org/json/json/20090211/json-20090211.jar
2017-09-10T05:39:20.409 [INFO] Downloaded: https://repo.maven.apache.org/maven2/org/json/json/20090211/json-20090211.jar
(45 KB at 18.3 KB/sec)
2017-09-10T05:39:20.409 [INFO] Downloading: https://repo.maven.apache.org/maven2/io/dropwizard/metrics/metrics-json/3.1.0/metrics-json-3.1.0.jar
2017-09-10T05:39:20.436 [INFO] Downloaded: https://repo.maven.apache.org/maven2/io/dropwizard/metrics/metrics-json/3.1.0/metrics-json-3.1.0.jar
(16 KB at 6.2 KB/sec)
2017-09-10T05:39:20.436 [INFO] Downloading: https://repo.maven.apache.org/maven2/com/github/joshelser/dropwizard-metrics-hadoop-metrics2-reporter/0.1.0/dropwizard-metrics-hadoop-metrics2-reporter-0.1.0.jar
2017-09-10T05:39:20.448 [INFO] Downloaded: https://repo.maven.apache.org/maven2/org/apache/hive/hive-exec/2.1.0/hive-exec-2.1.0-tests.jar
(1253 KB at 502.4 KB/sec)
2017-09-10T05:39:20.448 [INFO] Downloading: https://repo.maven.apache.org/maven2/org/apache/hive/hive-cli/2.1.0/hive-cli-2.1.0.jar
2017-09-10T05:39:20.463 [INFO] Downloaded: https://repo.maven.apache.org/maven2/com/github/joshelser/dropwizard-metrics-hadoop-metrics2-reporter/0.1.0/dropwizard-metrics-hadoop-metrics2-reporter-0.1.0.jar
(15 KB at 5.9 KB/sec)
2017-09-10T05:39:20.463 [INFO] Downloading: https://repo.maven.apache.org/maven2/org/apache/hive/hive-serde/2.1.0/hive-serde-2.1.0.jar
2017-09-10T05:39:20.470 [INFO] Downloaded: https://repo.maven.apache.org/maven2/org/apache/hive/hive-orc/2.1.0/hive-orc-2.1.0.jar
(669 KB at 265.8 KB/sec)
2017-09-10T05:39:20.470 [INFO] Downloading: https://repo.maven.apache.org/maven2/org/apache/hive/hive-service-rpc/2.1.0/hive-service-rpc-2.1.0.jar
2017-09-10T05:39:20.487 [INFO] Downloaded: https://repo.maven.apache.org/maven2/org/apache/hive/hive-cli/2.1.0/hive-cli-2.1.0.jar
(42 KB at 16.5 KB/sec)
2017-09-10T05:39:20.488 [INFO] Downloading: https://repo.maven.apache.org/maven2/org/apache/parquet/parquet-hadoop-bundle/1.8.1/parquet-hadoop-bundle-1.8.1.jar
2017-09-10T05:39:20.650 [INFO] Downloaded: https://repo.maven.apache.org/maven2/org/apache/hive/hive-serde/2.1.0/hive-serde-2.1.0.jar
(895 KB at 331.8 KB/sec)
2017-09-10T05:39:20.650 [INFO] Downloading: https://repo.maven.apache.org/maven2/org/apache/hive/hive-service/2.1.0/hive-service-2.1.0.jar
2017-09-10T05:39:20.800 [INFO] Downloaded: https://repo.maven.apache.org/maven2/org/apache/hive/hive-service/2.1.0/hive-service-2.1.0.jar
(472 KB at 165.9 KB/sec)
2017-09-10T05:39:20.800 [INFO] Downloading: https://repo.maven.apache.org/maven2/org/apache/hive/hive-llap-server/2.1.0/hive-llap-server-2.1.0.jar
2017-09-10T05:39:20.914 [INFO] Downloaded: https://repo.maven.apache.org/maven2/org/apache/hive/hive-service-rpc/2.1.0/hive-service-rpc-2.1.0.jar
(1503 KB at 507.7 KB/sec)
2017-09-10T05:39:20.914 [INFO] Downloading: https://repo.maven.apache.org/maven2/org/apache/slider/slider-core/0.90.2-incubating/slider-core-0.90.2-incubating.jar
2017-09-10T05:39:20.994 [INFO] Downloaded: https://repo.maven.apache.org/maven2/org/apache/hive/hive-llap-server/2.1.0/hive-llap-server-2.1.0.jar
(545 KB at 179.2 KB/sec)
2017-09-10T05:39:20.994 [INFO] Downloading: https://repo.maven.apache.org/maven2/com/beust/jcommander/1.30/jcommander-1.30.jar
2017-09-10T05:39:20.999 [INFO] Downloaded: https://repo.maven.apache.org/maven2/org/apache/parquet/parquet-hadoop-bundle/1.8.1/parquet-hadoop-bundle-1.8.1.jar
(2835 KB at 931.1 KB/sec)
2017-09-10T05:39:20.999 [INFO] Downloading: https://repo.maven.apache.org/maven2/org/apache/hadoop/hadoop-yarn-registry/2.7.1/hadoop-yarn-registry-2.7.1.jar
2017-09-10T05:39:21.040 [INFO] Downloaded: https://repo.maven.apache.org/maven2/com/beust/jcommander/1.30/jcommander-1.30.jar
(59 KB at 19.1 KB/sec)
2017-09-10T05:39:21.040 [INFO] Downloading: https://repo.maven.apache.org/maven2/org/apache/hbase/hbase-hadoop2-compat/1.1.1/hbase-hadoop2-compat-1.1.1.jar
2017-09-10T05:39:21.049 [INFO] Downloaded: https://repo.maven.apache.org/maven2/org/apache/hadoop/hadoop-yarn-registry/2.7.1/hadoop-yarn-registry-2.7.1.jar
(96 KB at 30.9 KB/sec)
2017-09-10T05:39:21.049 [INFO] Downloading: https://repo.maven.apache.org/maven2/org/apache/hbase/hbase-server/1.1.1/hbase-server-1.1.1.jar
2017-09-10T05:39:21.081 [INFO] Downloaded: https://repo.maven.apache.org/maven2/org/apache/hbase/hbase-hadoop2-compat/1.1.1/hbase-hadoop2-compat-1.1.1.jar
(80 KB at 25.4 KB/sec)
2017-09-10T05:39:21.081 [INFO] Downloading: https://repo.maven.apache.org/maven2/org/apache/hbase/hbase-procedure/1.1.1/hbase-procedure-1.1.1.jar
2017-09-10T05:39:21.135 [INFO] Downloaded: https://repo.maven.apache.org/maven2/org/apache/hbase/hbase-procedure/1.1.1/hbase-procedure-1.1.1.jar
(100 KB at 31.3 KB/sec)
2017-09-10T05:39:21.135 [INFO] Downloading: https://repo.maven.apache.org/maven2/org/apache/hbase/hbase-common/1.1.1/hbase-common-1.1.1-tests.jar
2017-09-10T05:39:21.196 [INFO] Downloaded: https://repo.maven.apache.org/maven2/org/apache/slider/slider-core/0.90.2-incubating/slider-core-0.90.2-incubating.jar
(1744 KB at 537.9 KB/sec)
2017-09-10T05:39:21.196 [INFO] Downloading: https://repo.maven.apache.org/maven2/org/apache/hbase/hbase-prefix-tree/1.1.1/hbase-prefix-tree-1.1.1.jar
2017-09-10T05:39:21.213 [INFO] Downloaded: https://repo.maven.apache.org/maven2/org/apache/hbase/hbase-common/1.1.1/hbase-common-1.1.1-tests.jar
(206 KB at 63.0 KB/sec)
2017-09-10T05:39:21.213 [INFO] Downloading: https://repo.maven.apache.org/maven2/org/apache/hbase/hbase-hadoop-compat/1.1.1/hbase-hadoop-compat-1.1.1.jar
2017-09-10T05:39:21.244 [INFO] Downloaded: https://repo.maven.apache.org/maven2/org/apache/hbase/hbase-hadoop-compat/1.1.1/hbase-hadoop-compat-1.1.1.jar
(36 KB at 10.7 KB/sec)
2017-09-10T05:39:21.244 [INFO] Downloading: https://repo.maven.apache.org/maven2/javax/servlet/jsp-api/2.0/jsp-api-2.0.jar
2017-09-10T05:39:21.247 [INFO] Downloaded: https://repo.maven.apache.org/maven2/org/apache/hbase/hbase-prefix-tree/1.1.1/hbase-prefix-tree-1.1.1.jar
(100 KB at 30.3 KB/sec)
2017-09-10T05:39:21.247 [INFO] Downloading: https://repo.maven.apache.org/maven2/org/jamon/jamon-runtime/2.3.1/jamon-runtime-2.3.1.jar
2017-09-10T05:39:21.278 [INFO] Downloaded: https://repo.maven.apache.org/maven2/org/jamon/jamon-runtime/2.3.1/jamon-runtime-2.3.1.jar
(21 KB at 6.1 KB/sec)
2017-09-10T05:39:21.278 [INFO] Downloading: https://repo.maven.apache.org/maven2/org/apache/thrift/libthrift/0.9.3/libthrift-0.9.3.jar
2017-09-10T05:39:21.279 [INFO] Downloaded: https://repo.maven.apache.org/maven2/javax/servlet/jsp-api/2.0/jsp-api-2.0.jar
(50 KB at 14.8 KB/sec)
2017-09-10T05:39:21.364 [INFO] Downloaded: https://repo.maven.apache.org/maven2/org/apache/thrift/libthrift/0.9.3/libthrift-0.9.3.jar
(229 KB at 67.1 KB/sec)
2017-09-10T05:39:21.720 [INFO] Downloaded: https://repo.maven.apache.org/maven2/org/apache/hbase/hbase-server/1.1.1/hbase-server-1.1.1.jar
(3878 KB at 1029.8 KB/sec)
2017-09-10T05:39:22.174 [INFO] Downloaded: https://repo.maven.apache.org/maven2/it/unimi/dsi/fastutil/6.5.6/fastutil-6.5.6.jar
(16502 KB at 3910.4 KB/sec)
2017-09-10T05:39:22.489 [INFO] Downloaded: https://repo.maven.apache.org/maven2/org/apache/hive/hive-exec/2.1.0/hive-exec-2.1.0.jar
(31655 KB at 6966.3 KB/sec)
2017-09-10T05:39:22.506 [INFO] Downloading: http://www.datanucleus.org/downloads/maven2/org/apache/ivy/ivy/2.4.0/ivy-2.4.0.jar
2017-09-10T05:39:22.509 [INFO] Downloading: http://www.datanucleus.org/downloads/maven2/org/pentaho/pentaho-aggdesigner-algorithm/5.1.5-jhyde/pentaho-aggdesigner-algorithm-5.1.5-jhyde.jar
2017-09-10T05:39:22.822 [INFO] Downloading: http://conjars.org/repo/org/pentaho/pentaho-aggdesigner-algorithm/5.1.5-jhyde/pentaho-aggdesigner-algorithm-5.1.5-jhyde.jar
2017-09-10T05:39:22.893 [INFO] Downloaded: http://conjars.org/repo/org/pentaho/pentaho-aggdesigner-algorithm/5.1.5-jhyde/pentaho-aggdesigner-algorithm-5.1.5-jhyde.jar
(0 B at 0.0 KB/sec)
[JENKINS] Archiving disabled
2017-09-10T05:39:23.798 [INFO]                                                           
             
2017-09-10T05:39:23.798 [INFO] ------------------------------------------------------------------------
2017-09-10T05:39:23.798 [INFO] Skipping Apache Beam :: Parent
2017-09-10T05:39:23.798 [INFO] This project has been banned from the build due to previous
failures.
2017-09-10T05:39:23.798 [INFO] ------------------------------------------------------------------------
[JENKINS] Archiving disabled
[JENKINS] Archiving disabled
[JENKINS] Archiving disabled
[JENKINS] Archiving disabled
[JENKINS] Archiving disabled
[JENKINS] Archiving disabled
[JENKINS] Archiving disabled
[JENKINS] Archiving disabled
[JENKINS] Archiving disabled
[JENKINS] Archiving disabled
[JENKINS] Archiving disabled
[JENKINS] Archiving disabled
[JENKINS] Archiving disabled
[JENKINS] Archiving disabled
[JENKINS] Archiving disabled
[JENKINS] Archiving disabled
[JENKINS] Archiving disabled
[JENKINS] Archiving disabled
[JENKINS] Archiving disabled
[JENKINS] Archiving disabled
[JENKINS] Archiving disabled
[JENKINS] Archiving disabled
[JENKINS] Archiving disabled
[JENKINS] Archiving disabled
[JENKINS] Archiving disabled
[JENKINS] Archiving disabled
[JENKINS] Archiving disabled
[JENKINS] Archiving disabled
[JENKINS] Archiving disabled
[JENKINS] Archiving disabled
[JENKINS] Archiving disabled
[JENKINS] Archiving disabled
[JENKINS] Archiving disabled
[JENKINS] Archiving disabled
[JENKINS] Archiving disabled
[JENKINS] Archiving disabled
[JENKINS] Archiving disabled
[JENKINS] Archiving disabled
[JENKINS] Archiving disabled
[JENKINS] Archiving disabled
[JENKINS] Archiving disabled
[JENKINS] Archiving disabled
[JENKINS] Archiving disabled
[JENKINS] Archiving disabled
[JENKINS] Archiving disabled
[JENKINS] Archiving disabled
[JENKINS] Archiving disabled
[JENKINS] Archiving disabled
[JENKINS] Archiving disabled
[JENKINS] Archiving disabled
[JENKINS] Archiving disabled
[JENKINS] Archiving disabled
[JENKINS] Archiving disabled
[JENKINS] Archiving disabled
[JENKINS] Archiving disabled
[JENKINS] Archiving disabled
2017-09-10T05:39:59.161 [INFO] ------------------------------------------------------------------------
2017-09-10T05:39:59.161 [INFO] Reactor Summary:
2017-09-10T05:39:59.161 [INFO] 
2017-09-10T05:39:59.162 [INFO] Apache Beam :: Parent .............................. SUCCESS
[ 28.518 s]
2017-09-10T05:39:59.162 [INFO] Apache Beam :: SDKs :: Java :: Build Tools ......... SUCCESS
[ 12.537 s]
2017-09-10T05:39:59.162 [INFO] Apache Beam :: SDKs ................................ SUCCESS
[  5.778 s]
2017-09-10T05:39:59.162 [INFO] Apache Beam :: SDKs :: Common ...................... SUCCESS
[  2.916 s]
2017-09-10T05:39:59.162 [INFO] Apache Beam :: SDKs :: Common :: Runner API ........ SUCCESS
[ 27.218 s]
2017-09-10T05:39:59.162 [INFO] Apache Beam :: SDKs :: Common :: Fn API ............ SUCCESS
[ 19.507 s]
2017-09-10T05:39:59.162 [INFO] Apache Beam :: SDKs :: Java ........................ SUCCESS
[  3.561 s]
2017-09-10T05:39:59.162 [INFO] Apache Beam :: SDKs :: Java :: Core ................ SUCCESS
[02:33 min]
2017-09-10T05:39:59.162 [INFO] Apache Beam :: Runners ............................. SUCCESS
[  3.728 s]
2017-09-10T05:39:59.162 [INFO] Apache Beam :: Runners :: Core Construction Java ... SUCCESS
[ 31.653 s]
2017-09-10T05:39:59.162 [INFO] Apache Beam :: Runners :: Core Java ................ SUCCESS
[ 50.256 s]
2017-09-10T05:39:59.162 [INFO] Apache Beam :: Runners :: Direct Java .............. SUCCESS
[04:49 min]
2017-09-10T05:39:59.162 [INFO] Apache Beam :: SDKs :: Java :: IO .................. SUCCESS
[  3.081 s]
2017-09-10T05:39:59.162 [INFO] Apache Beam :: SDKs :: Java :: IO :: AMQP .......... SUCCESS
[ 36.355 s]
2017-09-10T05:39:59.162 [INFO] Apache Beam :: SDKs :: Java :: IO :: Common ........ SUCCESS
[  6.690 s]
2017-09-10T05:39:59.162 [INFO] Apache Beam :: SDKs :: Java :: IO :: Cassandra ..... SUCCESS
[ 23.888 s]
2017-09-10T05:39:59.162 [INFO] Apache Beam :: SDKs :: Java :: IO :: Elasticsearch . SUCCESS
[ 34.662 s]
2017-09-10T05:39:59.162 [INFO] Apache Beam :: SDKs :: Java :: Extensions .......... SUCCESS
[  2.891 s]
2017-09-10T05:39:59.162 [INFO] Apache Beam :: SDKs :: Java :: Extensions :: Google Cloud Platform
Core SUCCESS [ 24.826 s]
2017-09-10T05:39:59.162 [INFO] Apache Beam :: SDKs :: Java :: Extensions :: Protobuf SUCCESS
[ 19.944 s]
2017-09-10T05:39:59.162 [INFO] Apache Beam :: SDKs :: Java :: IO :: Google Cloud Platform
SUCCESS [01:22 min]
2017-09-10T05:39:59.162 [INFO] Apache Beam :: SDKs :: Java :: IO :: Hadoop Common . SUCCESS
[ 19.351 s]
2017-09-10T05:39:59.162 [INFO] Apache Beam :: SDKs :: Java :: IO :: Hadoop File System SUCCESS
[ 41.084 s]
2017-09-10T05:39:59.162 [INFO] Apache Beam :: SDKs :: Java :: IO :: Hadoop ........ SUCCESS
[  5.621 s]
2017-09-10T05:39:59.162 [INFO] Apache Beam :: SDKs :: Java :: IO :: Hadoop :: input-format
SUCCESS [ 18.912 s]
2017-09-10T05:39:59.162 [INFO] Apache Beam :: Runners :: Google Cloud Dataflow .... SUCCESS
[07:23 min]
2017-09-10T05:39:59.162 [INFO] Apache Beam :: SDKs :: Java :: IO :: Hadoop :: jdk1.8-tests
SUCCESS [01:40 min]
2017-09-10T05:39:59.162 [INFO] Apache Beam :: SDKs :: Java :: IO :: HBase ......... SUCCESS
[01:37 min]
2017-09-10T05:39:59.162 [INFO] Apache Beam :: SDKs :: Java :: IO :: HCatalog ...... FAILURE
[  8.577 s]
2017-09-10T05:39:59.162 [INFO] Apache Beam :: SDKs :: Java :: IO :: JDBC .......... SKIPPED
2017-09-10T05:39:59.162 [INFO] Apache Beam :: SDKs :: Java :: IO :: JMS ........... SKIPPED
2017-09-10T05:39:59.162 [INFO] Apache Beam :: SDKs :: Java :: IO :: Kafka ......... SKIPPED
2017-09-10T05:39:59.162 [INFO] Apache Beam :: SDKs :: Java :: IO :: Kinesis ....... SKIPPED
2017-09-10T05:39:59.162 [INFO] Apache Beam :: SDKs :: Java :: IO :: MongoDB ....... SKIPPED
2017-09-10T05:39:59.162 [INFO] Apache Beam :: SDKs :: Java :: IO :: MQTT .......... SKIPPED
2017-09-10T05:39:59.162 [INFO] Apache Beam :: SDKs :: Java :: IO :: Solr .......... SKIPPED
2017-09-10T05:39:59.162 [INFO] Apache Beam :: SDKs :: Java :: IO :: XML ........... SKIPPED
2017-09-10T05:39:59.162 [INFO] Apache Beam :: SDKs :: Java :: Maven Archetypes .... SKIPPED
2017-09-10T05:39:59.162 [INFO] Apache Beam :: SDKs :: Java :: Maven Archetypes :: Starter
SKIPPED
2017-09-10T05:39:59.162 [INFO] Apache Beam :: Examples ............................ SKIPPED
2017-09-10T05:39:59.162 [INFO] Apache Beam :: Examples :: Java .................... SKIPPED
2017-09-10T05:39:59.162 [INFO] Apache Beam :: SDKs :: Java :: Maven Archetypes :: Examples
SKIPPED
2017-09-10T05:39:59.162 [INFO] Apache Beam :: Examples :: Java 8 .................. SKIPPED
2017-09-10T05:39:59.162 [INFO] Apache Beam :: SDKs :: Java :: Maven Archetypes :: Examples
- Java 8 SKIPPED
2017-09-10T05:39:59.162 [INFO] Apache Beam :: SDKs :: Java :: Extensions :: Jackson SKIPPED
2017-09-10T05:39:59.162 [INFO] Apache Beam :: SDKs :: Java :: Extensions :: Join library SKIPPED
2017-09-10T05:39:59.162 [INFO] Apache Beam :: SDKs :: Java :: Extensions :: Sorter  SKIPPED
2017-09-10T05:39:59.162 [INFO] Apache Beam :: SDKs :: Java :: Nexmark ............. SKIPPED
2017-09-10T05:39:59.162 [INFO] Apache Beam :: SDKs :: Java :: Harness ............. SKIPPED
2017-09-10T05:39:59.162 [INFO] Apache Beam :: SDKs :: Java :: Java 8 Tests ........ SKIPPED
2017-09-10T05:39:59.162 [INFO] Apache Beam :: SDKs :: Python ...................... SKIPPED
2017-09-10T05:39:59.162 [INFO] Apache Beam :: Runners :: Flink .................... SKIPPED
2017-09-10T05:39:59.162 [INFO] Apache Beam :: Runners :: Spark .................... SKIPPED
2017-09-10T05:39:59.162 [INFO] Apache Beam :: Runners :: Apex ..................... SKIPPED
2017-09-10T05:39:59.162 [INFO] Apache Beam :: Runners :: Gearpump ................. SKIPPED
2017-09-10T05:39:59.162 [INFO] Apache Beam :: SDKs :: Java :: Aggregated Javadoc .. SKIPPED
2017-09-10T05:39:59.162 [INFO] ------------------------------------------------------------------------
2017-09-10T05:39:59.162 [INFO] BUILD FAILURE
2017-09-10T05:39:59.162 [INFO] ------------------------------------------------------------------------
2017-09-10T05:39:59.163 [INFO] Total time: 27:58 min
2017-09-10T05:39:59.163 [INFO] Finished at: 2017-09-10T05:39:59+00:00
2017-09-10T05:39:59.898 [INFO] Final Memory: 240M/1552M
2017-09-10T05:39:59.898 [INFO] ------------------------------------------------------------------------
Waiting for Jenkins to finish collecting data
2017-09-10T05:40:00.597 [ERROR] Failed to execute goal on project beam-sdks-java-io-hcatalog:
Could not resolve dependencies for project org.apache.beam:beam-sdks-java-io-hcatalog:jar:2.2.0-SNAPSHOT:
Failure to transfer org.apache.ivy:ivy:jar:2.4.0 from https://repo.maven.apache.org/maven2
was cached in the local repository, resolution will not be reattempted until the update interval
of central has elapsed or updates are forced. Original error: Could not transfer artifact
org.apache.ivy:ivy:jar:2.4.0 from/to central (https://repo.maven.apache.org/maven2): GET request
of: org/apache/ivy/ivy/2.4.0/ivy-2.4.0.jar from central failed -> [Help 1]
org.apache.maven.lifecycle.LifecycleExecutionException: Failed to execute goal on project
beam-sdks-java-io-hcatalog: Could not resolve dependencies for project org.apache.beam:beam-sdks-java-io-hcatalog:jar:2.2.0-SNAPSHOT:
Failure to transfer org.apache.ivy:ivy:jar:2.4.0 from https://repo.maven.apache.org/maven2
was cached in the local repository, resolution will not be reattempted until the update interval
of central has elapsed or updates are forced. Original error: Could not transfer artifact
org.apache.ivy:ivy:jar:2.4.0 from/to central (https://repo.maven.apache.org/maven2): GET request
of: org/apache/ivy/ivy/2.4.0/ivy-2.4.0.jar from central failed
	at org.apache.maven.lifecycle.internal.LifecycleDependencyResolver.getDependencies(LifecycleDependencyResolver.java:221)
	at org.apache.maven.lifecycle.internal.LifecycleDependencyResolver.resolveProjectDependencies(LifecycleDependencyResolver.java:127)
	at org.apache.maven.lifecycle.internal.MojoExecutor.ensureDependenciesAreResolved(MojoExecutor.java:257)
	at org.apache.maven.lifecycle.internal.MojoExecutor.execute(MojoExecutor.java:200)
	at org.apache.maven.lifecycle.internal.MojoExecutor.execute(MojoExecutor.java:153)
	at org.apache.maven.lifecycle.internal.MojoExecutor.execute(MojoExecutor.java:145)
	at org.apache.maven.lifecycle.internal.LifecycleModuleBuilder.buildProject(LifecycleModuleBuilder.java:116)
	at org.apache.maven.lifecycle.internal.LifecycleModuleBuilder.buildProject(LifecycleModuleBuilder.java:80)
	at org.apache.maven.lifecycle.internal.builder.singlethreaded.SingleThreadedBuilder.build(SingleThreadedBuilder.java:51)
	at org.apache.maven.lifecycle.internal.LifecycleStarter.execute(LifecycleStarter.java:128)
	at org.apache.maven.DefaultMaven.doExecute(DefaultMaven.java:307)
	at org.apache.maven.DefaultMaven.doExecute(DefaultMaven.java:193)
	at org.apache.maven.DefaultMaven.execute(DefaultMaven.java:106)
	at org.jvnet.hudson.maven3.launcher.Maven33Launcher.main(Maven33Launcher.java:129)
	at sun.reflect.NativeMethodAccessorImpl.invoke0(Native Method)
	at sun.reflect.NativeMethodAccessorImpl.invoke(NativeMethodAccessorImpl.java:62)
	at sun.reflect.DelegatingMethodAccessorImpl.invoke(DelegatingMethodAccessorImpl.java:43)
	at java.lang.reflect.Method.invoke(Method.java:498)
	at org.codehaus.plexus.classworlds.launcher.Launcher.launchStandard(Launcher.java:330)
	at org.codehaus.plexus.classworlds.launcher.Launcher.launch(Launcher.java:238)
	at jenkins.maven3.agent.Maven33Main.launch(Maven33Main.java:176)
	at sun.reflect.NativeMethodAccessorImpl.invoke0(Native Method)
	at sun.reflect.NativeMethodAccessorImpl.invoke(NativeMethodAccessorImpl.java:62)
	at sun.reflect.DelegatingMethodAccessorImpl.invoke(DelegatingMethodAccessorImpl.java:43)
	at java.lang.reflect.Method.invoke(Method.java:498)
	at hudson.maven.Maven3Builder.call(Maven3Builder.java:139)
	at hudson.maven.Maven3Builder.call(Maven3Builder.java:70)
	at hudson.remoting.UserRequest.perform(UserRequest.java:153)
	at hudson.remoting.UserRequest.perform(UserRequest.java:50)
	at hudson.remoting.Request$2.run(Request.java:336)
	at hudson.remoting.InterceptingExecutorService$1.call(InterceptingExecutorService.java:68)
	at java.util.concurrent.FutureTask.run(FutureTask.java:266)
	at java.util.concurrent.ThreadPoolExecutor.runWorker(ThreadPoolExecutor.java:1149)
	at java.util.concurrent.ThreadPoolExecutor$Worker.run(ThreadPoolExecutor.java:624)
	at java.lang.Thread.run(Thread.java:748)
Caused by: org.apache.maven.project.DependencyResolutionException: Could not resolve dependencies
for project org.apache.beam:beam-sdks-java-io-hcatalog:jar:2.2.0-SNAPSHOT: Failure to transfer
org.apache.ivy:ivy:jar:2.4.0 from https://repo.maven.apache.org/maven2 was cached in the local
repository, resolution will not be reattempted until the update interval of central has elapsed
or updates are forced. Original error: Could not transfer artifact org.apache.ivy:ivy:jar:2.4.0
from/to central (https://repo.maven.apache.org/maven2): GET request of: org/apache/ivy/ivy/2.4.0/ivy-2.4.0.jar
from central failed
	at org.apache.maven.project.DefaultProjectDependenciesResolver.resolve(DefaultProjectDependenciesResolver.java:211)
	at org.apache.maven.lifecycle.internal.LifecycleDependencyResolver.getDependencies(LifecycleDependencyResolver.java:195)
	... 34 more
Caused by: org.eclipse.aether.resolution.DependencyResolutionException: Failure to transfer
org.apache.ivy:ivy:jar:2.4.0 from https://repo.maven.apache.org/maven2 was cached in the local
repository, resolution will not be reattempted until the update interval of central has elapsed
or updates are forced. Original error: Could not transfer artifact org.apache.ivy:ivy:jar:2.4.0
from/to central (https://repo.maven.apache.org/maven2): GET request of: org/apache/ivy/ivy/2.4.0/ivy-2.4.0.jar
from central failed
	at org.eclipse.aether.internal.impl.DefaultRepositorySystem.resolveDependencies(DefaultRepositorySystem.java:384)
	at org.apache.maven.project.DefaultProjectDependenciesResolver.resolve(DefaultProjectDependenciesResolver.java:205)
	... 35 more
Caused by: org.eclipse.aether.resolution.ArtifactResolutionException: Failure to transfer
org.apache.ivy:ivy:jar:2.4.0 from https://repo.maven.apache.org/maven2 was cached in the local
repository, resolution will not be reattempted until the update interval of central has elapsed
or updates are forced. Original error: Could not transfer artifact org.apache.ivy:ivy:jar:2.4.0
from/to central (https://repo.maven.apache.org/maven2): GET request of: org/apache/ivy/ivy/2.4.0/ivy-2.4.0.jar
from central failed
	at org.eclipse.aether.internal.impl.DefaultArtifactResolver.resolve(DefaultArtifactResolver.java:444)
	at org.eclipse.aether.internal.impl.DefaultArtifactResolver.resolveArtifacts(DefaultArtifactResolver.java:246)
	at org.eclipse.aether.internal.impl.DefaultRepositorySystem.resolveDependencies(DefaultRepositorySystem.java:367)
	... 36 more
Caused by: org.eclipse.aether.transfer.ArtifactTransferException: Failure to transfer org.apache.ivy:ivy:jar:2.4.0
from https://repo.maven.apache.org/maven2 was cached in the local repository, resolution will
not be reattempted until the update interval of central has elapsed or updates are forced.
Original error: Could not transfer artifact org.apache.ivy:ivy:jar:2.4.0 from/to central (https://repo.maven.apache.org/maven2):
GET request of: org/apache/ivy/ivy/2.4.0/ivy-2.4.0.jar from central failed
	at org.eclipse.aether.internal.impl.DefaultUpdateCheckManager.newException(DefaultUpdateCheckManager.java:238)
	at org.eclipse.aether.internal.impl.DefaultUpdateCheckManager.checkArtifact(DefaultUpdateCheckManager.java:183)
	at org.eclipse.aether.internal.impl.DefaultArtifactResolver.gatherDownloads(DefaultArtifactResolver.java:585)
	at org.eclipse.aether.internal.impl.DefaultArtifactResolver.performDownloads(DefaultArtifactResolver.java:503)
	at org.eclipse.aether.internal.impl.DefaultArtifactResolver.resolve(DefaultArtifactResolver.java:421)
	... 38 more
2017-09-10T05:40:00.599 [ERROR] 
2017-09-10T05:40:00.599 [ERROR] Re-run Maven using the -X switch to enable full debug logging.
2017-09-10T05:40:00.599 [ERROR] 
2017-09-10T05:40:00.599 [ERROR] For more information about the errors and possible solutions,
please read the following articles:
2017-09-10T05:40:00.599 [ERROR] [Help 1] http://cwiki.apache.org/confluence/display/MAVEN/DependencyResolutionException
2017-09-10T05:40:00.599 [ERROR] 
2017-09-10T05:40:00.599 [ERROR] After correcting the problems, you can resume the build with
the command
2017-09-10T05:40:00.599 [ERROR]   mvn <goals> -rf :beam-sdks-java-io-hcatalog
channel stopped

Mime
View raw message