beam-commits mailing list archives

Site index · List index
Message view « Date » · « Thread »
Top « Date » · « Thread »
From Apache Jenkins Server <jenk...@builds.apache.org>
Subject Build failed in Jenkins: beam_PostCommit_Java_MavenInstall #4801
Date Fri, 15 Sep 2017 18:02:36 GMT
See <https://builds.apache.org/job/beam_PostCommit_Java_MavenInstall/4801/display/redirect>

------------------------------------------
[...truncated 202.66 KB...]
2017-09-15T18:01:59.281 [INFO] Downloaded: https://repo.maven.apache.org/maven2/commons-logging/commons-logging/1.1/commons-logging-1.1.jar
(52 KB at 124.8 KB/sec)
2017-09-15T18:01:59.281 [INFO] Downloading: https://repo.maven.apache.org/maven2/org/apache/maven/wagon/wagon-provider-api/1.0/wagon-provider-api-1.0.jar
2017-09-15T18:01:59.281 [INFO] Downloaded: https://repo.maven.apache.org/maven2/antlr/antlr/2.7.2/antlr-2.7.2.jar
(350 KB at 843.1 KB/sec)
2017-09-15T18:01:59.281 [INFO] Downloading: https://repo.maven.apache.org/maven2/org/mortbay/jetty/jetty/6.1.25/jetty-6.1.25.jar
2017-09-15T18:01:59.290 [INFO] Downloaded: https://repo.maven.apache.org/maven2/org/apache/maven/doxia/doxia-integration-tools/1.7.1/doxia-integration-tools-1.7.1.jar
(46 KB at 108.2 KB/sec)
2017-09-15T18:01:59.290 [INFO] Downloading: https://repo.maven.apache.org/maven2/org/mortbay/jetty/servlet-api/2.5-20081211/servlet-api-2.5-20081211.jar
2017-09-15T18:01:59.294 [INFO] Downloaded: https://repo.maven.apache.org/maven2/org/apache/struts/struts-tiles/1.3.8/struts-tiles-1.3.8.jar
(117 KB at 273.0 KB/sec)
2017-09-15T18:01:59.294 [INFO] Downloading: https://repo.maven.apache.org/maven2/org/mortbay/jetty/jetty-util/6.1.25/jetty-util-6.1.25.jar
2017-09-15T18:01:59.313 [INFO] Downloaded: https://repo.maven.apache.org/maven2/org/apache/maven/wagon/wagon-provider-api/1.0/wagon-provider-api-1.0.jar
(52 KB at 116.2 KB/sec)
2017-09-15T18:01:59.313 [INFO] Downloading: https://repo.maven.apache.org/maven2/org/apache/commons/commons-lang3/3.4/commons-lang3-3.4.jar
2017-09-15T18:01:59.336 [INFO] Downloaded: https://repo.maven.apache.org/maven2/org/mortbay/jetty/jetty-util/6.1.25/jetty-util-6.1.25.jar
(174 KB at 368.1 KB/sec)
2017-09-15T18:01:59.337 [INFO] Downloading: https://repo.maven.apache.org/maven2/commons-io/commons-io/1.4/commons-io-1.4.jar
2017-09-15T18:01:59.350 [INFO] Downloaded: https://repo.maven.apache.org/maven2/org/mortbay/jetty/servlet-api/2.5-20081211/servlet-api-2.5-20081211.jar
(131 KB at 270.6 KB/sec)
2017-09-15T18:01:59.353 [INFO] Downloaded: https://repo.maven.apache.org/maven2/dom4j/dom4j/1.1/dom4j-1.1.jar
(447 KB at 916.2 KB/sec)
2017-09-15T18:01:59.366 [INFO] Downloaded: https://repo.maven.apache.org/maven2/org/mortbay/jetty/jetty/6.1.25/jetty-6.1.25.jar
(526 KB at 1051.9 KB/sec)
2017-09-15T18:01:59.373 [INFO] Downloaded: https://repo.maven.apache.org/maven2/commons-io/commons-io/1.4/commons-io-1.4.jar
(107 KB at 210.0 KB/sec)
2017-09-15T18:01:59.391 [INFO] Downloaded: https://repo.maven.apache.org/maven2/org/apache/commons/commons-lang3/3.4/commons-lang3-3.4.jar
(425 KB at 810.1 KB/sec)
[WARNING] Failed to getClass for org.apache.maven.plugins.site.descriptor.SiteDescriptorAttachMojo
[JENKINS] Archiving disabled
2017-09-15T18:02:01.886 [INFO]                                                           
             
2017-09-15T18:02:01.886 [INFO] ------------------------------------------------------------------------
2017-09-15T18:02:01.886 [INFO] Skipping Apache Beam :: Parent
2017-09-15T18:02:01.886 [INFO] This project has been banned from the build due to previous
failures.
2017-09-15T18:02:01.886 [INFO] ------------------------------------------------------------------------
[JENKINS] Archiving disabled
[JENKINS] Archiving disabled
[JENKINS] Archiving disabled
[JENKINS] Archiving disabled
[JENKINS] Archiving disabled
[JENKINS] Archiving disabled
[JENKINS] Archiving disabled
[JENKINS] Archiving disabled
[JENKINS] Archiving disabled
[JENKINS] Archiving disabled
[JENKINS] Archiving disabled
[JENKINS] Archiving disabled
[JENKINS] Archiving disabled
[JENKINS] Archiving disabled
[JENKINS] Archiving disabled
[JENKINS] Archiving disabled
[JENKINS] Archiving disabled
[JENKINS] Archiving disabled
[JENKINS] Archiving disabled
[JENKINS] Archiving disabled
[JENKINS] Archiving disabled
[JENKINS] Archiving disabled
[JENKINS] Archiving disabled
[JENKINS] Archiving disabled
[JENKINS] Archiving disabled
[JENKINS] Archiving disabled
[JENKINS] Archiving disabled
[JENKINS] Archiving disabled
[JENKINS] Archiving disabled
[JENKINS] Archiving disabled
[JENKINS] Archiving disabled
[JENKINS] Archiving disabled
[JENKINS] Archiving disabled
[JENKINS] Archiving disabled
[JENKINS] Archiving disabled
[JENKINS] Archiving disabled
[JENKINS] Archiving disabled
[JENKINS] Archiving disabled
[JENKINS] Archiving disabled
[JENKINS] Archiving disabled
[JENKINS] Archiving disabled
[JENKINS] Archiving disabled
[JENKINS] Archiving disabled
[JENKINS] Archiving disabled
[JENKINS] Archiving disabled
[JENKINS] Archiving disabled
[JENKINS] Archiving disabled
[JENKINS] Archiving disabled
[JENKINS] Archiving disabled
[JENKINS] Archiving disabled
[JENKINS] Archiving disabled
[JENKINS] Archiving disabled
[JENKINS] Archiving disabled
[JENKINS] Archiving disabled
[JENKINS] Archiving disabled
[JENKINS] Archiving disabled
[JENKINS] Archiving disabled
[JENKINS] Archiving disabled
[JENKINS] Archiving disabled
[JENKINS] Archiving disabled
[JENKINS] Archiving disabled
[JENKINS] Archiving disabled
2017-09-15T18:02:24.675 [INFO] ------------------------------------------------------------------------
2017-09-15T18:02:24.675 [INFO] Reactor Summary:
2017-09-15T18:02:24.675 [INFO] 
2017-09-15T18:02:24.676 [INFO] Apache Beam :: Parent .............................. FAILURE
[ 19.367 s]
2017-09-15T18:02:24.676 [INFO] Apache Beam :: SDKs :: Java :: Build Tools ......... SKIPPED
2017-09-15T18:02:24.676 [INFO] Apache Beam :: SDKs ................................ SKIPPED
2017-09-15T18:02:24.676 [INFO] Apache Beam :: SDKs :: Common ...................... SKIPPED
2017-09-15T18:02:24.676 [INFO] Apache Beam :: SDKs :: Common :: Runner API ........ SKIPPED
2017-09-15T18:02:24.676 [INFO] Apache Beam :: SDKs :: Common :: Fn API ............ SKIPPED
2017-09-15T18:02:24.676 [INFO] Apache Beam :: SDKs :: Java ........................ SKIPPED
2017-09-15T18:02:24.676 [INFO] Apache Beam :: SDKs :: Java :: Core ................ SKIPPED
2017-09-15T18:02:24.676 [INFO] Apache Beam :: Runners ............................. SKIPPED
2017-09-15T18:02:24.676 [INFO] Apache Beam :: Runners :: Core Construction Java ... SKIPPED
2017-09-15T18:02:24.676 [INFO] Apache Beam :: Runners :: Core Java ................ SKIPPED
2017-09-15T18:02:24.676 [INFO] Apache Beam :: Runners :: Direct Java .............. SKIPPED
2017-09-15T18:02:24.676 [INFO] Apache Beam :: SDKs :: Java :: IO .................. SKIPPED
2017-09-15T18:02:24.676 [INFO] Apache Beam :: SDKs :: Java :: IO :: AMQP .......... SKIPPED
2017-09-15T18:02:24.676 [INFO] Apache Beam :: SDKs :: Java :: IO :: Common ........ SKIPPED
2017-09-15T18:02:24.676 [INFO] Apache Beam :: SDKs :: Java :: IO :: Cassandra ..... SKIPPED
2017-09-15T18:02:24.676 [INFO] Apache Beam :: SDKs :: Java :: IO :: Elasticsearch . SKIPPED
2017-09-15T18:02:24.676 [INFO] Apache Beam :: SDKs :: Java :: IO :: Elasticsearch-Tests SKIPPED
2017-09-15T18:02:24.676 [INFO] Apache Beam :: SDKs :: Java :: IO :: Elasticsearch-Tests ::
Common SKIPPED
2017-09-15T18:02:24.676 [INFO] Apache Beam :: SDKs :: Java :: IO :: Elasticsearch-Tests ::
2.x SKIPPED
2017-09-15T18:02:24.676 [INFO] Apache Beam :: SDKs :: Java :: IO :: Elasticsearch-Tests ::
5.x SKIPPED
2017-09-15T18:02:24.676 [INFO] Apache Beam :: SDKs :: Java :: Extensions .......... SKIPPED
2017-09-15T18:02:24.676 [INFO] Apache Beam :: SDKs :: Java :: Extensions :: Google Cloud Platform
Core SKIPPED
2017-09-15T18:02:24.676 [INFO] Apache Beam :: SDKs :: Java :: Extensions :: Protobuf SKIPPED
2017-09-15T18:02:24.676 [INFO] Apache Beam :: SDKs :: Java :: IO :: Google Cloud Platform
SKIPPED
2017-09-15T18:02:24.676 [INFO] Apache Beam :: SDKs :: Java :: IO :: Hadoop Common . SKIPPED
2017-09-15T18:02:24.676 [INFO] Apache Beam :: SDKs :: Java :: IO :: Hadoop File System SKIPPED
2017-09-15T18:02:24.676 [INFO] Apache Beam :: SDKs :: Java :: IO :: Hadoop ........ SKIPPED
2017-09-15T18:02:24.676 [INFO] Apache Beam :: SDKs :: Java :: IO :: Hadoop :: input-format
SKIPPED
2017-09-15T18:02:24.676 [INFO] Apache Beam :: Runners :: Google Cloud Dataflow .... SKIPPED
2017-09-15T18:02:24.676 [INFO] Apache Beam :: SDKs :: Java :: IO :: Hadoop :: jdk1.8-tests
SKIPPED
2017-09-15T18:02:24.676 [INFO] Apache Beam :: SDKs :: Java :: IO :: HBase ......... SKIPPED
2017-09-15T18:02:24.676 [INFO] Apache Beam :: SDKs :: Java :: IO :: HCatalog ...... SKIPPED
2017-09-15T18:02:24.676 [INFO] Apache Beam :: SDKs :: Java :: IO :: JDBC .......... SKIPPED
2017-09-15T18:02:24.676 [INFO] Apache Beam :: SDKs :: Java :: IO :: JMS ........... SKIPPED
2017-09-15T18:02:24.676 [INFO] Apache Beam :: SDKs :: Java :: IO :: Kafka ......... SKIPPED
2017-09-15T18:02:24.676 [INFO] Apache Beam :: SDKs :: Java :: IO :: Kinesis ....... SKIPPED
2017-09-15T18:02:24.676 [INFO] Apache Beam :: SDKs :: Java :: IO :: MongoDB ....... SKIPPED
2017-09-15T18:02:24.676 [INFO] Apache Beam :: SDKs :: Java :: IO :: MQTT .......... SKIPPED
2017-09-15T18:02:24.676 [INFO] Apache Beam :: SDKs :: Java :: IO :: Solr .......... SKIPPED
2017-09-15T18:02:24.676 [INFO] Apache Beam :: SDKs :: Java :: IO :: Tika .......... SKIPPED
2017-09-15T18:02:24.676 [INFO] Apache Beam :: SDKs :: Java :: IO :: XML ........... SKIPPED
2017-09-15T18:02:24.676 [INFO] Apache Beam :: SDKs :: Java :: Maven Archetypes .... SKIPPED
2017-09-15T18:02:24.676 [INFO] Apache Beam :: SDKs :: Java :: Maven Archetypes :: Starter
SKIPPED
2017-09-15T18:02:24.676 [INFO] Apache Beam :: Examples ............................ SKIPPED
2017-09-15T18:02:24.676 [INFO] Apache Beam :: Examples :: Java .................... SKIPPED
2017-09-15T18:02:24.676 [INFO] Apache Beam :: SDKs :: Java :: Maven Archetypes :: Examples
SKIPPED
2017-09-15T18:02:24.676 [INFO] Apache Beam :: Examples :: Java 8 .................. SKIPPED
2017-09-15T18:02:24.676 [INFO] Apache Beam :: SDKs :: Java :: Maven Archetypes :: Examples
- Java 8 SKIPPED
2017-09-15T18:02:24.676 [INFO] Apache Beam :: SDKs :: Java :: Extensions :: Jackson SKIPPED
2017-09-15T18:02:24.676 [INFO] Apache Beam :: SDKs :: Java :: Extensions :: Join library SKIPPED
2017-09-15T18:02:24.676 [INFO] Apache Beam :: SDKs :: Java :: Extensions :: Sorter  SKIPPED
2017-09-15T18:02:24.676 [INFO] Apache Beam :: SDKs :: Java :: Extensions :: SQL ... SKIPPED
2017-09-15T18:02:24.677 [INFO] Apache Beam :: SDKs :: Java :: Nexmark ............. SKIPPED
2017-09-15T18:02:24.677 [INFO] Apache Beam :: SDKs :: Java :: Harness ............. SKIPPED
2017-09-15T18:02:24.677 [INFO] Apache Beam :: SDKs :: Java :: Java 8 Tests ........ SKIPPED
2017-09-15T18:02:24.677 [INFO] Apache Beam :: SDKs :: Python ...................... SKIPPED
2017-09-15T18:02:24.677 [INFO] Apache Beam :: Runners :: Flink .................... SKIPPED
2017-09-15T18:02:24.677 [INFO] Apache Beam :: Runners :: Spark .................... SKIPPED
2017-09-15T18:02:24.677 [INFO] Apache Beam :: Runners :: Apex ..................... SKIPPED
2017-09-15T18:02:24.677 [INFO] Apache Beam :: Runners :: Gearpump ................. SKIPPED
2017-09-15T18:02:24.677 [INFO] Apache Beam :: SDKs :: Java :: Aggregated Javadoc .. SKIPPED
2017-09-15T18:02:24.677 [INFO] ------------------------------------------------------------------------
2017-09-15T18:02:24.677 [INFO] BUILD FAILURE
2017-09-15T18:02:24.677 [INFO] ------------------------------------------------------------------------
2017-09-15T18:02:24.677 [INFO] Total time: 53.046 s
2017-09-15T18:02:24.677 [INFO] Finished at: 2017-09-15T18:02:24+00:00
2017-09-15T18:02:24.963 [INFO] Final Memory: 67M/755M
2017-09-15T18:02:24.963 [INFO] ------------------------------------------------------------------------
2017-09-15T18:02:24.967 [ERROR] Failed to execute goal org.apache.maven.plugins:maven-site-plugin:3.5.1:attach-descriptor
(attach-descriptor) on project beam-parent: Execution attach-descriptor of goal org.apache.maven.plugins:maven-site-plugin:3.5.1:attach-descriptor
failed: Plugin org.apache.maven.plugins:maven-site-plugin:3.5.1 or one of its dependencies
could not be resolved: Could not transfer artifact org.apache.velocity:velocity-tools:jar:2.0
from/to central (https://repo.maven.apache.org/maven2): GET request of: org/apache/velocity/velocity-tools/2.0/velocity-tools-2.0.jar
from central failed: Connection reset -> [Help 1]
org.apache.maven.lifecycle.LifecycleExecutionException: Failed to execute goal org.apache.maven.plugins:maven-site-plugin:3.5.1:attach-descriptor
(attach-descriptor) on project beam-parent: Execution attach-descriptor of goal org.apache.maven.plugins:maven-site-plugin:3.5.1:attach-descriptor
failed: Plugin org.apache.maven.plugins:maven-site-plugin:3.5.1 or one of its dependencies
could not be resolved: Could not transfer artifact org.apache.velocity:velocity-tools:jar:2.0
from/to central (https://repo.maven.apache.org/maven2): GET request of: org/apache/velocity/velocity-tools/2.0/velocity-tools-2.0.jar
from central failed
	at org.apache.maven.lifecycle.internal.MojoExecutor.execute(MojoExecutor.java:224)
	at org.apache.maven.lifecycle.internal.MojoExecutor.execute(MojoExecutor.java:153)
	at org.apache.maven.lifecycle.internal.MojoExecutor.execute(MojoExecutor.java:145)
	at org.apache.maven.lifecycle.internal.LifecycleModuleBuilder.buildProject(LifecycleModuleBuilder.java:116)
	at org.apache.maven.lifecycle.internal.LifecycleModuleBuilder.buildProject(LifecycleModuleBuilder.java:80)
	at org.apache.maven.lifecycle.internal.builder.singlethreaded.SingleThreadedBuilder.build(SingleThreadedBuilder.java:51)
	at org.apache.maven.lifecycle.internal.LifecycleStarter.execute(LifecycleStarter.java:128)
	at org.apache.maven.DefaultMaven.doExecute(DefaultMaven.java:307)
	at org.apache.maven.DefaultMaven.doExecute(DefaultMaven.java:193)
	at org.apache.maven.DefaultMaven.execute(DefaultMaven.java:106)
	at org.jvnet.hudson.maven3.launcher.Maven33Launcher.main(Maven33Launcher.java:129)
	at sun.reflect.NativeMethodAccessorImpl.invoke0(Native Method)
	at sun.reflect.NativeMethodAccessorImpl.invoke(NativeMethodAccessorImpl.java:62)
	at sun.reflect.DelegatingMethodAccessorImpl.invoke(DelegatingMethodAccessorImpl.java:43)
	at java.lang.reflect.Method.invoke(Method.java:498)
	at org.codehaus.plexus.classworlds.launcher.Launcher.launchStandard(Launcher.java:330)
	at org.codehaus.plexus.classworlds.launcher.Launcher.launch(Launcher.java:238)
	at jenkins.maven3.agent.Maven33Main.launch(Maven33Main.java:176)
	at sun.reflect.NativeMethodAccessorImpl.invoke0(Native Method)
	at sun.reflect.NativeMethodAccessorImpl.invoke(NativeMethodAccessorImpl.java:62)
	at sun.reflect.DelegatingMethodAccessorImpl.invoke(DelegatingMethodAccessorImpl.java:43)
	at java.lang.reflect.Method.invoke(Method.java:498)
	at hudson.maven.Maven3Builder.call(Maven3Builder.java:139)
	at hudson.maven.Maven3Builder.call(Maven3Builder.java:70)
	at hudson.remoting.UserRequest.perform(UserRequest.java:153)
	at hudson.remoting.UserRequest.perform(UserRequest.java:50)
	at hudson.remoting.Request$2.run(Request.java:336)
	at hudson.remoting.InterceptingExecutorService$1.call(InterceptingExecutorService.java:68)
	at java.util.concurrent.FutureTask.run(FutureTask.java:266)
	at java.util.concurrent.ThreadPoolExecutor.runWorker(ThreadPoolExecutor.java:1149)
	at java.util.concurrent.ThreadPoolExecutor$Worker.run(ThreadPoolExecutor.java:624)
	at java.lang.Thread.run(Thread.java:748)
Caused by: org.apache.maven.plugin.PluginExecutionException: Execution attach-descriptor of
goal org.apache.maven.plugins:maven-site-plugin:3.5.1:attach-descriptor failed: Plugin org.apache.maven.plugins:maven-site-plugin:3.5.1
or one of its dependencies could not be resolved: Could not transfer artifact org.apache.velocity:velocity-tools:jar:2.0
from/to central (https://repo.maven.apache.org/maven2): GET request of: org/apache/velocity/velocity-tools/2.0/velocity-tools-2.0.jar
from central failed
	at org.apache.maven.plugin.DefaultBuildPluginManager.executeMojo(DefaultBuildPluginManager.java:106)
	at org.apache.maven.lifecycle.internal.MojoExecutor.execute(MojoExecutor.java:208)
	... 31 more
Caused by: org.apache.maven.plugin.PluginResolutionException: Plugin org.apache.maven.plugins:maven-site-plugin:3.5.1
or one of its dependencies could not be resolved: Could not transfer artifact org.apache.velocity:velocity-tools:jar:2.0
from/to central (https://repo.maven.apache.org/maven2): GET request of: org/apache/velocity/velocity-tools/2.0/velocity-tools-2.0.jar
from central failed
	at org.apache.maven.plugin.internal.DefaultPluginDependenciesResolver.resolveInternal(DefaultPluginDependenciesResolver.java:218)
	at org.apache.maven.plugin.internal.DefaultPluginDependenciesResolver.resolve(DefaultPluginDependenciesResolver.java:149)
	at org.apache.maven.plugin.internal.DefaultMavenPluginManager.createPluginRealm(DefaultMavenPluginManager.java:422)
	at org.apache.maven.plugin.internal.DefaultMavenPluginManager.setupPluginRealm(DefaultMavenPluginManager.java:385)
	at org.apache.maven.plugin.DefaultBuildPluginManager.getPluginRealm(DefaultBuildPluginManager.java:231)
	at org.apache.maven.plugin.DefaultBuildPluginManager.executeMojo(DefaultBuildPluginManager.java:102)
	... 32 more
Caused by: org.eclipse.aether.resolution.ArtifactResolutionException: Could not transfer artifact
org.apache.velocity:velocity-tools:jar:2.0 from/to central (https://repo.maven.apache.org/maven2):
GET request of: org/apache/velocity/velocity-tools/2.0/velocity-tools-2.0.jar from central
failed
	at org.eclipse.aether.internal.impl.DefaultArtifactResolver.resolve(DefaultArtifactResolver.java:444)
	at org.eclipse.aether.internal.impl.DefaultArtifactResolver.resolveArtifacts(DefaultArtifactResolver.java:246)
	at org.eclipse.aether.internal.impl.DefaultRepositorySystem.resolveDependencies(DefaultRepositorySystem.java:367)
	at org.apache.maven.plugin.internal.DefaultPluginDependenciesResolver.resolveInternal(DefaultPluginDependenciesResolver.java:210)
	... 37 more
Caused by: org.eclipse.aether.transfer.ArtifactTransferException: Could not transfer artifact
org.apache.velocity:velocity-tools:jar:2.0 from/to central (https://repo.maven.apache.org/maven2):
GET request of: org/apache/velocity/velocity-tools/2.0/velocity-tools-2.0.jar from central
failed
	at org.eclipse.aether.connector.basic.ArtifactTransportListener.transferFailed(ArtifactTransportListener.java:43)
	at org.eclipse.aether.connector.basic.BasicRepositoryConnector$TaskRunner.run(BasicRepositoryConnector.java:355)
	at org.eclipse.aether.util.concurrency.RunnableErrorForwarder$1.run(RunnableErrorForwarder.java:67)
	... 3 more
Caused by: org.apache.maven.wagon.TransferFailedException: GET request of: org/apache/velocity/velocity-tools/2.0/velocity-tools-2.0.jar
from central failed
	at org.apache.maven.wagon.AbstractWagon.getTransfer(AbstractWagon.java:363)
	at org.apache.maven.wagon.AbstractWagon.getTransfer(AbstractWagon.java:316)
	at org.apache.maven.wagon.AbstractWagon.getTransfer(AbstractWagon.java:285)
	at org.apache.maven.wagon.StreamWagon.getIfNewer(StreamWagon.java:97)
	at org.apache.maven.wagon.StreamWagon.get(StreamWagon.java:61)
	at org.eclipse.aether.transport.wagon.WagonTransporter$GetTaskRunner.run(WagonTransporter.java:560)
	at org.eclipse.aether.transport.wagon.WagonTransporter.execute(WagonTransporter.java:427)
	at org.eclipse.aether.transport.wagon.WagonTransporter.get(WagonTransporter.java:404)
	at org.eclipse.aether.connector.basic.BasicRepositoryConnector$GetTaskRunner.runTask(BasicRepositoryConnector.java:447)
	at org.eclipse.aether.connector.basic.BasicRepositoryConnector$TaskRunner.run(BasicRepositoryConnector.java:350)
	... 4 more
Caused by: java.net.SocketException: Connection reset
	at java.net.SocketInputStream.read(SocketInputStream.java:210)
	at java.net.SocketInputStream.read(SocketInputStream.java:141)
	at sun.security.ssl.InputRecord.readFully(InputRecord.java:465)
	at sun.security.ssl.InputRecord.readV3Record(InputRecord.java:593)
	at sun.security.ssl.InputRecord.read(InputRecord.java:532)
	at sun.security.ssl.SSLSocketImpl.readRecord(SSLSocketImpl.java:983)
	at sun.security.ssl.SSLSocketImpl.readDataRecord(SSLSocketImpl.java:940)
	at sun.security.ssl.AppInputStream.read(AppInputStream.java:105)
	at org.apache.maven.wagon.providers.http.httpclient.impl.io.SessionInputBufferImpl.streamRead(SessionInputBufferImpl.java:136)
	at org.apache.maven.wagon.providers.http.httpclient.impl.io.SessionInputBufferImpl.read(SessionInputBufferImpl.java:195)
	at org.apache.maven.wagon.providers.http.httpclient.impl.io.ContentLengthInputStream.read(ContentLengthInputStream.java:178)
	at org.apache.maven.wagon.providers.http.httpclient.conn.EofSensorInputStream.read(EofSensorInputStream.java:137)
	at org.apache.maven.wagon.AbstractWagon.transfer(AbstractWagon.java:531)
	at org.apache.maven.wagon.AbstractWagon.getTransfer(AbstractWagon.java:353)
	... 13 more
2017-09-15T18:02:24.969 [ERROR] 
2017-09-15T18:02:24.969 [ERROR] Re-run Maven using the -X switch to enable full debug logging.
2017-09-15T18:02:24.969 [ERROR] 
2017-09-15T18:02:24.969 [ERROR] For more information about the errors and possible solutions,
please read the following articles:
2017-09-15T18:02:24.969 [ERROR] [Help 1] http://cwiki.apache.org/confluence/display/MAVEN/PluginResolutionException
channel stopped

Mime
View raw message