beam-commits mailing list archives

Site index · List index
Message view « Date » · « Thread »
Top « Date » · « Thread »
From Apache Jenkins Server <jenk...@builds.apache.org>
Subject Build failed in Jenkins: beam_PostCommit_Java_ValidatesRunner_Flink #3911
Date Sat, 23 Sep 2017 18:03:43 GMT
See <https://builds.apache.org/job/beam_PostCommit_Java_ValidatesRunner_Flink/3911/display/redirect>

------------------------------------------
[...truncated 217.80 KB...]
2017-09-23T18:03:18.725 [INFO] Downloading: https://repo.maven.apache.org/maven2/io/takari/takari/14/takari-14.pom
2017-09-23T18:03:18.753 [INFO] Downloaded: https://repo.maven.apache.org/maven2/io/takari/takari/14/takari-14.pom
(14 KB at 465.1 KB/sec)
2017-09-23T18:03:18.757 [INFO] Downloading: https://repo.maven.apache.org/maven2/net/revelc/code/formatter/formatter-maven-plugin/2.0.1/formatter-maven-plugin-2.0.1.jar
2017-09-23T18:03:18.788 [INFO] Downloaded: https://repo.maven.apache.org/maven2/net/revelc/code/formatter/formatter-maven-plugin/2.0.1/formatter-maven-plugin-2.0.1.jar
(32 KB at 1055.9 KB/sec)
2017-09-23T18:03:18.794 [INFO] Downloading: https://repo.maven.apache.org/maven2/org/apache/maven/plugins/maven-checkstyle-plugin/2.17/maven-checkstyle-plugin-2.17.pom
2017-09-23T18:03:18.822 [INFO] Downloaded: https://repo.maven.apache.org/maven2/org/apache/maven/plugins/maven-checkstyle-plugin/2.17/maven-checkstyle-plugin-2.17.pom
(14 KB at 465.6 KB/sec)
2017-09-23T18:03:18.825 [INFO] Downloading: https://repo.maven.apache.org/maven2/org/apache/maven/plugins/maven-checkstyle-plugin/2.17/maven-checkstyle-plugin-2.17.jar
2017-09-23T18:03:18.864 [INFO] Downloaded: https://repo.maven.apache.org/maven2/org/apache/maven/plugins/maven-checkstyle-plugin/2.17/maven-checkstyle-plugin-2.17.jar
(107 KB at 2718.7 KB/sec)
2017-09-23T18:03:18.868 [INFO] Downloading: https://repo.maven.apache.org/maven2/org/apache/maven/plugins/maven-surefire-plugin/2.20/maven-surefire-plugin-2.20.pom
2017-09-23T18:03:18.906 [INFO] Downloaded: https://repo.maven.apache.org/maven2/org/apache/maven/plugins/maven-surefire-plugin/2.20/maven-surefire-plugin-2.20.pom
(7 KB at 166.5 KB/sec)
2017-09-23T18:03:18.908 [INFO] Downloading: https://repo.maven.apache.org/maven2/org/apache/maven/surefire/surefire/2.20/surefire-2.20.pom
2017-09-23T18:03:18.936 [INFO] Downloaded: https://repo.maven.apache.org/maven2/org/apache/maven/surefire/surefire/2.20/surefire-2.20.pom
(21 KB at 725.5 KB/sec)
2017-09-23T18:03:18.939 [INFO] Downloading: https://repo.maven.apache.org/maven2/org/apache/maven/plugins/maven-surefire-plugin/2.20/maven-surefire-plugin-2.20.jar
2017-09-23T18:03:18.973 [INFO] Downloaded: https://repo.maven.apache.org/maven2/org/apache/maven/plugins/maven-surefire-plugin/2.20/maven-surefire-plugin-2.20.jar
(52 KB at 1528.7 KB/sec)
2017-09-23T18:03:18.982 [INFO] 
2017-09-23T18:03:18.982 [INFO] --- maven-clean-plugin:3.0.0:clean (default-clean) @ beam-sdks-java-build-tools
---
2017-09-23T18:03:18.984 [INFO] Deleting <https://builds.apache.org/job/beam_PostCommit_Java_ValidatesRunner_Flink/ws/sdks/java/build-tools>
(includes = [**/*.pyc, **/*.egg-info/, **/sdks/python/LICENSE, **/sdks/python/NOTICE, **/sdks/python/README.md],
excludes = [])
2017-09-23T18:03:19.091 [INFO] 
2017-09-23T18:03:19.091 [INFO] --- maven-enforcer-plugin:3.0.0-M1:enforce (enforce) @ beam-sdks-java-build-tools
---
2017-09-23T18:03:19.200 [INFO] 
2017-09-23T18:03:19.200 [INFO] --- maven-enforcer-plugin:3.0.0-M1:enforce (enforce-banned-dependencies)
@ beam-sdks-java-build-tools ---
2017-09-23T18:03:19.311 [INFO] 
2017-09-23T18:03:19.312 [INFO] --- maven-remote-resources-plugin:1.5:process (process-resource-bundles)
@ beam-sdks-java-build-tools ---
2017-09-23T18:03:19.436 [INFO] 
2017-09-23T18:03:19.436 [INFO] --- maven-resources-plugin:3.0.2:resources (default-resources)
@ beam-sdks-java-build-tools ---
2017-09-23T18:03:19.438 [INFO] Using 'UTF-8' encoding to copy filtered resources.
2017-09-23T18:03:19.439 [INFO] Copying 11 resources
2017-09-23T18:03:19.553 [INFO] Copying 3 resources
2017-09-23T18:03:19.661 [INFO] 
2017-09-23T18:03:19.661 [INFO] --- maven-compiler-plugin:3.6.2:compile (default-compile) @
beam-sdks-java-build-tools ---
2017-09-23T18:03:19.665 [INFO] Downloading: https://repo.maven.apache.org/maven2/org/apache/maven/shared/maven-shared-incremental/1.1/maven-shared-incremental-1.1.pom
2017-09-23T18:03:19.692 [INFO] Downloaded: https://repo.maven.apache.org/maven2/org/apache/maven/shared/maven-shared-incremental/1.1/maven-shared-incremental-1.1.pom
(5 KB at 171.5 KB/sec)
2017-09-23T18:03:19.697 [INFO] Downloading: https://repo.maven.apache.org/maven2/org/apache/maven/shared/maven-shared-utils/0.1/maven-shared-utils-0.1.pom
2017-09-23T18:03:19.723 [INFO] Downloaded: https://repo.maven.apache.org/maven2/org/apache/maven/shared/maven-shared-utils/0.1/maven-shared-utils-0.1.pom
(4 KB at 152.0 KB/sec)
2017-09-23T18:03:19.726 [INFO] Downloading: https://repo.maven.apache.org/maven2/org/ow2/asm/asm/6.0_ALPHA/asm-6.0_ALPHA.pom
2017-09-23T18:03:19.752 [INFO] Downloaded: https://repo.maven.apache.org/maven2/org/ow2/asm/asm/6.0_ALPHA/asm-6.0_ALPHA.pom
(2 KB at 72.8 KB/sec)
2017-09-23T18:03:19.754 [INFO] Downloading: https://repo.maven.apache.org/maven2/org/ow2/asm/asm-parent/6.0_ALPHA/asm-parent-6.0_ALPHA.pom
2017-09-23T18:03:19.781 [INFO] Downloaded: https://repo.maven.apache.org/maven2/org/ow2/asm/asm-parent/6.0_ALPHA/asm-parent-6.0_ALPHA.pom
(6 KB at 198.9 KB/sec)
2017-09-23T18:03:19.783 [INFO] Downloading: https://repo.maven.apache.org/maven2/com/thoughtworks/qdox/qdox/2.0-M6/qdox-2.0-M6.pom
2017-09-23T18:03:19.811 [INFO] Downloaded: https://repo.maven.apache.org/maven2/com/thoughtworks/qdox/qdox/2.0-M6/qdox-2.0-M6.pom
(16 KB at 543.7 KB/sec)
2017-09-23T18:03:19.816 [INFO] Downloading: https://repo.maven.apache.org/maven2/org/codehaus/plexus/plexus-compiler-api/2.8.2/plexus-compiler-api-2.8.2.pom
2017-09-23T18:03:19.842 [INFO] Downloaded: https://repo.maven.apache.org/maven2/org/codehaus/plexus/plexus-compiler-api/2.8.2/plexus-compiler-api-2.8.2.pom
(867 B at 32.6 KB/sec)
2017-09-23T18:03:19.845 [INFO] Downloading: https://repo.maven.apache.org/maven2/org/codehaus/plexus/plexus-compiler/2.8.2/plexus-compiler-2.8.2.pom
2017-09-23T18:03:19.872 [INFO] Downloaded: https://repo.maven.apache.org/maven2/org/codehaus/plexus/plexus-compiler/2.8.2/plexus-compiler-2.8.2.pom
(5 KB at 176.6 KB/sec)
2017-09-23T18:03:19.876 [INFO] Downloading: https://repo.maven.apache.org/maven2/org/codehaus/plexus/plexus-compiler-manager/2.8.2/plexus-compiler-manager-2.8.2.pom
2017-09-23T18:03:19.903 [INFO] Downloaded: https://repo.maven.apache.org/maven2/org/codehaus/plexus/plexus-compiler-manager/2.8.2/plexus-compiler-manager-2.8.2.pom
(692 B at 25.0 KB/sec)
2017-09-23T18:03:19.908 [INFO] Downloading: https://repo.maven.apache.org/maven2/org/codehaus/plexus/plexus-compiler-javac/2.8.2/plexus-compiler-javac-2.8.2.pom
2017-09-23T18:03:19.934 [INFO] Downloaded: https://repo.maven.apache.org/maven2/org/codehaus/plexus/plexus-compiler-javac/2.8.2/plexus-compiler-javac-2.8.2.pom
(771 B at 29.0 KB/sec)
2017-09-23T18:03:19.937 [INFO] Downloading: https://repo.maven.apache.org/maven2/org/codehaus/plexus/plexus-compilers/2.8.2/plexus-compilers-2.8.2.pom
2017-09-23T18:03:19.965 [INFO] Downloaded: https://repo.maven.apache.org/maven2/org/codehaus/plexus/plexus-compilers/2.8.2/plexus-compilers-2.8.2.pom
(2 KB at 46.8 KB/sec)
2017-09-23T18:03:19.974 [INFO] Downloading: https://repo.maven.apache.org/maven2/org/apache/maven/shared/maven-shared-incremental/1.1/maven-shared-incremental-1.1.jar
2017-09-23T18:03:19.974 [INFO] Downloading: https://repo.maven.apache.org/maven2/org/ow2/asm/asm/6.0_ALPHA/asm-6.0_ALPHA.jar
2017-09-23T18:03:19.975 [INFO] Downloading: https://repo.maven.apache.org/maven2/com/thoughtworks/qdox/qdox/2.0-M6/qdox-2.0-M6.jar
2017-09-23T18:03:19.975 [INFO] Downloading: https://repo.maven.apache.org/maven2/org/codehaus/plexus/plexus-compiler-api/2.8.2/plexus-compiler-api-2.8.2.jar
2017-09-23T18:03:19.975 [INFO] Downloading: https://repo.maven.apache.org/maven2/org/codehaus/plexus/plexus-compiler-manager/2.8.2/plexus-compiler-manager-2.8.2.jar
2017-09-23T18:03:20.002 [INFO] Downloaded: https://repo.maven.apache.org/maven2/org/codehaus/plexus/plexus-compiler-api/2.8.2/plexus-compiler-api-2.8.2.jar
(26 KB at 920.3 KB/sec)
2017-09-23T18:03:20.002 [INFO] Downloaded: https://repo.maven.apache.org/maven2/org/apache/maven/shared/maven-shared-incremental/1.1/maven-shared-incremental-1.1.jar
(14 KB at 455.9 KB/sec)
2017-09-23T18:03:20.002 [INFO] Downloading: https://repo.maven.apache.org/maven2/org/codehaus/plexus/plexus-compiler-javac/2.8.2/plexus-compiler-javac-2.8.2.jar
2017-09-23T18:03:20.003 [INFO] Downloaded: https://repo.maven.apache.org/maven2/org/codehaus/plexus/plexus-compiler-manager/2.8.2/plexus-compiler-manager-2.8.2.jar
(5 KB at 163.3 KB/sec)
2017-09-23T18:03:20.005 [INFO] Downloaded: https://repo.maven.apache.org/maven2/org/ow2/asm/asm/6.0_ALPHA/asm-6.0_ALPHA.jar
(55 KB at 1703.5 KB/sec)
2017-09-23T18:03:20.031 [INFO] Downloaded: https://repo.maven.apache.org/maven2/org/codehaus/plexus/plexus-compiler-javac/2.8.2/plexus-compiler-javac-2.8.2.jar
(20 KB at 356.3 KB/sec)
2017-09-23T18:03:20.041 [INFO] Downloaded: https://repo.maven.apache.org/maven2/com/thoughtworks/qdox/qdox/2.0-M6/qdox-2.0-M6.jar
(307 KB at 4572.9 KB/sec)
2017-09-23T18:03:20.087 [INFO] No sources to compile
2017-09-23T18:03:20.193 [INFO] 
2017-09-23T18:03:20.193 [INFO] --- formatter-maven-plugin:2.0.1:format (test-code-style) @
beam-sdks-java-build-tools ---
2017-09-23T18:03:20.196 [INFO] Downloading: https://repo.maven.apache.org/maven2/com/google/guava/guava/20.0/guava-20.0.pom
2017-09-23T18:03:20.223 [INFO] Downloaded: https://repo.maven.apache.org/maven2/com/google/guava/guava/20.0/guava-20.0.pom
(7 KB at 247.3 KB/sec)
2017-09-23T18:03:20.225 [INFO] Downloading: https://repo.maven.apache.org/maven2/com/google/guava/guava-parent/20.0/guava-parent-20.0.pom
2017-09-23T18:03:20.251 [INFO] Downloaded: https://repo.maven.apache.org/maven2/com/google/guava/guava-parent/20.0/guava-parent-20.0.pom
(10 KB at 371.7 KB/sec)
2017-09-23T18:03:20.254 [INFO] Downloading: https://repo.maven.apache.org/maven2/net/revelc/code/formatter/jdt-core/2.0.1/jdt-core-2.0.1.pom
2017-09-23T18:03:20.279 [INFO] Downloaded: https://repo.maven.apache.org/maven2/net/revelc/code/formatter/jdt-core/2.0.1/jdt-core-2.0.1.pom
(2 KB at 48.7 KB/sec)
2017-09-23T18:03:20.280 [INFO] Downloading: https://repo.maven.apache.org/maven2/net/revelc/code/formatter/formatters/2.0.1/formatters-2.0.1.pom
2017-09-23T18:03:20.308 [INFO] Downloaded: https://repo.maven.apache.org/maven2/net/revelc/code/formatter/formatters/2.0.1/formatters-2.0.1.pom
(4 KB at 133.2 KB/sec)
2017-09-23T18:03:20.310 [INFO] Downloading: https://repo.maven.apache.org/maven2/net/revelc/code/formatter/jsdt-core/2.0.1/jsdt-core-2.0.1.pom
2017-09-23T18:03:20.336 [INFO] Downloaded: https://repo.maven.apache.org/maven2/net/revelc/code/formatter/jsdt-core/2.0.1/jsdt-core-2.0.1.pom
(2 KB at 46.8 KB/sec)
2017-09-23T18:03:20.339 [INFO] Downloading: https://repo.maven.apache.org/maven2/org/apache/commons/commons-digester3/3.2/commons-digester3-3.2.pom
2017-09-23T18:03:20.368 [INFO] Downloaded: https://repo.maven.apache.org/maven2/org/apache/commons/commons-digester3/3.2/commons-digester3-3.2.pom
(18 KB at 592.3 KB/sec)
2017-09-23T18:03:20.372 [INFO] Downloading: https://repo.maven.apache.org/maven2/cglib/cglib/2.2.2/cglib-2.2.2.pom
2017-09-23T18:03:20.399 [INFO] Downloaded: https://repo.maven.apache.org/maven2/cglib/cglib/2.2.2/cglib-2.2.2.pom
(2 KB at 53.3 KB/sec)
2017-09-23T18:03:20.401 [INFO] Downloading: https://repo.maven.apache.org/maven2/asm/asm/3.3.1/asm-3.3.1.pom
2017-09-23T18:03:20.426 [INFO] Downloaded: https://repo.maven.apache.org/maven2/asm/asm/3.3.1/asm-3.3.1.pom
(266 B at 10.4 KB/sec)
2017-09-23T18:03:20.428 [INFO] Downloading: https://repo.maven.apache.org/maven2/asm/asm-parent/3.3.1/asm-parent-3.3.1.pom
2017-09-23T18:03:20.454 [INFO] Downloaded: https://repo.maven.apache.org/maven2/asm/asm-parent/3.3.1/asm-parent-3.3.1.pom
(5 KB at 162.7 KB/sec)
2017-09-23T18:03:20.456 [INFO] Downloading: https://repo.maven.apache.org/maven2/commons-beanutils/commons-beanutils/1.8.3/commons-beanutils-1.8.3.pom
2017-09-23T18:03:20.487 [INFO] Downloaded: https://repo.maven.apache.org/maven2/commons-beanutils/commons-beanutils/1.8.3/commons-beanutils-1.8.3.pom
(11 KB at 352.8 KB/sec)
2017-09-23T18:03:20.488 [INFO] Downloading: https://repo.maven.apache.org/maven2/org/apache/commons/commons-parent/14/commons-parent-14.pom
2017-09-23T18:03:20.517 [INFO] Downloaded: https://repo.maven.apache.org/maven2/org/apache/commons/commons-parent/14/commons-parent-14.pom
(31 KB at 1057.0 KB/sec)
2017-09-23T18:03:20.520 [INFO] Downloading: https://repo.maven.apache.org/maven2/org/apache/maven/plugin-tools/maven-plugin-annotations/3.5/maven-plugin-annotations-3.5.pom
2017-09-23T18:03:20.546 [INFO] Downloaded: https://repo.maven.apache.org/maven2/org/apache/maven/plugin-tools/maven-plugin-annotations/3.5/maven-plugin-annotations-3.5.pom
(2 KB at 62.7 KB/sec)
2017-09-23T18:03:20.547 [INFO] Downloading: https://repo.maven.apache.org/maven2/org/apache/maven/plugin-tools/maven-plugin-tools/3.5/maven-plugin-tools-3.5.pom
2017-09-23T18:03:20.574 [INFO] Downloaded: https://repo.maven.apache.org/maven2/org/apache/maven/plugin-tools/maven-plugin-tools/3.5/maven-plugin-tools-3.5.pom
(16 KB at 585.6 KB/sec)
2017-09-23T18:03:20.577 [INFO] Downloading: https://repo.maven.apache.org/maven2/org/codehaus/plexus/plexus-resources/1.0.1/plexus-resources-1.0.1.pom
2017-09-23T18:03:20.603 [INFO] Downloaded: https://repo.maven.apache.org/maven2/org/codehaus/plexus/plexus-resources/1.0.1/plexus-resources-1.0.1.pom
(2 KB at 49.5 KB/sec)
2017-09-23T18:03:20.605 [INFO] Downloading: https://repo.maven.apache.org/maven2/org/codehaus/plexus/plexus-utils/3.0.8/plexus-utils-3.0.8.pom
2017-09-23T18:03:20.631 [INFO] Downloaded: https://repo.maven.apache.org/maven2/org/codehaus/plexus/plexus-utils/3.0.8/plexus-utils-3.0.8.pom
(4 KB at 118.0 KB/sec)
2017-09-23T18:03:20.635 [INFO] Downloading: https://repo.maven.apache.org/maven2/com/google/guava/guava/20.0/guava-20.0.jar
2017-09-23T18:03:20.637 [INFO] Downloading: https://repo.maven.apache.org/maven2/net/revelc/code/formatter/jsdt-core/2.0.1/jsdt-core-2.0.1.jar
2017-09-23T18:03:20.637 [INFO] Downloading: https://repo.maven.apache.org/maven2/net/revelc/code/formatter/jdt-core/2.0.1/jdt-core-2.0.1.jar
2017-09-23T18:03:20.637 [INFO] Downloading: https://repo.maven.apache.org/maven2/org/apache/commons/commons-digester3/3.2/commons-digester3-3.2.jar
2017-09-23T18:03:20.638 [INFO] Downloading: https://repo.maven.apache.org/maven2/cglib/cglib/2.2.2/cglib-2.2.2.jar
2017-09-23T18:03:20.696 [INFO] Downloaded: https://repo.maven.apache.org/maven2/cglib/cglib/2.2.2/cglib-2.2.2.jar
(281 KB at 4753.6 KB/sec)
2017-09-23T18:03:20.696 [INFO] Downloading: https://repo.maven.apache.org/maven2/asm/asm/3.3.1/asm-3.3.1.jar
2017-09-23T18:03:20.705 [INFO] Downloaded: https://repo.maven.apache.org/maven2/org/apache/commons/commons-digester3/3.2/commons-digester3-3.2.jar
(236 KB at 3469.9 KB/sec)
2017-09-23T18:03:20.705 [INFO] Downloading: https://repo.maven.apache.org/maven2/commons-beanutils/commons-beanutils/1.8.3/commons-beanutils-1.8.3.jar
2017-09-23T18:03:20.723 [INFO] Downloaded: https://repo.maven.apache.org/maven2/asm/asm/3.3.1/asm-3.3.1.jar
(43 KB at 500.7 KB/sec)
2017-09-23T18:03:20.723 [INFO] Downloading: https://repo.maven.apache.org/maven2/commons-logging/commons-logging/1.1.1/commons-logging-1.1.1.jar
2017-09-23T18:03:20.753 [INFO] Downloaded: https://repo.maven.apache.org/maven2/commons-logging/commons-logging/1.1.1/commons-logging-1.1.1.jar
(60 KB at 515.3 KB/sec)
2017-09-23T18:03:20.754 [INFO] Downloading: https://repo.maven.apache.org/maven2/org/apache/maven/plugin-tools/maven-plugin-annotations/3.5/maven-plugin-annotations-3.5.jar
2017-09-23T18:03:20.782 [INFO] Downloaded: https://repo.maven.apache.org/maven2/org/apache/maven/plugin-tools/maven-plugin-annotations/3.5/maven-plugin-annotations-3.5.jar
(14 KB at 97.0 KB/sec)
2017-09-23T18:03:20.782 [INFO] Downloading: https://repo.maven.apache.org/maven2/commons-io/commons-io/2.2/commons-io-2.2.jar
2017-09-23T18:03:20.821 [INFO] Downloaded: https://repo.maven.apache.org/maven2/commons-io/commons-io/2.2/commons-io-2.2.jar
(170 KB at 926.3 KB/sec)
2017-09-23T18:03:20.821 [INFO] Downloading: https://repo.maven.apache.org/maven2/org/codehaus/plexus/plexus-resources/1.0.1/plexus-resources-1.0.1.jar
2017-09-23T18:03:20.848 [INFO] Downloaded: https://repo.maven.apache.org/maven2/org/codehaus/plexus/plexus-resources/1.0.1/plexus-resources-1.0.1.jar
(22 KB at 101.7 KB/sec)
2017-09-23T18:03:20.922 [INFO] Downloaded: https://repo.maven.apache.org/maven2/com/google/guava/guava/20.0/guava-20.0.jar
(2386 KB at 8311.4 KB/sec)
2017-09-23T18:03:22.055 [INFO] Downloaded: https://repo.maven.apache.org/maven2/net/revelc/code/formatter/jdt-core/2.0.1/jdt-core-2.0.1.jar
(19470 KB at 13711.0 KB/sec)
[WARNING] Failed to getClass for net.revelc.code.formatter.FormatterMojo
[JENKINS] Archiving disabled
[JENKINS] Archiving disabled
[JENKINS] Archiving disabled
[JENKINS] Archiving disabled
[JENKINS] Archiving disabled
[JENKINS] Archiving disabled
[JENKINS] Archiving disabled
[JENKINS] Archiving disabled
[JENKINS] Archiving disabled
[JENKINS] Archiving disabled
[JENKINS] Archiving disabled
[JENKINS] Archiving disabled
[JENKINS] Archiving disabled
2017-09-23T18:03:27.369 [INFO] ------------------------------------------------------------------------
2017-09-23T18:03:27.369 [INFO] Reactor Summary:
2017-09-23T18:03:27.369 [INFO] 
2017-09-23T18:03:27.370 [INFO] Apache Beam :: Parent .............................. SUCCESS
[ 26.719 s]
2017-09-23T18:03:27.370 [INFO] Apache Beam :: SDKs :: Java :: Build Tools ......... FAILURE
[  3.941 s]
2017-09-23T18:03:27.370 [INFO] Apache Beam :: SDKs ................................ SKIPPED
2017-09-23T18:03:27.370 [INFO] Apache Beam :: SDKs :: Common ...................... SKIPPED
2017-09-23T18:03:27.370 [INFO] Apache Beam :: SDKs :: Common :: Runner API ........ SKIPPED
2017-09-23T18:03:27.370 [INFO] Apache Beam :: SDKs :: Common :: Fn API ............ SKIPPED
2017-09-23T18:03:27.370 [INFO] Apache Beam :: SDKs :: Java ........................ SKIPPED
2017-09-23T18:03:27.370 [INFO] Apache Beam :: SDKs :: Java :: Core ................ SKIPPED
2017-09-23T18:03:27.370 [INFO] Apache Beam :: Runners ............................. SKIPPED
2017-09-23T18:03:27.370 [INFO] Apache Beam :: Runners :: Core Construction Java ... SKIPPED
2017-09-23T18:03:27.370 [INFO] Apache Beam :: Runners :: Core Java ................ SKIPPED
2017-09-23T18:03:27.370 [INFO] Apache Beam :: Runners :: Flink .................... SKIPPED
2017-09-23T18:03:27.370 [INFO] ------------------------------------------------------------------------
2017-09-23T18:03:27.370 [INFO] BUILD FAILURE
2017-09-23T18:03:27.370 [INFO] ------------------------------------------------------------------------
2017-09-23T18:03:27.370 [INFO] Total time: 01:14 min
2017-09-23T18:03:27.370 [INFO] Finished at: 2017-09-23T18:03:27+00:00
2017-09-23T18:03:27.574 [INFO] Final Memory: 64M/704M
2017-09-23T18:03:27.574 [INFO] ------------------------------------------------------------------------
2017-09-23T18:03:27.574 [WARNING] The requested profile "validates-runner-tests" could not
be activated because it does not exist.
2017-09-23T18:03:27.578 [ERROR] Failed to execute goal net.revelc.code.formatter:formatter-maven-plugin:2.0.1:format
(test-code-style) on project beam-sdks-java-build-tools: Execution test-code-style of goal
net.revelc.code.formatter:formatter-maven-plugin:2.0.1:format failed: Plugin net.revelc.code.formatter:formatter-maven-plugin:2.0.1
or one of its dependencies could not be resolved: The following artifacts could not be resolved:
net.revelc.code.formatter:jsdt-core:jar:2.0.1, commons-beanutils:commons-beanutils:jar:1.8.3:
Could not transfer artifact net.revelc.code.formatter:jsdt-core:jar:2.0.1 from/to central
(https://repo.maven.apache.org/maven2): GET request of: net/revelc/code/formatter/jsdt-core/2.0.1/jsdt-core-2.0.1.jar
from central failed: Connection reset -> [Help 1]
org.apache.maven.lifecycle.LifecycleExecutionException: Failed to execute goal net.revelc.code.formatter:formatter-maven-plugin:2.0.1:format
(test-code-style) on project beam-sdks-java-build-tools: Execution test-code-style of goal
net.revelc.code.formatter:formatter-maven-plugin:2.0.1:format failed: Plugin net.revelc.code.formatter:formatter-maven-plugin:2.0.1
or one of its dependencies could not be resolved: The following artifacts could not be resolved:
net.revelc.code.formatter:jsdt-core:jar:2.0.1, commons-beanutils:commons-beanutils:jar:1.8.3:
Could not transfer artifact net.revelc.code.formatter:jsdt-core:jar:2.0.1 from/to central
(https://repo.maven.apache.org/maven2): GET request of: net/revelc/code/formatter/jsdt-core/2.0.1/jsdt-core-2.0.1.jar
from central failed
	at org.apache.maven.lifecycle.internal.MojoExecutor.execute(MojoExecutor.java:224)
	at org.apache.maven.lifecycle.internal.MojoExecutor.execute(MojoExecutor.java:153)
	at org.apache.maven.lifecycle.internal.MojoExecutor.execute(MojoExecutor.java:145)
	at org.apache.maven.lifecycle.internal.LifecycleModuleBuilder.buildProject(LifecycleModuleBuilder.java:116)
	at org.apache.maven.lifecycle.internal.LifecycleModuleBuilder.buildProject(LifecycleModuleBuilder.java:80)
	at org.apache.maven.lifecycle.internal.builder.singlethreaded.SingleThreadedBuilder.build(SingleThreadedBuilder.java:51)
	at org.apache.maven.lifecycle.internal.LifecycleStarter.execute(LifecycleStarter.java:128)
	at org.apache.maven.DefaultMaven.doExecute(DefaultMaven.java:307)
	at org.apache.maven.DefaultMaven.doExecute(DefaultMaven.java:193)
	at org.apache.maven.DefaultMaven.execute(DefaultMaven.java:106)
	at org.jvnet.hudson.maven3.launcher.Maven33Launcher.main(Maven33Launcher.java:129)
	at sun.reflect.NativeMethodAccessorImpl.invoke0(Native Method)
	at sun.reflect.NativeMethodAccessorImpl.invoke(NativeMethodAccessorImpl.java:62)
	at sun.reflect.DelegatingMethodAccessorImpl.invoke(DelegatingMethodAccessorImpl.java:43)
	at java.lang.reflect.Method.invoke(Method.java:498)
	at org.codehaus.plexus.classworlds.launcher.Launcher.launchStandard(Launcher.java:330)
	at org.codehaus.plexus.classworlds.launcher.Launcher.launch(Launcher.java:238)
	at jenkins.maven3.agent.Maven33Main.launch(Maven33Main.java:176)
	at sun.reflect.NativeMethodAccessorImpl.invoke0(Native Method)
	at sun.reflect.NativeMethodAccessorImpl.invoke(NativeMethodAccessorImpl.java:62)
	at sun.reflect.DelegatingMethodAccessorImpl.invoke(DelegatingMethodAccessorImpl.java:43)
	at java.lang.reflect.Method.invoke(Method.java:498)
	at hudson.maven.Maven3Builder.call(Maven3Builder.java:139)
	at hudson.maven.Maven3Builder.call(Maven3Builder.java:70)
	at hudson.remoting.UserRequest.perform(UserRequest.java:153)
	at hudson.remoting.UserRequest.perform(UserRequest.java:50)
	at hudson.remoting.Request$2.run(Request.java:336)
	at hudson.remoting.InterceptingExecutorService$1.call(InterceptingExecutorService.java:68)
	at java.util.concurrent.FutureTask.run(FutureTask.java:266)
	at java.util.concurrent.ThreadPoolExecutor.runWorker(ThreadPoolExecutor.java:1149)
	at java.util.concurrent.ThreadPoolExecutor$Worker.run(ThreadPoolExecutor.java:624)
	at java.lang.Thread.run(Thread.java:748)
Caused by: org.apache.maven.plugin.PluginExecutionException: Execution test-code-style of
goal net.revelc.code.formatter:formatter-maven-plugin:2.0.1:format failed: Plugin net.revelc.code.formatter:formatter-maven-plugin:2.0.1
or one of its dependencies could not be resolved: The following artifacts could not be resolved:
net.revelc.code.formatter:jsdt-core:jar:2.0.1, commons-beanutils:commons-beanutils:jar:1.8.3:
Could not transfer artifact net.revelc.code.formatter:jsdt-core:jar:2.0.1 from/to central
(https://repo.maven.apache.org/maven2): GET request of: net/revelc/code/formatter/jsdt-core/2.0.1/jsdt-core-2.0.1.jar
from central failed
	at org.apache.maven.plugin.DefaultBuildPluginManager.executeMojo(DefaultBuildPluginManager.java:106)
	at org.apache.maven.lifecycle.internal.MojoExecutor.execute(MojoExecutor.java:208)
	... 31 more
Caused by: org.apache.maven.plugin.PluginResolutionException: Plugin net.revelc.code.formatter:formatter-maven-plugin:2.0.1
or one of its dependencies could not be resolved: The following artifacts could not be resolved:
net.revelc.code.formatter:jsdt-core:jar:2.0.1, commons-beanutils:commons-beanutils:jar:1.8.3:
Could not transfer artifact net.revelc.code.formatter:jsdt-core:jar:2.0.1 from/to central
(https://repo.maven.apache.org/maven2): GET request of: net/revelc/code/formatter/jsdt-core/2.0.1/jsdt-core-2.0.1.jar
from central failed
	at org.apache.maven.plugin.internal.DefaultPluginDependenciesResolver.resolveInternal(DefaultPluginDependenciesResolver.java:218)
	at org.apache.maven.plugin.internal.DefaultPluginDependenciesResolver.resolve(DefaultPluginDependenciesResolver.java:149)
	at org.apache.maven.plugin.internal.DefaultMavenPluginManager.createPluginRealm(DefaultMavenPluginManager.java:422)
	at org.apache.maven.plugin.internal.DefaultMavenPluginManager.setupPluginRealm(DefaultMavenPluginManager.java:385)
	at org.apache.maven.plugin.DefaultBuildPluginManager.getPluginRealm(DefaultBuildPluginManager.java:231)
	at org.apache.maven.plugin.DefaultBuildPluginManager.executeMojo(DefaultBuildPluginManager.java:102)
	... 32 more
Caused by: org.eclipse.aether.resolution.ArtifactResolutionException: The following artifacts
could not be resolved: net.revelc.code.formatter:jsdt-core:jar:2.0.1, commons-beanutils:commons-beanutils:jar:1.8.3:
Could not transfer artifact net.revelc.code.formatter:jsdt-core:jar:2.0.1 from/to central
(https://repo.maven.apache.org/maven2): GET request of: net/revelc/code/formatter/jsdt-core/2.0.1/jsdt-core-2.0.1.jar
from central failed
	at org.eclipse.aether.internal.impl.DefaultArtifactResolver.resolve(DefaultArtifactResolver.java:444)
	at org.eclipse.aether.internal.impl.DefaultArtifactResolver.resolveArtifacts(DefaultArtifactResolver.java:246)
	at org.eclipse.aether.internal.impl.DefaultRepositorySystem.resolveDependencies(DefaultRepositorySystem.java:367)
	at org.apache.maven.plugin.internal.DefaultPluginDependenciesResolver.resolveInternal(DefaultPluginDependenciesResolver.java:210)
	... 37 more
Caused by: org.eclipse.aether.transfer.ArtifactTransferException: Could not transfer artifact
net.revelc.code.formatter:jsdt-core:jar:2.0.1 from/to central (https://repo.maven.apache.org/maven2):
GET request of: net/revelc/code/formatter/jsdt-core/2.0.1/jsdt-core-2.0.1.jar from central
failed
	at org.eclipse.aether.connector.basic.ArtifactTransportListener.transferFailed(ArtifactTransportListener.java:43)
	at org.eclipse.aether.connector.basic.BasicRepositoryConnector$TaskRunner.run(BasicRepositoryConnector.java:355)
	at org.eclipse.aether.util.concurrency.RunnableErrorForwarder$1.run(RunnableErrorForwarder.java:67)
	... 3 more
Caused by: org.apache.maven.wagon.TransferFailedException: GET request of: net/revelc/code/formatter/jsdt-core/2.0.1/jsdt-core-2.0.1.jar
from central failed
	at org.apache.maven.wagon.AbstractWagon.getTransfer(AbstractWagon.java:363)
	at org.apache.maven.wagon.AbstractWagon.getTransfer(AbstractWagon.java:316)
	at org.apache.maven.wagon.AbstractWagon.getTransfer(AbstractWagon.java:285)
	at org.apache.maven.wagon.StreamWagon.getIfNewer(StreamWagon.java:97)
	at org.apache.maven.wagon.StreamWagon.get(StreamWagon.java:61)
	at org.eclipse.aether.transport.wagon.WagonTransporter$GetTaskRunner.run(WagonTransporter.java:560)
	at org.eclipse.aether.transport.wagon.WagonTransporter.execute(WagonTransporter.java:427)
	at org.eclipse.aether.transport.wagon.WagonTransporter.get(WagonTransporter.java:404)
	at org.eclipse.aether.connector.basic.BasicRepositoryConnector$GetTaskRunner.runTask(BasicRepositoryConnector.java:447)
	at org.eclipse.aether.connector.basic.BasicRepositoryConnector$TaskRunner.run(BasicRepositoryConnector.java:350)
	... 4 more
Caused by: java.net.SocketException: Connection reset
	at java.net.SocketInputStream.read(SocketInputStream.java:210)
	at java.net.SocketInputStream.read(SocketInputStream.java:141)
	at sun.security.ssl.InputRecord.readFully(InputRecord.java:465)
	at sun.security.ssl.InputRecord.readV3Record(InputRecord.java:593)
	at sun.security.ssl.InputRecord.read(InputRecord.java:532)
	at sun.security.ssl.SSLSocketImpl.readRecord(SSLSocketImpl.java:983)
	at sun.security.ssl.SSLSocketImpl.readDataRecord(SSLSocketImpl.java:940)
	at sun.security.ssl.AppInputStream.read(AppInputStream.java:105)
	at org.apache.maven.wagon.providers.http.httpclient.impl.io.SessionInputBufferImpl.streamRead(SessionInputBufferImpl.java:136)
	at org.apache.maven.wagon.providers.http.httpclient.impl.io.SessionInputBufferImpl.read(SessionInputBufferImpl.java:195)
	at org.apache.maven.wagon.providers.http.httpclient.impl.io.ContentLengthInputStream.read(ContentLengthInputStream.java:178)
	at org.apache.maven.wagon.providers.http.httpclient.conn.EofSensorInputStream.read(EofSensorInputStream.java:137)
	at org.apache.maven.wagon.AbstractWagon.transfer(AbstractWagon.java:531)
	at org.apache.maven.wagon.AbstractWagon.getTransfer(AbstractWagon.java:353)
	... 13 more
2017-09-23T18:03:27.580 [ERROR] 
2017-09-23T18:03:27.580 [ERROR] Re-run Maven using the -X switch to enable full debug logging.
2017-09-23T18:03:27.580 [ERROR] 
2017-09-23T18:03:27.580 [ERROR] For more information about the errors and possible solutions,
please read the following articles:
2017-09-23T18:03:27.580 [ERROR] [Help 1] http://cwiki.apache.org/confluence/display/MAVEN/PluginResolutionException
2017-09-23T18:03:27.580 [ERROR] 
2017-09-23T18:03:27.580 [ERROR] After correcting the problems, you can resume the build with
the command
2017-09-23T18:03:27.580 [ERROR]   mvn <goals> -rf :beam-sdks-java-build-tools
channel stopped
Not sending mail to unregistered user klk@google.com
Not sending mail to unregistered user millsd@google.com
Not sending mail to unregistered user relax@relax-macbookpro.roam.corp.google.com

Mime
View raw message