beam-commits mailing list archives

Site index · List index
Message view « Date » · « Thread »
Top « Date » · « Thread »
From Apache Jenkins Server <jenk...@builds.apache.org>
Subject Build failed in Jenkins: beam_PostCommit_Java_MavenInstall #4704
Date Sat, 02 Sep 2017 06:43:15 GMT
See <https://builds.apache.org/job/beam_PostCommit_Java_MavenInstall/4704/display/redirect>

------------------------------------------
[...truncated 1.58 MB...]
2017-09-02T06:42:21.730 [INFO] Skipping Apache Beam :: Parent
2017-09-02T06:42:21.730 [INFO] This project has been banned from the build due to previous
failures.
2017-09-02T06:42:21.730 [INFO] ------------------------------------------------------------------------
[JENKINS] Archiving disabled
[JENKINS] Archiving disabled
[JENKINS] Archiving disabled
[JENKINS] Archiving disabled
[JENKINS] Archiving disabled
[JENKINS] Archiving disabled
[JENKINS] Archiving disabled
[JENKINS] Archiving disabled
[JENKINS] Archiving disabled
[JENKINS] Archiving disabled
[JENKINS] Archiving disabled
[JENKINS] Archiving disabled
[JENKINS] Archiving disabled
[JENKINS] Archiving disabled
[JENKINS] Archiving disabled
[JENKINS] Archiving disabled
[JENKINS] Archiving disabled
[JENKINS] Archiving disabled
[JENKINS] Archiving disabled
[JENKINS] Archiving disabled
[JENKINS] Archiving disabled
[JENKINS] Archiving disabled
[JENKINS] Archiving disabled
[JENKINS] Archiving disabled
[JENKINS] Archiving disabled
[JENKINS] Archiving disabled
[JENKINS] Archiving disabled
[JENKINS] Archiving disabled
[JENKINS] Archiving disabled
[JENKINS] Archiving disabled
[JENKINS] Archiving disabled
[JENKINS] Archiving disabled
[JENKINS] Archiving disabled
[JENKINS] Archiving disabled
[JENKINS] Archiving disabled
[JENKINS] Archiving disabled
[JENKINS] Archiving disabled
[JENKINS] Archiving disabled
[JENKINS] Archiving disabled
[JENKINS] Archiving disabled
[JENKINS] Archiving disabled
[JENKINS] Archiving disabled
[JENKINS] Archiving disabled
[JENKINS] Archiving disabled
[JENKINS] Archiving disabled
[JENKINS] Archiving disabled
[JENKINS] Archiving disabled
[JENKINS] Archiving disabled
[JENKINS] Archiving disabled
[JENKINS] Archiving disabled
[JENKINS] Archiving disabled
[JENKINS] Archiving disabled
[JENKINS] Archiving disabled
[JENKINS] Archiving disabled
[JENKINS] Archiving disabled
[JENKINS] Archiving disabled
2017-09-02T06:43:02.747 [INFO] ------------------------------------------------------------------------
2017-09-02T06:43:02.747 [INFO] Reactor Summary:
2017-09-02T06:43:02.747 [INFO] 
2017-09-02T06:43:02.748 [INFO] Apache Beam :: Parent .............................. SUCCESS
[ 31.153 s]
2017-09-02T06:43:02.748 [INFO] Apache Beam :: SDKs :: Java :: Build Tools ......... SUCCESS
[ 17.228 s]
2017-09-02T06:43:02.748 [INFO] Apache Beam :: SDKs ................................ SUCCESS
[  5.739 s]
2017-09-02T06:43:02.748 [INFO] Apache Beam :: SDKs :: Common ...................... SUCCESS
[  3.113 s]
2017-09-02T06:43:02.748 [INFO] Apache Beam :: SDKs :: Common :: Runner API ........ SUCCESS
[ 33.880 s]
2017-09-02T06:43:02.748 [INFO] Apache Beam :: SDKs :: Common :: Fn API ............ SUCCESS
[ 21.341 s]
2017-09-02T06:43:02.748 [INFO] Apache Beam :: SDKs :: Java ........................ SUCCESS
[  3.814 s]
2017-09-02T06:43:02.748 [INFO] Apache Beam :: SDKs :: Java :: Core ................ SUCCESS
[03:12 min]
2017-09-02T06:43:02.748 [INFO] Apache Beam :: Runners ............................. SUCCESS
[  2.938 s]
2017-09-02T06:43:02.748 [INFO] Apache Beam :: Runners :: Core Construction Java ... SUCCESS
[ 37.822 s]
2017-09-02T06:43:02.748 [INFO] Apache Beam :: Runners :: Core Java ................ SUCCESS
[ 54.369 s]
2017-09-02T06:43:02.748 [INFO] Apache Beam :: Runners :: Direct Java .............. SUCCESS
[04:49 min]
2017-09-02T06:43:02.748 [INFO] Apache Beam :: SDKs :: Java :: IO .................. SUCCESS
[  2.926 s]
2017-09-02T06:43:02.748 [INFO] Apache Beam :: SDKs :: Java :: IO :: AMQP .......... SUCCESS
[ 36.600 s]
2017-09-02T06:43:02.748 [INFO] Apache Beam :: SDKs :: Java :: IO :: Common ........ SUCCESS
[  7.301 s]
2017-09-02T06:43:02.748 [INFO] Apache Beam :: SDKs :: Java :: IO :: Cassandra ..... SUCCESS
[ 31.089 s]
2017-09-02T06:43:02.748 [INFO] Apache Beam :: SDKs :: Java :: IO :: Elasticsearch . SUCCESS
[ 45.737 s]
2017-09-02T06:43:02.748 [INFO] Apache Beam :: SDKs :: Java :: Extensions .......... SUCCESS
[  3.102 s]
2017-09-02T06:43:02.748 [INFO] Apache Beam :: SDKs :: Java :: Extensions :: Google Cloud Platform
Core SUCCESS [ 24.205 s]
2017-09-02T06:43:02.748 [INFO] Apache Beam :: SDKs :: Java :: Extensions :: Protobuf SUCCESS
[ 18.281 s]
2017-09-02T06:43:02.748 [INFO] Apache Beam :: SDKs :: Java :: IO :: Google Cloud Platform
SUCCESS [01:23 min]
2017-09-02T06:43:02.748 [INFO] Apache Beam :: SDKs :: Java :: IO :: Hadoop Common . SUCCESS
[ 19.239 s]
2017-09-02T06:43:02.748 [INFO] Apache Beam :: SDKs :: Java :: IO :: Hadoop File System SUCCESS
[ 35.579 s]
2017-09-02T06:43:02.748 [INFO] Apache Beam :: SDKs :: Java :: IO :: Hadoop ........ SUCCESS
[  5.516 s]
2017-09-02T06:43:02.748 [INFO] Apache Beam :: SDKs :: Java :: IO :: Hadoop :: input-format
SUCCESS [ 20.187 s]
2017-09-02T06:43:02.748 [INFO] Apache Beam :: Runners :: Google Cloud Dataflow .... SUCCESS
[06:57 min]
2017-09-02T06:43:02.748 [INFO] Apache Beam :: SDKs :: Java :: IO :: Hadoop :: jdk1.8-tests
SUCCESS [01:41 min]
2017-09-02T06:43:02.748 [INFO] Apache Beam :: SDKs :: Java :: IO :: HBase ......... SUCCESS
[01:41 min]
2017-09-02T06:43:02.748 [INFO] Apache Beam :: SDKs :: Java :: IO :: HCatalog ...... SUCCESS
[ 56.028 s]
2017-09-02T06:43:02.748 [INFO] Apache Beam :: SDKs :: Java :: IO :: JDBC .......... SUCCESS
[ 33.267 s]
2017-09-02T06:43:02.748 [INFO] Apache Beam :: SDKs :: Java :: IO :: JMS ........... SUCCESS
[ 20.107 s]
2017-09-02T06:43:02.748 [INFO] Apache Beam :: SDKs :: Java :: IO :: Kafka ......... SUCCESS
[ 33.482 s]
2017-09-02T06:43:02.748 [INFO] Apache Beam :: SDKs :: Java :: IO :: Kinesis ....... SUCCESS
[ 21.839 s]
2017-09-02T06:43:02.748 [INFO] Apache Beam :: SDKs :: Java :: IO :: MongoDB ....... SUCCESS
[ 31.569 s]
2017-09-02T06:43:02.748 [INFO] Apache Beam :: SDKs :: Java :: IO :: MQTT .......... SUCCESS
[ 20.825 s]
2017-09-02T06:43:02.748 [INFO] Apache Beam :: SDKs :: Java :: IO :: Solr .......... SUCCESS
[ 46.775 s]
2017-09-02T06:43:02.748 [INFO] Apache Beam :: SDKs :: Java :: IO :: XML ........... SUCCESS
[ 25.226 s]
2017-09-02T06:43:02.748 [INFO] Apache Beam :: SDKs :: Java :: Maven Archetypes .... SUCCESS
[  2.675 s]
2017-09-02T06:43:02.748 [INFO] Apache Beam :: SDKs :: Java :: Maven Archetypes :: Starter
SUCCESS [ 13.811 s]
2017-09-02T06:43:02.748 [INFO] Apache Beam :: Examples ............................ SUCCESS
[  2.896 s]
2017-09-02T06:43:02.748 [INFO] Apache Beam :: Examples :: Java .................... SUCCESS
[07:07 min]
2017-09-02T06:43:02.748 [INFO] Apache Beam :: SDKs :: Java :: Maven Archetypes :: Examples
FAILURE [  1.546 s]
2017-09-02T06:43:02.748 [INFO] Apache Beam :: Examples :: Java 8 .................. SKIPPED
2017-09-02T06:43:02.748 [INFO] Apache Beam :: SDKs :: Java :: Maven Archetypes :: Examples
- Java 8 SKIPPED
2017-09-02T06:43:02.748 [INFO] Apache Beam :: SDKs :: Java :: Extensions :: Jackson SKIPPED
2017-09-02T06:43:02.748 [INFO] Apache Beam :: SDKs :: Java :: Extensions :: Join library SKIPPED
2017-09-02T06:43:02.748 [INFO] Apache Beam :: SDKs :: Java :: Extensions :: Sorter  SKIPPED
2017-09-02T06:43:02.748 [INFO] Apache Beam :: SDKs :: Java :: Nexmark ............. SKIPPED
2017-09-02T06:43:02.748 [INFO] Apache Beam :: SDKs :: Java :: Harness ............. SKIPPED
2017-09-02T06:43:02.748 [INFO] Apache Beam :: SDKs :: Java :: Java 8 Tests ........ SKIPPED
2017-09-02T06:43:02.748 [INFO] Apache Beam :: SDKs :: Python ...................... SKIPPED
2017-09-02T06:43:02.748 [INFO] Apache Beam :: Runners :: Flink .................... SKIPPED
2017-09-02T06:43:02.749 [INFO] Apache Beam :: Runners :: Spark .................... SKIPPED
2017-09-02T06:43:02.749 [INFO] Apache Beam :: Runners :: Apex ..................... SKIPPED
2017-09-02T06:43:02.749 [INFO] Apache Beam :: Runners :: Gearpump ................. SKIPPED
2017-09-02T06:43:02.749 [INFO] Apache Beam :: SDKs :: Java :: Aggregated Javadoc .. SKIPPED
2017-09-02T06:43:02.749 [INFO] ------------------------------------------------------------------------
2017-09-02T06:43:02.749 [INFO] BUILD FAILURE
2017-09-02T06:43:02.749 [INFO] ------------------------------------------------------------------------
2017-09-02T06:43:02.749 [INFO] Total time: 41:30 min
2017-09-02T06:43:02.749 [INFO] Finished at: 2017-09-02T06:43:02+00:00
2017-09-02T06:43:03.727 [INFO] Final Memory: 459M/2046M
2017-09-02T06:43:03.728 [INFO] ------------------------------------------------------------------------
2017-09-02T06:43:03.733 [ERROR] Failed to execute goal org.codehaus.mojo:exec-maven-plugin:1.5.0:exec
(generate-archetype-contents) on project beam-sdks-java-maven-archetypes-examples: Execution
generate-archetype-contents of goal org.codehaus.mojo:exec-maven-plugin:1.5.0:exec failed:
Plugin org.codehaus.mojo:exec-maven-plugin:1.5.0 or one of its dependencies could not be resolved:
Failed to collect dependencies at org.codehaus.mojo:exec-maven-plugin:jar:1.5.0 -> org.apache.maven:maven-toolchain:jar:1.0:
Failed to read artifact descriptor for org.apache.maven:maven-toolchain:jar:1.0: Could not
transfer artifact org.apache.maven:maven-toolchain:pom:1.0 from/to central (https://repo.maven.apache.org/maven2):
Connection reset -> [Help 1]
org.apache.maven.lifecycle.LifecycleExecutionException: Failed to execute goal org.codehaus.mojo:exec-maven-plugin:1.5.0:exec
(generate-archetype-contents) on project beam-sdks-java-maven-archetypes-examples: Execution
generate-archetype-contents of goal org.codehaus.mojo:exec-maven-plugin:1.5.0:exec failed:
Plugin org.codehaus.mojo:exec-maven-plugin:1.5.0 or one of its dependencies could not be resolved:
Failed to collect dependencies at org.codehaus.mojo:exec-maven-plugin:jar:1.5.0 -> org.apache.maven:maven-toolchain:jar:1.0
	at org.apache.maven.lifecycle.internal.MojoExecutor.execute(MojoExecutor.java:224)
	at org.apache.maven.lifecycle.internal.MojoExecutor.execute(MojoExecutor.java:153)
	at org.apache.maven.lifecycle.internal.MojoExecutor.execute(MojoExecutor.java:145)
	at org.apache.maven.lifecycle.internal.LifecycleModuleBuilder.buildProject(LifecycleModuleBuilder.java:116)
	at org.apache.maven.lifecycle.internal.LifecycleModuleBuilder.buildProject(LifecycleModuleBuilder.java:80)
	at org.apache.maven.lifecycle.internal.builder.singlethreaded.SingleThreadedBuilder.build(SingleThreadedBuilder.java:51)
	at org.apache.maven.lifecycle.internal.LifecycleStarter.execute(LifecycleStarter.java:128)
	at org.apache.maven.DefaultMaven.doExecute(DefaultMaven.java:307)
	at org.apache.maven.DefaultMaven.doExecute(DefaultMaven.java:193)
	at org.apache.maven.DefaultMaven.execute(DefaultMaven.java:106)
	at org.jvnet.hudson.maven3.launcher.Maven33Launcher.main(Maven33Launcher.java:129)
	at sun.reflect.NativeMethodAccessorImpl.invoke0(Native Method)
	at sun.reflect.NativeMethodAccessorImpl.invoke(NativeMethodAccessorImpl.java:62)
	at sun.reflect.DelegatingMethodAccessorImpl.invoke(DelegatingMethodAccessorImpl.java:43)
	at java.lang.reflect.Method.invoke(Method.java:498)
	at org.codehaus.plexus.classworlds.launcher.Launcher.launchStandard(Launcher.java:330)
	at org.codehaus.plexus.classworlds.launcher.Launcher.launch(Launcher.java:238)
	at jenkins.maven3.agent.Maven33Main.launch(Maven33Main.java:176)
	at sun.reflect.NativeMethodAccessorImpl.invoke0(Native Method)
	at sun.reflect.NativeMethodAccessorImpl.invoke(NativeMethodAccessorImpl.java:62)
	at sun.reflect.DelegatingMethodAccessorImpl.invoke(DelegatingMethodAccessorImpl.java:43)
	at java.lang.reflect.Method.invoke(Method.java:498)
	at hudson.maven.Maven3Builder.call(Maven3Builder.java:139)
	at hudson.maven.Maven3Builder.call(Maven3Builder.java:70)
	at hudson.remoting.UserRequest.perform(UserRequest.java:153)
	at hudson.remoting.UserRequest.perform(UserRequest.java:50)
	at hudson.remoting.Request$2.run(Request.java:336)
	at hudson.remoting.InterceptingExecutorService$1.call(InterceptingExecutorService.java:68)
	at java.util.concurrent.FutureTask.run(FutureTask.java:266)
	at java.util.concurrent.ThreadPoolExecutor.runWorker(ThreadPoolExecutor.java:1149)
	at java.util.concurrent.ThreadPoolExecutor$Worker.run(ThreadPoolExecutor.java:624)
	at java.lang.Thread.run(Thread.java:748)
Caused by: org.apache.maven.plugin.PluginExecutionException: Execution generate-archetype-contents
of goal org.codehaus.mojo:exec-maven-plugin:1.5.0:exec failed: Plugin org.codehaus.mojo:exec-maven-plugin:1.5.0
or one of its dependencies could not be resolved: Failed to collect dependencies at org.codehaus.mojo:exec-maven-plugin:jar:1.5.0
-> org.apache.maven:maven-toolchain:jar:1.0
	at org.apache.maven.plugin.DefaultBuildPluginManager.executeMojo(DefaultBuildPluginManager.java:106)
	at org.apache.maven.lifecycle.internal.MojoExecutor.execute(MojoExecutor.java:208)
	... 31 more
Caused by: org.apache.maven.plugin.PluginResolutionException: Plugin org.codehaus.mojo:exec-maven-plugin:1.5.0
or one of its dependencies could not be resolved: Failed to collect dependencies at org.codehaus.mojo:exec-maven-plugin:jar:1.5.0
-> org.apache.maven:maven-toolchain:jar:1.0
	at org.apache.maven.plugin.internal.DefaultPluginDependenciesResolver.resolveInternal(DefaultPluginDependenciesResolver.java:214)
	at org.apache.maven.plugin.internal.DefaultPluginDependenciesResolver.resolve(DefaultPluginDependenciesResolver.java:149)
	at org.apache.maven.plugin.internal.DefaultMavenPluginManager.createPluginRealm(DefaultMavenPluginManager.java:422)
	at org.apache.maven.plugin.internal.DefaultMavenPluginManager.setupPluginRealm(DefaultMavenPluginManager.java:385)
	at org.apache.maven.plugin.DefaultBuildPluginManager.getPluginRealm(DefaultBuildPluginManager.java:231)
	at org.apache.maven.plugin.DefaultBuildPluginManager.executeMojo(DefaultBuildPluginManager.java:102)
	... 32 more
Caused by: org.eclipse.aether.collection.DependencyCollectionException: Failed to collect
dependencies at org.codehaus.mojo:exec-maven-plugin:jar:1.5.0 -> org.apache.maven:maven-toolchain:jar:1.0
	at org.eclipse.aether.internal.impl.DefaultDependencyCollector.collectDependencies(DefaultDependencyCollector.java:291)
	at org.eclipse.aether.internal.impl.DefaultRepositorySystem.collectDependencies(DefaultRepositorySystem.java:316)
	at org.apache.maven.plugin.internal.DefaultPluginDependenciesResolver.resolveInternal(DefaultPluginDependenciesResolver.java:202)
	... 37 more
Caused by: org.eclipse.aether.resolution.ArtifactDescriptorException: Failed to read artifact
descriptor for org.apache.maven:maven-toolchain:jar:1.0
	at org.apache.maven.repository.internal.DefaultArtifactDescriptorReader.loadPom(DefaultArtifactDescriptorReader.java:302)
	at org.apache.maven.repository.internal.DefaultArtifactDescriptorReader.readArtifactDescriptor(DefaultArtifactDescriptorReader.java:218)
	at org.eclipse.aether.internal.impl.DefaultDependencyCollector.resolveCachedArtifactDescriptor(DefaultDependencyCollector.java:535)
	at org.eclipse.aether.internal.impl.DefaultDependencyCollector.getArtifactDescriptorResult(DefaultDependencyCollector.java:519)
	at org.eclipse.aether.internal.impl.DefaultDependencyCollector.processDependency(DefaultDependencyCollector.java:409)
	at org.eclipse.aether.internal.impl.DefaultDependencyCollector.processDependency(DefaultDependencyCollector.java:363)
	at org.eclipse.aether.internal.impl.DefaultDependencyCollector.process(DefaultDependencyCollector.java:351)
	at org.eclipse.aether.internal.impl.DefaultDependencyCollector.collectDependencies(DefaultDependencyCollector.java:254)
	... 39 more
Caused by: org.eclipse.aether.resolution.ArtifactResolutionException: Could not transfer artifact
org.apache.maven:maven-toolchain:pom:1.0 from/to central (https://repo.maven.apache.org/maven2):
Connection reset
	at org.eclipse.aether.internal.impl.DefaultArtifactResolver.resolve(DefaultArtifactResolver.java:444)
	at org.eclipse.aether.internal.impl.DefaultArtifactResolver.resolveArtifacts(DefaultArtifactResolver.java:246)
	at org.eclipse.aether.internal.impl.DefaultArtifactResolver.resolveArtifact(DefaultArtifactResolver.java:223)
	at org.apache.maven.repository.internal.DefaultArtifactDescriptorReader.loadPom(DefaultArtifactDescriptorReader.java:287)
	... 46 more
Caused by: org.eclipse.aether.transfer.ArtifactTransferException: Could not transfer artifact
org.apache.maven:maven-toolchain:pom:1.0 from/to central (https://repo.maven.apache.org/maven2):
Connection reset
	at org.eclipse.aether.connector.basic.ArtifactTransportListener.transferFailed(ArtifactTransportListener.java:43)
	at org.eclipse.aether.connector.basic.BasicRepositoryConnector$TaskRunner.run(BasicRepositoryConnector.java:355)
	at org.eclipse.aether.util.concurrency.RunnableErrorForwarder$1.run(RunnableErrorForwarder.java:67)
	at org.eclipse.aether.connector.basic.BasicRepositoryConnector$DirectExecutor.execute(BasicRepositoryConnector.java:581)
	at org.eclipse.aether.connector.basic.BasicRepositoryConnector.get(BasicRepositoryConnector.java:249)
	at org.eclipse.aether.internal.impl.DefaultArtifactResolver.performDownloads(DefaultArtifactResolver.java:520)
	at org.eclipse.aether.internal.impl.DefaultArtifactResolver.resolve(DefaultArtifactResolver.java:421)
	... 49 more
Caused by: org.apache.maven.wagon.TransferFailedException: Connection reset
	at org.apache.maven.wagon.providers.http.AbstractHttpClientWagon.fillInputData(AbstractHttpClientWagon.java:1066)
	at org.apache.maven.wagon.providers.http.AbstractHttpClientWagon.fillInputData(AbstractHttpClientWagon.java:960)
	at org.apache.maven.wagon.StreamWagon.getInputStream(StreamWagon.java:116)
	at org.apache.maven.wagon.StreamWagon.getIfNewer(StreamWagon.java:88)
	at org.apache.maven.wagon.StreamWagon.get(StreamWagon.java:61)
	at org.eclipse.aether.transport.wagon.WagonTransporter$GetTaskRunner.run(WagonTransporter.java:560)
	at org.eclipse.aether.transport.wagon.WagonTransporter.execute(WagonTransporter.java:427)
	at org.eclipse.aether.transport.wagon.WagonTransporter.get(WagonTransporter.java:404)
	at org.eclipse.aether.connector.basic.BasicRepositoryConnector$GetTaskRunner.runTask(BasicRepositoryConnector.java:447)
	at org.eclipse.aether.connector.basic.BasicRepositoryConnector$TaskRunner.run(BasicRepositoryConnector.java:350)
	... 54 more
Caused by: java.net.SocketException: Connection reset
	at java.net.SocketInputStream.read(SocketInputStream.java:210)
	at java.net.SocketInputStream.read(SocketInputStream.java:141)
	at sun.security.ssl.InputRecord.readFully(InputRecord.java:465)
	at sun.security.ssl.InputRecord.read(InputRecord.java:503)
	at sun.security.ssl.SSLSocketImpl.readRecord(SSLSocketImpl.java:983)
	at sun.security.ssl.SSLSocketImpl.readDataRecord(SSLSocketImpl.java:940)
	at sun.security.ssl.AppInputStream.read(AppInputStream.java:105)
	at org.apache.maven.wagon.providers.http.httpclient.impl.io.SessionInputBufferImpl.streamRead(SessionInputBufferImpl.java:136)
	at org.apache.maven.wagon.providers.http.httpclient.impl.io.SessionInputBufferImpl.fillBuffer(SessionInputBufferImpl.java:152)
	at org.apache.maven.wagon.providers.http.httpclient.impl.io.SessionInputBufferImpl.readLine(SessionInputBufferImpl.java:270)
	at org.apache.maven.wagon.providers.http.httpclient.impl.conn.DefaultHttpResponseParser.parseHead(DefaultHttpResponseParser.java:140)
	at org.apache.maven.wagon.providers.http.httpclient.impl.conn.DefaultHttpResponseParser.parseHead(DefaultHttpResponseParser.java:57)
	at org.apache.maven.wagon.providers.http.httpclient.impl.io.AbstractMessageParser.parse(AbstractMessageParser.java:260)
	at org.apache.maven.wagon.providers.http.httpclient.impl.DefaultBHttpClientConnection.receiveResponseHeader(DefaultBHttpClientConnection.java:161)
	at org.apache.maven.wagon.providers.http.httpclient.impl.conn.CPoolProxy.receiveResponseHeader(CPoolProxy.java:153)
	at org.apache.maven.wagon.providers.http.httpclient.protocol.HttpRequestExecutor.doReceiveResponse(HttpRequestExecutor.java:271)
	at org.apache.maven.wagon.providers.http.httpclient.protocol.HttpRequestExecutor.execute(HttpRequestExecutor.java:123)
	at org.apache.maven.wagon.providers.http.httpclient.impl.execchain.MainClientExec.execute(MainClientExec.java:254)
	at org.apache.maven.wagon.providers.http.httpclient.impl.execchain.ProtocolExec.execute(ProtocolExec.java:195)
	at org.apache.maven.wagon.providers.http.httpclient.impl.execchain.RetryExec.execute(RetryExec.java:86)
	at org.apache.maven.wagon.providers.http.httpclient.impl.execchain.RedirectExec.execute(RedirectExec.java:108)
	at org.apache.maven.wagon.providers.http.httpclient.impl.client.InternalHttpClient.doExecute(InternalHttpClient.java:184)
	at org.apache.maven.wagon.providers.http.httpclient.impl.client.CloseableHttpClient.execute(CloseableHttpClient.java:82)
	at org.apache.maven.wagon.providers.http.AbstractHttpClientWagon.execute(AbstractHttpClientWagon.java:832)
	at org.apache.maven.wagon.providers.http.AbstractHttpClientWagon.fillInputData(AbstractHttpClientWagon.java:983)
	... 63 more
2017-09-02T06:43:03.737 [ERROR] 
2017-09-02T06:43:03.737 [ERROR] Re-run Maven using the -X switch to enable full debug logging.
2017-09-02T06:43:03.737 [ERROR] 
2017-09-02T06:43:03.737 [ERROR] For more information about the errors and possible solutions,
please read the following articles:
2017-09-02T06:43:03.737 [ERROR] [Help 1] http://cwiki.apache.org/confluence/display/MAVEN/PluginResolutionException
2017-09-02T06:43:03.737 [ERROR] 
2017-09-02T06:43:03.737 [ERROR] After correcting the problems, you can resume the build with
the command
2017-09-02T06:43:03.737 [ERROR]   mvn <goals> -rf :beam-sdks-java-maven-archetypes-examples
channel stopped

Mime
View raw message