beam-commits mailing list archives

Site index · List index
Message view « Date » · « Thread »
Top « Date » · « Thread »
From Apache Jenkins Server <jenk...@builds.apache.org>
Subject Build failed in Jenkins: beam_PostCommit_Java_ValidatesRunner_Dataflow #4023
Date Fri, 22 Sep 2017 12:11:19 GMT
See <https://builds.apache.org/job/beam_PostCommit_Java_ValidatesRunner_Dataflow/4023/display/redirect>

------------------------------------------
[...truncated 3.39 MB...]
[INFO] Closing reader after reading 0 records.
[INFO] Adjusting range start from [6b6579303030303030333030] to [6b6579303030303030333030]
as position of first returned record
[INFO] Closing reader after reading 100 records.
[INFO] Closing reader after reading 0 records.
[INFO] Adjusting range start from [6b6579303030303030343030] to [6b6579303030303030343030]
as position of first returned record
[INFO] Closing reader after reading 100 records.
[INFO] Closing reader after reading 0 records.
[INFO] Adjusting range start from [6b6579303030303030353030] to [6b6579303030303030353030]
as position of first returned record
[INFO] Closing reader after reading 100 records.
[INFO] Closing reader after reading 0 records.
[INFO] Adjusting range start from [6b6579303030303030363030] to [6b6579303030303030363030]
as position of first returned record
[INFO] Closing reader after reading 100 records.
[INFO] Closing reader after reading 0 records.
[INFO] Adjusting range start from [6b6579303030303030373030] to [6b6579303030303030373030]
as position of first returned record
[INFO] Closing reader after reading 100 records.
[INFO] Closing reader after reading 0 records.
[INFO] Adjusting range start from [6b6579303030303030383030] to [6b6579303030303030383030]
as position of first returned record
[INFO] Closing reader after reading 100 records.
[INFO] Closing reader after reading 0 records.
[INFO] Adjusting range start from [6b6579303030303030393030] to [6b6579303030303030393030]
as position of first returned record
[INFO] Closing reader after reading 100 records.
[INFO] Closing reader after reading 0 records.
[INFO] Wrote 1 records
[INFO] Adjusting range start from [] to [6b6579303030303030303030] as position of first returned
record
[INFO] Closing reader after reading 100 records.
[INFO] Enabling the use of null credentials. This should not be used in production.
2017-09-22T12:10:35.880 [INFO] Tests run: 27, Failures: 0, Errors: 0, Skipped: 0, Time elapsed:
4.9 s - in org.apache.beam.sdk.io.gcp.bigtable.BigtableIOTest
2017-09-22T12:10:35.881 [INFO] Running org.apache.beam.sdk.io.gcp.datastore.AdaptiveThrottlerTest
2017-09-22T12:10:36.036 [INFO] Tests run: 4, Failures: 0, Errors: 0, Skipped: 0, Time elapsed:
0.15 s - in org.apache.beam.sdk.io.gcp.datastore.AdaptiveThrottlerTest
2017-09-22T12:10:36.036 [INFO] Running org.apache.beam.sdk.io.gcp.datastore.DatastoreV1Test
[ERROR] Unable to update metrics on the current thread. Most likely caused by using metrics
outside the managed work-execution thread.
[INFO] Latest stats timestamp for kind testKind is 1234000000
[INFO] Estimated size bytes for the query is: 1342177280
[INFO] Splitting the query into 20 splits
[WARNING] Failed to translate Gql query 'SELECT * from DummyKind LIMIT 10 LIMIT 0': invalid
query
[WARNING] User query might have a limit already set, so trying without zero limit
[ERROR] Error writing batch of 200 mutations to Datastore (DEADLINE_EXCEEDED): 
[INFO] Latest stats timestamp for kind testKind is 1234000000
[INFO] Splitting the query into 100 splits
2017-09-22T12:10:48.251 [INFO] Tests run: 46, Failures: 0, Errors: 0, Skipped: 0, Time elapsed:
12.21 s - in org.apache.beam.sdk.io.gcp.datastore.DatastoreV1Test
2017-09-22T12:10:48.251 [INFO] Running org.apache.beam.sdk.io.gcp.spanner.SpannerIOWriteTest
2017-09-22T12:10:49.324 [INFO] Tests run: 10, Failures: 0, Errors: 0, Skipped: 0, Time elapsed:
1.068 s - in org.apache.beam.sdk.io.gcp.spanner.SpannerIOWriteTest
2017-09-22T12:10:49.324 [INFO] Running org.apache.beam.sdk.io.gcp.spanner.MutationSizeEstimatorTest
2017-09-22T12:10:49.383 [INFO] Tests run: 6, Failures: 0, Errors: 0, Skipped: 0, Time elapsed:
0.053 s - in org.apache.beam.sdk.io.gcp.spanner.MutationSizeEstimatorTest
2017-09-22T12:10:49.383 [INFO] Running org.apache.beam.sdk.io.gcp.spanner.SpannerIOReadTest
2017-09-22T12:10:50.028 [INFO] Tests run: 5, Failures: 0, Errors: 0, Skipped: 0, Time elapsed:
0.642 s - in org.apache.beam.sdk.io.gcp.spanner.SpannerIOReadTest
2017-09-22T12:10:50.030 [INFO] 
2017-09-22T12:10:50.030 [INFO] Results:
2017-09-22T12:10:50.030 [INFO] 
2017-09-22T12:10:50.030 [INFO] Tests run: 277, Failures: 0, Errors: 0, Skipped: 0
2017-09-22T12:10:50.030 [INFO] 
[JENKINS] Recording test results
2017-09-22T12:10:50.636 [INFO] 
2017-09-22T12:10:50.636 [INFO] --- build-helper-maven-plugin:3.0.0:regex-properties (render-artifact-id)
@ beam-sdks-java-io-google-cloud-platform ---
2017-09-22T12:10:50.961 [INFO] 
2017-09-22T12:10:50.961 [INFO] --- maven-jar-plugin:3.0.2:jar (default-jar) @ beam-sdks-java-io-google-cloud-platform
---
2017-09-22T12:10:50.998 [INFO] Building jar: <https://builds.apache.org/job/beam_PostCommit_Java_ValidatesRunner_Dataflow/ws/sdks/java/io/google-cloud-platform/target/beam-sdks-java-io-google-cloud-platform-2.2.0-SNAPSHOT.jar>
2017-09-22T12:10:51.159 [INFO] 
2017-09-22T12:10:51.159 [INFO] --- maven-site-plugin:3.5.1:attach-descriptor (attach-descriptor)
@ beam-sdks-java-io-google-cloud-platform ---
2017-09-22T12:10:51.372 [INFO] 
2017-09-22T12:10:51.372 [INFO] --- maven-jar-plugin:3.0.2:test-jar (default-test-jar) @ beam-sdks-java-io-google-cloud-platform
---
2017-09-22T12:10:51.397 [INFO] Building jar: <https://builds.apache.org/job/beam_PostCommit_Java_ValidatesRunner_Dataflow/ws/sdks/java/io/google-cloud-platform/target/beam-sdks-java-io-google-cloud-platform-2.2.0-SNAPSHOT-tests.jar>
2017-09-22T12:10:51.542 [INFO] 
2017-09-22T12:10:51.542 [INFO] --- maven-dependency-plugin:3.0.1:analyze-only (default) @
beam-sdks-java-io-google-cloud-platform ---
2017-09-22T12:10:51.768 [INFO] No dependency problems found
[JENKINS] Archiving disabled
2017-09-22T12:10:53.021 [INFO]                                                           
             
2017-09-22T12:10:53.021 [INFO] ------------------------------------------------------------------------
2017-09-22T12:10:53.021 [INFO] Building Apache Beam :: Runners :: Google Cloud Dataflow 2.2.0-SNAPSHOT
2017-09-22T12:10:53.021 [INFO] ------------------------------------------------------------------------
2017-09-22T12:10:53.036 [INFO] Downloading: https://repo.maven.apache.org/maven2/com/google/apis/google-api-services-dataflow/v1b3-rev198-1.22.0/google-api-services-dataflow-v1b3-rev198-1.22.0.pom
[INFO] I/O exception (java.net.SocketException) caught when processing request to {s}->https://repo.maven.apache.org:443:
Connection reset
[INFO] Retrying request to {s}->https://repo.maven.apache.org:443
[INFO] I/O exception (java.net.SocketException) caught when processing request to {s}->https://repo.maven.apache.org:443:
Connection reset
[INFO] Retrying request to {s}->https://repo.maven.apache.org:443
[INFO] I/O exception (java.net.SocketException) caught when processing request to {s}->https://repo.maven.apache.org:443:
Connection reset
[INFO] Retrying request to {s}->https://repo.maven.apache.org:443
2017-09-22T12:10:53.098 [INFO] Downloading: https://repo.maven.apache.org/maven2/com/google/apis/google-api-services-clouddebugger/v2-rev8-1.22.0/google-api-services-clouddebugger-v2-rev8-1.22.0.pom
2017-09-22T12:10:53.126 [INFO] Downloaded: https://repo.maven.apache.org/maven2/com/google/apis/google-api-services-clouddebugger/v2-rev8-1.22.0/google-api-services-clouddebugger-v2-rev8-1.22.0.pom
(3 KB at 92.6 KB/sec)
[JENKINS] Archiving disabled
[JENKINS] Archiving disabled
[JENKINS] Archiving disabled
[JENKINS] Archiving disabled
[JENKINS] Archiving disabled
[JENKINS] Archiving disabled
[JENKINS] Archiving disabled
[JENKINS] Archiving disabled
[JENKINS] Archiving disabled
[JENKINS] Archiving disabled
[JENKINS] Archiving disabled
[JENKINS] Archiving disabled
[JENKINS] Archiving disabled
[JENKINS] Archiving disabled
[JENKINS] Archiving disabled
[JENKINS] Archiving disabled
[JENKINS] Archiving disabled
[JENKINS] Archiving disabled
[JENKINS] Archiving disabled2017-09-22T12:11:04.690 [INFO] ------------------------------------------------------------------------
2017-09-22T12:11:04.690 [INFO] Reactor Summary:
2017-09-22T12:11:04.690 [INFO] 
2017-09-22T12:11:04.690 [INFO] Apache Beam :: Parent .............................. SUCCESS
[ 21.022 s]
2017-09-22T12:11:04.690 [INFO] Apache Beam :: SDKs :: Java :: Build Tools ......... SUCCESS
[  9.236 s]
2017-09-22T12:11:04.690 [INFO] Apache Beam :: SDKs ................................ SUCCESS
[  2.845 s]
2017-09-22T12:11:04.691 [INFO] Apache Beam :: SDKs :: Common ...................... SUCCESS
[  2.008 s]
2017-09-22T12:11:04.691 [INFO] Apache Beam :: SDKs :: Common :: Runner API ........ SUCCESS
[ 14.352 s]
2017-09-22T12:11:04.691 [INFO] Apache Beam :: SDKs :: Common :: Fn API ............ SUCCESS
[  7.089 s]
2017-09-22T12:11:04.691 [INFO] Apache Beam :: SDKs :: Java ........................ SUCCESS
[  2.116 s]
2017-09-22T12:11:04.691 [INFO] Apache Beam :: SDKs :: Java :: Core ................ SUCCESS
[01:12 min]
2017-09-22T12:11:04.691 [INFO] Apache Beam :: Runners ............................. SUCCESS
[  2.016 s]
2017-09-22T12:11:04.691 [INFO] Apache Beam :: Runners :: Core Construction Java ... SUCCESS
[ 11.209 s]
2017-09-22T12:11:04.691 [INFO] Apache Beam :: Runners :: Core Java ................ SUCCESS
[ 22.728 s]
2017-09-22T12:11:04.691 [INFO] Apache Beam :: Runners :: Direct Java .............. SUCCESS
[03:55 min]
2017-09-22T12:11:04.691 [INFO] Apache Beam :: SDKs :: Java :: IO .................. SUCCESS
[  2.332 s]
2017-09-22T12:11:04.691 [INFO] Apache Beam :: SDKs :: Java :: Extensions .......... SUCCESS
[  2.653 s]
2017-09-22T12:11:04.691 [INFO] Apache Beam :: SDKs :: Java :: Extensions :: Google Cloud Platform
Core SUCCESS [ 13.553 s]
2017-09-22T12:11:04.691 [INFO] Apache Beam :: SDKs :: Java :: Extensions :: Protobuf SUCCESS
[ 14.420 s]
2017-09-22T12:11:04.691 [INFO] Apache Beam :: SDKs :: Java :: IO :: Google Cloud Platform
SUCCESS [01:07 min]
2017-09-22T12:11:04.691 [INFO] Apache Beam :: Runners :: Google Cloud Dataflow .... FAILURE
[  0.356 s]
2017-09-22T12:11:04.691 [INFO] ------------------------------------------------------------------------
2017-09-22T12:11:04.691 [INFO] BUILD FAILURE
2017-09-22T12:11:04.691 [INFO] ------------------------------------------------------------------------
2017-09-22T12:11:04.691 [INFO] Total time: 09:28 min
2017-09-22T12:11:04.691 [INFO] Finished at: 2017-09-22T12:11:04+00:00

2017-09-22T12:11:05.796 [INFO] Final Memory: 191M/2302M
2017-09-22T12:11:05.796 [INFO] ------------------------------------------------------------------------
Waiting for Jenkins to finish collecting data
2017-09-22T12:11:06.121 [ERROR] Failed to execute goal on project beam-runners-google-cloud-dataflow-java:
Could not resolve dependencies for project org.apache.beam:beam-runners-google-cloud-dataflow-java:jar:2.2.0-SNAPSHOT:
Failed to collect dependencies at com.google.apis:google-api-services-dataflow:jar:v1b3-rev198-1.22.0:
Failed to read artifact descriptor for com.google.apis:google-api-services-dataflow:jar:v1b3-rev198-1.22.0:
Could not transfer artifact com.google.apis:google-api-services-dataflow:pom:v1b3-rev198-1.22.0
from/to central (https://repo.maven.apache.org/maven2): Connection reset -> [Help 1]
org.apache.maven.lifecycle.LifecycleExecutionException: Failed to execute goal on project
beam-runners-google-cloud-dataflow-java: Could not resolve dependencies for project org.apache.beam:beam-runners-google-cloud-dataflow-java:jar:2.2.0-SNAPSHOT:
Failed to collect dependencies at com.google.apis:google-api-services-dataflow:jar:v1b3-rev198-1.22.0
	at org.apache.maven.lifecycle.internal.LifecycleDependencyResolver.getDependencies(LifecycleDependencyResolver.java:221)
	at org.apache.maven.lifecycle.internal.LifecycleDependencyResolver.resolveProjectDependencies(LifecycleDependencyResolver.java:127)
	at org.apache.maven.lifecycle.internal.MojoExecutor.ensureDependenciesAreResolved(MojoExecutor.java:257)
	at org.apache.maven.lifecycle.internal.MojoExecutor.execute(MojoExecutor.java:200)
	at org.apache.maven.lifecycle.internal.MojoExecutor.execute(MojoExecutor.java:153)
	at org.apache.maven.lifecycle.internal.MojoExecutor.execute(MojoExecutor.java:145)
	at org.apache.maven.lifecycle.internal.LifecycleModuleBuilder.buildProject(LifecycleModuleBuilder.java:116)
	at org.apache.maven.lifecycle.internal.LifecycleModuleBuilder.buildProject(LifecycleModuleBuilder.java:80)
	at org.apache.maven.lifecycle.internal.builder.singlethreaded.SingleThreadedBuilder.build(SingleThreadedBuilder.java:51)
	at org.apache.maven.lifecycle.internal.LifecycleStarter.execute(LifecycleStarter.java:128)
	at org.apache.maven.DefaultMaven.doExecute(DefaultMaven.java:307)
	at org.apache.maven.DefaultMaven.doExecute(DefaultMaven.java:193)
	at org.apache.maven.DefaultMaven.execute(DefaultMaven.java:106)
	at org.jvnet.hudson.maven3.launcher.Maven33Launcher.main(Maven33Launcher.java:129)
	at sun.reflect.NativeMethodAccessorImpl.invoke0(Native Method)
	at sun.reflect.NativeMethodAccessorImpl.invoke(NativeMethodAccessorImpl.java:62)
	at sun.reflect.DelegatingMethodAccessorImpl.invoke(DelegatingMethodAccessorImpl.java:43)
	at java.lang.reflect.Method.invoke(Method.java:498)
	at org.codehaus.plexus.classworlds.launcher.Launcher.launchStandard(Launcher.java:330)
	at org.codehaus.plexus.classworlds.launcher.Launcher.launch(Launcher.java:238)
	at jenkins.maven3.agent.Maven33Main.launch(Maven33Main.java:176)
	at sun.reflect.NativeMethodAccessorImpl.invoke0(Native Method)
	at sun.reflect.NativeMethodAccessorImpl.invoke(NativeMethodAccessorImpl.java:62)
	at sun.reflect.DelegatingMethodAccessorImpl.invoke(DelegatingMethodAccessorImpl.java:43)
	at java.lang.reflect.Method.invoke(Method.java:498)
	at hudson.maven.Maven3Builder.call(Maven3Builder.java:139)
	at hudson.maven.Maven3Builder.call(Maven3Builder.java:70)
	at hudson.remoting.UserRequest.perform(UserRequest.java:153)
	at hudson.remoting.UserRequest.perform(UserRequest.java:50)
	at hudson.remoting.Request$2.run(Request.java:336)
	at hudson.remoting.InterceptingExecutorService$1.call(InterceptingExecutorService.java:68)
	at java.util.concurrent.FutureTask.run(FutureTask.java:266)
	at java.util.concurrent.ThreadPoolExecutor.runWorker(ThreadPoolExecutor.java:1149)
	at java.util.concurrent.ThreadPoolExecutor$Worker.run(ThreadPoolExecutor.java:624)
	at java.lang.Thread.run(Thread.java:748)
Caused by: org.apache.maven.project.DependencyResolutionException: Could not resolve dependencies
for project org.apache.beam:beam-runners-google-cloud-dataflow-java:jar:2.2.0-SNAPSHOT: Failed
to collect dependencies at com.google.apis:google-api-services-dataflow:jar:v1b3-rev198-1.22.0
	at org.apache.maven.project.DefaultProjectDependenciesResolver.resolve(DefaultProjectDependenciesResolver.java:180)
	at org.apache.maven.lifecycle.internal.LifecycleDependencyResolver.getDependencies(LifecycleDependencyResolver.java:195)
	... 34 more
Caused by: org.eclipse.aether.collection.DependencyCollectionException: Failed to collect
dependencies at com.google.apis:google-api-services-dataflow:jar:v1b3-rev198-1.22.0
	at org.eclipse.aether.internal.impl.DefaultDependencyCollector.collectDependencies(DefaultDependencyCollector.java:291)
	at org.eclipse.aether.internal.impl.DefaultRepositorySystem.collectDependencies(DefaultRepositorySystem.java:316)
	at org.apache.maven.project.DefaultProjectDependenciesResolver.resolve(DefaultProjectDependenciesResolver.java:172)
	... 35 more
Caused by: org.eclipse.aether.resolution.ArtifactDescriptorException: Failed to read artifact
descriptor for com.google.apis:google-api-services-dataflow:jar:v1b3-rev198-1.22.0
	at org.apache.maven.repository.internal.DefaultArtifactDescriptorReader.loadPom(DefaultArtifactDescriptorReader.java:302)
	at org.apache.maven.repository.internal.DefaultArtifactDescriptorReader.readArtifactDescriptor(DefaultArtifactDescriptorReader.java:218)
	at org.eclipse.aether.internal.impl.DefaultDependencyCollector.resolveCachedArtifactDescriptor(DefaultDependencyCollector.java:535)
	at org.eclipse.aether.internal.impl.DefaultDependencyCollector.getArtifactDescriptorResult(DefaultDependencyCollector.java:519)
	at org.eclipse.aether.internal.impl.DefaultDependencyCollector.processDependency(DefaultDependencyCollector.java:409)
	at org.eclipse.aether.internal.impl.DefaultDependencyCollector.processDependency(DefaultDependencyCollector.java:363)
	at org.eclipse.aether.internal.impl.DefaultDependencyCollector.process(DefaultDependencyCollector.java:351)
	at org.eclipse.aether.internal.impl.DefaultDependencyCollector.collectDependencies(DefaultDependencyCollector.java:254)
	... 37 more
Caused by: org.eclipse.aether.resolution.ArtifactResolutionException: Could not transfer artifact
com.google.apis:google-api-services-dataflow:pom:v1b3-rev198-1.22.0 from/to central (https://repo.maven.apache.org/maven2):
Connection reset
	at org.eclipse.aether.internal.impl.DefaultArtifactResolver.resolve(DefaultArtifactResolver.java:444)
	at org.eclipse.aether.internal.impl.DefaultArtifactResolver.resolveArtifacts(DefaultArtifactResolver.java:246)
	at org.eclipse.aether.internal.impl.DefaultArtifactResolver.resolveArtifact(DefaultArtifactResolver.java:223)
	at org.apache.maven.repository.internal.DefaultArtifactDescriptorReader.loadPom(DefaultArtifactDescriptorReader.java:287)
	... 44 more
Caused by: org.eclipse.aether.transfer.ArtifactTransferException: Could not transfer artifact
com.google.apis:google-api-services-dataflow:pom:v1b3-rev198-1.22.0 from/to central (https://repo.maven.apache.org/maven2):
Connection reset
	at org.eclipse.aether.connector.basic.ArtifactTransportListener.transferFailed(ArtifactTransportListener.java:43)
	at org.eclipse.aether.connector.basic.BasicRepositoryConnector$TaskRunner.run(BasicRepositoryConnector.java:355)
	at org.eclipse.aether.util.concurrency.RunnableErrorForwarder$1.run(RunnableErrorForwarder.java:67)
	at org.eclipse.aether.connector.basic.BasicRepositoryConnector$DirectExecutor.execute(BasicRepositoryConnector.java:581)
	at org.eclipse.aether.connector.basic.BasicRepositoryConnector.get(BasicRepositoryConnector.java:249)
	at org.eclipse.aether.internal.impl.DefaultArtifactResolver.performDownloads(DefaultArtifactResolver.java:520)
	at org.eclipse.aether.internal.impl.DefaultArtifactResolver.resolve(DefaultArtifactResolver.java:421)
	... 47 more
Caused by: org.apache.maven.wagon.TransferFailedException: Connection reset
	at org.apache.maven.wagon.providers.http.AbstractHttpClientWagon.fillInputData(AbstractHttpClientWagon.java:1066)
	at org.apache.maven.wagon.providers.http.AbstractHttpClientWagon.fillInputData(AbstractHttpClientWagon.java:960)
	at org.apache.maven.wagon.StreamWagon.getInputStream(StreamWagon.java:116)
	at org.apache.maven.wagon.StreamWagon.getIfNewer(StreamWagon.java:88)
	at org.apache.maven.wagon.StreamWagon.get(StreamWagon.java:61)
	at org.eclipse.aether.transport.wagon.WagonTransporter$GetTaskRunner.run(WagonTransporter.java:560)
	at org.eclipse.aether.transport.wagon.WagonTransporter.execute(WagonTransporter.java:427)
	at org.eclipse.aether.transport.wagon.WagonTransporter.get(WagonTransporter.java:404)
	at org.eclipse.aether.connector.basic.BasicRepositoryConnector$GetTaskRunner.runTask(BasicRepositoryConnector.java:447)
	at org.eclipse.aether.connector.basic.BasicRepositoryConnector$TaskRunner.run(BasicRepositoryConnector.java:350)
	... 52 more
Caused by: java.net.SocketException: Connection reset
	at java.net.SocketInputStream.read(SocketInputStream.java:210)
	at java.net.SocketInputStream.read(SocketInputStream.java:141)
	at sun.security.ssl.InputRecord.readFully(InputRecord.java:465)
	at sun.security.ssl.InputRecord.read(InputRecord.java:503)
	at sun.security.ssl.SSLSocketImpl.readRecord(SSLSocketImpl.java:983)
	at sun.security.ssl.SSLSocketImpl.readDataRecord(SSLSocketImpl.java:940)
	at sun.security.ssl.AppInputStream.read(AppInputStream.java:105)
	at org.apache.maven.wagon.providers.http.httpclient.impl.io.SessionInputBufferImpl.streamRead(SessionInputBufferImpl.java:136)
	at org.apache.maven.wagon.providers.http.httpclient.impl.io.SessionInputBufferImpl.fillBuffer(SessionInputBufferImpl.java:152)
	at org.apache.maven.wagon.providers.http.httpclient.impl.io.SessionInputBufferImpl.readLine(SessionInputBufferImpl.java:270)
	at org.apache.maven.wagon.providers.http.httpclient.impl.conn.DefaultHttpResponseParser.parseHead(DefaultHttpResponseParser.java:140)
	at org.apache.maven.wagon.providers.http.httpclient.impl.conn.DefaultHttpResponseParser.parseHead(DefaultHttpResponseParser.java:57)
	at org.apache.maven.wagon.providers.http.httpclient.impl.io.AbstractMessageParser.parse(AbstractMessageParser.java:260)
	at org.apache.maven.wagon.providers.http.httpclient.impl.DefaultBHttpClientConnection.receiveResponseHeader(DefaultBHttpClientConnection.java:161)
	at org.apache.maven.wagon.providers.http.httpclient.impl.conn.CPoolProxy.receiveResponseHeader(CPoolProxy.java:153)
	at org.apache.maven.wagon.providers.http.httpclient.protocol.HttpRequestExecutor.doReceiveResponse(HttpRequestExecutor.java:271)
	at org.apache.maven.wagon.providers.http.httpclient.protocol.HttpRequestExecutor.execute(HttpRequestExecutor.java:123)
	at org.apache.maven.wagon.providers.http.httpclient.impl.execchain.MainClientExec.execute(MainClientExec.java:254)
	at org.apache.maven.wagon.providers.http.httpclient.impl.execchain.ProtocolExec.execute(ProtocolExec.java:195)
	at org.apache.maven.wagon.providers.http.httpclient.impl.execchain.RetryExec.execute(RetryExec.java:86)
	at org.apache.maven.wagon.providers.http.httpclient.impl.execchain.RedirectExec.execute(RedirectExec.java:108)
	at org.apache.maven.wagon.providers.http.httpclient.impl.client.InternalHttpClient.doExecute(InternalHttpClient.java:184)
	at org.apache.maven.wagon.providers.http.httpclient.impl.client.CloseableHttpClient.execute(CloseableHttpClient.java:82)
	at org.apache.maven.wagon.providers.http.AbstractHttpClientWagon.execute(AbstractHttpClientWagon.java:832)
	at org.apache.maven.wagon.providers.http.AbstractHttpClientWagon.fillInputData(AbstractHttpClientWagon.java:983)
	... 61 more
2017-09-22T12:11:06.126 [ERROR] 
2017-09-22T12:11:06.126 [ERROR] Re-run Maven using the -X switch to enable full debug logging.
2017-09-22T12:11:06.126 [ERROR] 
2017-09-22T12:11:06.126 [ERROR] For more information about the errors and possible solutions,
please read the following articles:
2017-09-22T12:11:06.127 [ERROR] [Help 1] http://cwiki.apache.org/confluence/display/MAVEN/DependencyResolutionException
2017-09-22T12:11:06.127 [ERROR] 
2017-09-22T12:11:06.127 [ERROR] After correcting the problems, you can resume the build with
the command
2017-09-22T12:11:06.127 [ERROR]   mvn <goals> -rf :beam-runners-google-cloud-dataflow-java
channel stopped
Not sending mail to unregistered user klk@google.com
Not sending mail to unregistered user millsd@google.com
Not sending mail to unregistered user relax@relax-macbookpro.roam.corp.google.com

Mime
View raw message