beam-commits mailing list archives

Site index · List index
Message view « Date » · « Thread »
Top « Date » · « Thread »
From Apache Jenkins Server <jenk...@builds.apache.org>
Subject Build failed in Jenkins: beam_PostCommit_Java_ValidatesRunner_Dataflow #3793
Date Fri, 18 Aug 2017 23:20:29 GMT
See <https://builds.apache.org/job/beam_PostCommit_Java_ValidatesRunner_Dataflow/3793/display/redirect?page=changes>

Changes:

[lcwik] [BEAM-1347] Convert an InputStream into an Iterable<T> using the Beam Fn

------------------------------------------
[...truncated 327.50 KB...]
2017-08-18T23:19:32.407 [INFO] Downloading: https://repo.maven.apache.org/maven2/com/thoughtworks/paranamer/paranamer/2.7/paranamer-2.7.pom
2017-08-18T23:19:32.438 [INFO] Downloaded: https://repo.maven.apache.org/maven2/com/thoughtworks/paranamer/paranamer/2.7/paranamer-2.7.pom
(6 KB at 166.1 KB/sec)
2017-08-18T23:19:32.439 [INFO] Downloading: https://repo.maven.apache.org/maven2/com/thoughtworks/paranamer/paranamer-parent/2.7/paranamer-parent-2.7.pom
2017-08-18T23:19:32.467 [INFO] Downloaded: https://repo.maven.apache.org/maven2/com/thoughtworks/paranamer/paranamer-parent/2.7/paranamer-parent-2.7.pom
(12 KB at 401.2 KB/sec)
2017-08-18T23:19:32.469 [INFO] Downloading: https://repo.maven.apache.org/maven2/org/xerial/snappy/snappy-java/1.1.4-M3/snappy-java-1.1.4-M3.pom
2017-08-18T23:19:32.494 [INFO] Downloaded: https://repo.maven.apache.org/maven2/org/xerial/snappy/snappy-java/1.1.4-M3/snappy-java-1.1.4-M3.pom
(4 KB at 128.5 KB/sec)
2017-08-18T23:19:32.496 [INFO] Downloading: https://repo.maven.apache.org/maven2/org/apache/commons/commons-compress/1.14/commons-compress-1.14.pom
2017-08-18T23:19:32.523 [INFO] Downloaded: https://repo.maven.apache.org/maven2/org/apache/commons/commons-compress/1.14/commons-compress-1.14.pom
(13 KB at 475.3 KB/sec)
2017-08-18T23:19:32.525 [INFO] Downloading: https://repo.maven.apache.org/maven2/org/apache/commons/commons-parent/42/commons-parent-42.pom
2017-08-18T23:19:32.557 [INFO] Downloaded: https://repo.maven.apache.org/maven2/org/apache/commons/commons-parent/42/commons-parent-42.pom
(67 KB at 2073.9 KB/sec)
2017-08-18T23:19:32.562 [INFO] Downloading: https://repo.maven.apache.org/maven2/org/apache/commons/commons-lang3/3.6/commons-lang3-3.6.pom
2017-08-18T23:19:32.596 [INFO] Downloaded: https://repo.maven.apache.org/maven2/org/apache/commons/commons-lang3/3.6/commons-lang3-3.6.pom
(27 KB at 789.7 KB/sec)
2017-08-18T23:19:32.601 [INFO] Downloading: https://repo.maven.apache.org/maven2/joda-time/joda-time/2.4/joda-time-2.4.pom
2017-08-18T23:19:32.628 [INFO] Downloaded: https://repo.maven.apache.org/maven2/joda-time/joda-time/2.4/joda-time-2.4.pom
(26 KB at 953.3 KB/sec)
2017-08-18T23:19:32.631 [INFO] Downloading: https://repo.maven.apache.org/maven2/com/google/auto/service/auto-service/1.0-rc2/auto-service-1.0-rc2.pom
2017-08-18T23:19:32.664 [INFO] Downloaded: https://repo.maven.apache.org/maven2/com/google/auto/service/auto-service/1.0-rc2/auto-service-1.0-rc2.pom
(3 KB at 81.3 KB/sec)
2017-08-18T23:19:32.665 [INFO] Downloading: https://repo.maven.apache.org/maven2/com/google/auto/auto-parent/2/auto-parent-2.pom
2017-08-18T23:19:32.693 [INFO] Downloaded: https://repo.maven.apache.org/maven2/com/google/auto/auto-parent/2/auto-parent-2.pom
(5 KB at 158.1 KB/sec)
2017-08-18T23:19:32.695 [INFO] Downloading: https://repo.maven.apache.org/maven2/com/google/auto/auto-common/0.3/auto-common-0.3.pom
2017-08-18T23:19:32.721 [INFO] Downloaded: https://repo.maven.apache.org/maven2/com/google/auto/auto-common/0.3/auto-common-0.3.pom
(3 KB at 88.3 KB/sec)
2017-08-18T23:19:32.723 [INFO] Downloading: https://repo.maven.apache.org/maven2/com/google/auto/value/auto-value/1.4.1/auto-value-1.4.1.pom
2017-08-18T23:19:32.749 [INFO] Downloaded: https://repo.maven.apache.org/maven2/com/google/auto/value/auto-value/1.4.1/auto-value-1.4.1.pom
(7 KB at 239.5 KB/sec)
2017-08-18T23:19:32.751 [INFO] Downloading: https://repo.maven.apache.org/maven2/com/google/auto/auto-parent/3/auto-parent-3.pom
2017-08-18T23:19:32.777 [INFO] Downloaded: https://repo.maven.apache.org/maven2/com/google/auto/auto-parent/3/auto-parent-3.pom
(4 KB at 144.2 KB/sec)
2017-08-18T23:19:32.779 [INFO] Downloading: https://repo.maven.apache.org/maven2/com/fasterxml/jackson/dataformat/jackson-dataformat-yaml/2.8.9/jackson-dataformat-yaml-2.8.9.pom
2017-08-18T23:19:32.808 [INFO] Downloaded: https://repo.maven.apache.org/maven2/com/fasterxml/jackson/dataformat/jackson-dataformat-yaml/2.8.9/jackson-dataformat-yaml-2.8.9.pom
(7 KB at 207.5 KB/sec)
2017-08-18T23:19:32.811 [INFO] Downloading: https://repo.maven.apache.org/maven2/org/yaml/snakeyaml/1.17/snakeyaml-1.17.pom
2017-08-18T23:19:32.839 [INFO] Downloaded: https://repo.maven.apache.org/maven2/org/yaml/snakeyaml/1.17/snakeyaml-1.17.pom
(28 KB at 976.7 KB/sec)
2017-08-18T23:19:32.842 [INFO] Downloading: https://repo.maven.apache.org/maven2/org/hamcrest/hamcrest-all/1.3/hamcrest-all-1.3.pom
2017-08-18T23:19:32.869 [INFO] Downloaded: https://repo.maven.apache.org/maven2/org/hamcrest/hamcrest-all/1.3/hamcrest-all-1.3.pom
(650 B at 23.5 KB/sec)
2017-08-18T23:19:32.870 [INFO] Downloading: https://repo.maven.apache.org/maven2/org/slf4j/slf4j-jdk14/1.7.14/slf4j-jdk14-1.7.14.pom
2017-08-18T23:19:32.899 [INFO] Downloaded: https://repo.maven.apache.org/maven2/org/slf4j/slf4j-jdk14/1.7.14/slf4j-jdk14-1.7.14.pom
(1008 B at 33.9 KB/sec)
2017-08-18T23:19:32.902 [INFO] Downloading: https://repo.maven.apache.org/maven2/org/mockito/mockito-all/1.9.5/mockito-all-1.9.5.pom
2017-08-18T23:19:32.928 [INFO] Downloaded: https://repo.maven.apache.org/maven2/org/mockito/mockito-all/1.9.5/mockito-all-1.9.5.pom
(2 KB at 39.1 KB/sec)
2017-08-18T23:19:32.929 [INFO] Downloading: https://repo.maven.apache.org/maven2/com/esotericsoftware/kryo/kryo/2.21/kryo-2.21.pom
2017-08-18T23:19:32.956 [INFO] Downloaded: https://repo.maven.apache.org/maven2/com/esotericsoftware/kryo/kryo/2.21/kryo-2.21.pom
(6 KB at 204.5 KB/sec)
2017-08-18T23:19:32.958 [INFO] Downloading: https://repo.maven.apache.org/maven2/com/esotericsoftware/reflectasm/reflectasm/1.07/reflectasm-1.07.pom
2017-08-18T23:19:32.985 [INFO] Downloaded: https://repo.maven.apache.org/maven2/com/esotericsoftware/reflectasm/reflectasm/1.07/reflectasm-1.07.pom
(4 KB at 111.4 KB/sec)
2017-08-18T23:19:32.987 [INFO] Downloading: https://repo.maven.apache.org/maven2/org/ow2/asm/asm/4.0/asm-4.0.pom
2017-08-18T23:19:33.013 [INFO] Downloaded: https://repo.maven.apache.org/maven2/org/ow2/asm/asm/4.0/asm-4.0.pom
(2 KB at 72.6 KB/sec)
2017-08-18T23:19:33.014 [INFO] Downloading: https://repo.maven.apache.org/maven2/org/ow2/asm/asm-parent/4.0/asm-parent-4.0.pom
2017-08-18T23:19:33.040 [INFO] Downloaded: https://repo.maven.apache.org/maven2/org/ow2/asm/asm-parent/4.0/asm-parent-4.0.pom
(6 KB at 206.3 KB/sec)
2017-08-18T23:19:33.042 [INFO] Downloading: https://repo.maven.apache.org/maven2/com/esotericsoftware/minlog/minlog/1.2/minlog-1.2.pom
2017-08-18T23:19:33.067 [INFO] Downloaded: https://repo.maven.apache.org/maven2/com/esotericsoftware/minlog/minlog/1.2/minlog-1.2.pom
(2 KB at 62.0 KB/sec)
2017-08-18T23:19:33.069 [INFO] Downloading: https://repo.maven.apache.org/maven2/org/objenesis/objenesis/1.2/objenesis-1.2.pom
2017-08-18T23:19:33.095 [INFO] Downloaded: https://repo.maven.apache.org/maven2/org/objenesis/objenesis/1.2/objenesis-1.2.pom
(3 KB at 113.0 KB/sec)
2017-08-18T23:19:33.097 [INFO] Downloading: https://repo.maven.apache.org/maven2/org/objenesis/objenesis-parent/1.2/objenesis-parent-1.2.pom
2017-08-18T23:19:33.125 [INFO] Downloaded: https://repo.maven.apache.org/maven2/org/objenesis/objenesis-parent/1.2/objenesis-parent-1.2.pom
(11 KB at 361.0 KB/sec)
2017-08-18T23:19:33.130 [INFO] Downloading: https://repo.maven.apache.org/maven2/com/google/guava/guava-testlib/20.0/guava-testlib-20.0.jar
2017-08-18T23:19:33.130 [INFO] Downloading: https://repo.maven.apache.org/maven2/com/fasterxml/jackson/core/jackson-core/2.8.9/jackson-core-2.8.9.jar
2017-08-18T23:19:33.131 [INFO] Downloading: https://repo.maven.apache.org/maven2/com/fasterxml/jackson/core/jackson-annotations/2.8.9/jackson-annotations-2.8.9.jar
2017-08-18T23:19:33.131 [INFO] Downloading: https://repo.maven.apache.org/maven2/com/fasterxml/jackson/core/jackson-databind/2.8.9/jackson-databind-2.8.9.jar
2017-08-18T23:19:33.132 [INFO] Downloading: https://repo.maven.apache.org/maven2/org/slf4j/slf4j-api/1.7.14/slf4j-api-1.7.14.jar
2017-08-18T23:19:33.163 [INFO] Downloaded: https://repo.maven.apache.org/maven2/com/fasterxml/jackson/core/jackson-annotations/2.8.9/jackson-annotations-2.8.9.jar
(55 KB at 1650.8 KB/sec)
2017-08-18T23:19:33.163 [INFO] Downloading: https://repo.maven.apache.org/maven2/net/bytebuddy/byte-buddy/1.6.8/byte-buddy-1.6.8.jar
2017-08-18T23:19:33.164 [INFO] Downloaded: https://repo.maven.apache.org/maven2/org/slf4j/slf4j-api/1.7.14/slf4j-api-1.7.14.jar
(33 KB at 993.2 KB/sec)
2017-08-18T23:19:33.164 [INFO] Downloading: https://repo.maven.apache.org/maven2/org/apache/avro/avro/1.8.2/avro-1.8.2.jar
2017-08-18T23:19:33.177 [INFO] Downloaded: https://repo.maven.apache.org/maven2/com/fasterxml/jackson/core/jackson-core/2.8.9/jackson-core-2.8.9.jar
(277 KB at 5872.5 KB/sec)
2017-08-18T23:19:33.177 [INFO] Downloading: https://repo.maven.apache.org/maven2/org/codehaus/jackson/jackson-core-asl/1.9.13/jackson-core-asl-1.9.13.jar
2017-08-18T23:19:33.226 [INFO] Downloaded: https://repo.maven.apache.org/maven2/com/google/guava/guava-testlib/20.0/guava-testlib-20.0.jar
(749 KB at 7794.5 KB/sec)
2017-08-18T23:19:33.226 [INFO] Downloading: https://repo.maven.apache.org/maven2/org/codehaus/jackson/jackson-mapper-asl/1.9.13/jackson-mapper-asl-1.9.13.jar
2017-08-18T23:19:33.230 [INFO] Downloaded: https://repo.maven.apache.org/maven2/org/codehaus/jackson/jackson-core-asl/1.9.13/jackson-core-asl-1.9.13.jar
(227 KB at 2291.0 KB/sec)
2017-08-18T23:19:33.230 [INFO] Downloading: https://repo.maven.apache.org/maven2/com/thoughtworks/paranamer/paranamer/2.7/paranamer-2.7.jar
2017-08-18T23:19:33.241 [INFO] Downloaded: https://repo.maven.apache.org/maven2/com/fasterxml/jackson/core/jackson-databind/2.8.9/jackson-databind-2.8.9.jar
(1214 KB at 10931.1 KB/sec)
2017-08-18T23:19:33.241 [INFO] Downloading: https://repo.maven.apache.org/maven2/org/xerial/snappy/snappy-java/1.1.4-M3/snappy-java-1.1.4-M3.jar
2017-08-18T23:19:33.262 [INFO] Downloaded: https://repo.maven.apache.org/maven2/com/thoughtworks/paranamer/paranamer/2.7/paranamer-2.7.jar
(34 KB at 258.0 KB/sec)
2017-08-18T23:19:33.262 [INFO] Downloading: https://repo.maven.apache.org/maven2/org/apache/commons/commons-compress/1.14/commons-compress-1.14.jar
2017-08-18T23:19:33.307 [INFO] Downloaded: https://repo.maven.apache.org/maven2/org/apache/avro/avro/1.8.2/avro-1.8.2.jar
(1521 KB at 8638.5 KB/sec)
2017-08-18T23:19:33.308 [INFO] Downloading: https://repo.maven.apache.org/maven2/org/apache/commons/commons-lang3/3.6/commons-lang3-3.6.jar
2017-08-18T23:19:33.308 [INFO] Downloaded: https://repo.maven.apache.org/maven2/org/codehaus/jackson/jackson-mapper-asl/1.9.13/jackson-mapper-asl-1.9.13.jar
(763 KB at 4307.2 KB/sec)
2017-08-18T23:19:33.309 [INFO] Downloading: https://repo.maven.apache.org/maven2/joda-time/joda-time/2.4/joda-time-2.4.jar
2017-08-18T23:19:33.326 [INFO] Downloaded: https://repo.maven.apache.org/maven2/org/apache/commons/commons-compress/1.14/commons-compress-1.14.jar
(518 KB at 2654.3 KB/sec)
2017-08-18T23:19:33.326 [INFO] Downloading: https://repo.maven.apache.org/maven2/com/google/auto/service/auto-service/1.0-rc2/auto-service-1.0-rc2.jar
2017-08-18T23:19:33.358 [INFO] Downloaded: https://repo.maven.apache.org/maven2/com/google/auto/service/auto-service/1.0-rc2/auto-service-1.0-rc2.jar
(11 KB at 44.8 KB/sec)
2017-08-18T23:19:33.358 [INFO] Downloading: https://repo.maven.apache.org/maven2/com/google/auto/auto-common/0.3/auto-common-0.3.jar
2017-08-18T23:19:33.373 [INFO] Downloaded: https://repo.maven.apache.org/maven2/org/xerial/snappy/snappy-java/1.1.4-M3/snappy-java-1.1.4-M3.jar
(1471 KB at 6076.2 KB/sec)
2017-08-18T23:19:33.373 [INFO] Downloading: https://repo.maven.apache.org/maven2/com/google/auto/value/auto-value/1.4.1/auto-value-1.4.1.jar
2017-08-18T23:19:33.383 [INFO] Downloaded: https://repo.maven.apache.org/maven2/joda-time/joda-time/2.4/joda-time-2.4.jar
(573 KB at 2280.7 KB/sec)
2017-08-18T23:19:33.383 [INFO] Downloading: https://repo.maven.apache.org/maven2/com/fasterxml/jackson/dataformat/jackson-dataformat-yaml/2.8.9/jackson-dataformat-yaml-2.8.9.jar
2017-08-18T23:19:33.384 [INFO] Downloading: https://repo.maven.apache.org/maven2/org/yaml/snakeyaml/1.17/snakeyaml-1.17.jar
2017-08-18T23:19:33.388 [INFO] Downloaded: https://repo.maven.apache.org/maven2/com/google/auto/auto-common/0.3/auto-common-0.3.jar
(39 KB at 148.7 KB/sec)
2017-08-18T23:19:33.388 [INFO] Downloading: https://repo.maven.apache.org/maven2/org/hamcrest/hamcrest-all/1.3/hamcrest-all-1.3.jar
2017-08-18T23:19:33.418 [INFO] Downloaded: https://repo.maven.apache.org/maven2/com/fasterxml/jackson/dataformat/jackson-dataformat-yaml/2.8.9/jackson-dataformat-yaml-2.8.9.jar
(40 KB at 139.6 KB/sec)
2017-08-18T23:19:33.419 [INFO] Downloading: https://repo.maven.apache.org/maven2/org/slf4j/slf4j-jdk14/1.7.14/slf4j-jdk14-1.7.14.jar
2017-08-18T23:19:33.449 [INFO] Downloaded: https://repo.maven.apache.org/maven2/org/hamcrest/hamcrest-all/1.3/hamcrest-all-1.3.jar
(300 KB at 944.5 KB/sec)
2017-08-18T23:19:33.449 [INFO] Downloading: https://repo.maven.apache.org/maven2/org/mockito/mockito-all/1.9.5/mockito-all-1.9.5.jar
2017-08-18T23:19:33.451 [INFO] Downloaded: https://repo.maven.apache.org/maven2/org/slf4j/slf4j-jdk14/1.7.14/slf4j-jdk14-1.7.14.jar
(8 KB at 23.9 KB/sec)
2017-08-18T23:19:33.451 [INFO] Downloading: https://repo.maven.apache.org/maven2/com/esotericsoftware/kryo/kryo/2.21/kryo-2.21.jar
2017-08-18T23:19:33.505 [INFO] Downloaded: https://repo.maven.apache.org/maven2/com/esotericsoftware/kryo/kryo/2.21/kryo-2.21.jar
(355 KB at 951.6 KB/sec)
2017-08-18T23:19:33.505 [INFO] Downloading: https://repo.maven.apache.org/maven2/com/esotericsoftware/reflectasm/reflectasm/1.07/reflectasm-1.07-shaded.jar
2017-08-18T23:19:33.512 [INFO] Downloaded: https://repo.maven.apache.org/maven2/com/google/auto/value/auto-value/1.4.1/auto-value-1.4.1.jar
(1470 KB at 3867.0 KB/sec)
2017-08-18T23:19:33.512 [INFO] Downloading: https://repo.maven.apache.org/maven2/org/ow2/asm/asm/4.0/asm-4.0.jar
2017-08-18T23:19:33.515 [INFO] Downloaded: https://repo.maven.apache.org/maven2/org/yaml/snakeyaml/1.17/snakeyaml-1.17.jar
(268 KB at 697.6 KB/sec)
2017-08-18T23:19:33.515 [INFO] Downloading: https://repo.maven.apache.org/maven2/com/esotericsoftware/minlog/minlog/1.2/minlog-1.2.jar
2017-08-18T23:19:33.536 [INFO] Downloaded: https://repo.maven.apache.org/maven2/com/esotericsoftware/reflectasm/reflectasm/1.07/reflectasm-1.07-shaded.jar
(65 KB at 158.6 KB/sec)
2017-08-18T23:19:33.536 [INFO] Downloading: https://repo.maven.apache.org/maven2/org/objenesis/objenesis/1.2/objenesis-1.2.jar
2017-08-18T23:19:33.541 [INFO] Downloaded: https://repo.maven.apache.org/maven2/com/esotericsoftware/minlog/minlog/1.2/minlog-1.2.jar
(5 KB at 11.9 KB/sec)
2017-08-18T23:19:33.544 [INFO] Downloaded: https://repo.maven.apache.org/maven2/org/ow2/asm/asm/4.0/asm-4.0.jar
(45 KB at 109.1 KB/sec)
2017-08-18T23:19:33.568 [INFO] Downloaded: https://repo.maven.apache.org/maven2/org/objenesis/objenesis/1.2/objenesis-1.2.jar
(36 KB at 80.7 KB/sec)
2017-08-18T23:19:33.585 [INFO] Downloaded: https://repo.maven.apache.org/maven2/org/mockito/mockito-all/1.9.5/mockito-all-1.9.5.jar
(1545 KB at 3408.4 KB/sec)
2017-08-18T23:19:33.608 [INFO] Downloaded: https://repo.maven.apache.org/maven2/org/apache/commons/commons-lang3/3.6/commons-lang3-3.6.jar
(484 KB at 1013.1 KB/sec)
[JENKINS] Archiving disabled
[JENKINS] Archiving disabled
[JENKINS] Archiving disabled
[JENKINS] Archiving disabled
[JENKINS] Archiving disabled
[JENKINS] Archiving disabled
[JENKINS] Archiving disabled
[JENKINS] Archiving disabled
[JENKINS] Archiving disabled
[JENKINS] Archiving disabled
[JENKINS] Archiving disabled
[JENKINS] Archiving disabled
[JENKINS] Archiving disabled
[JENKINS] Archiving disabled
[JENKINS] Archiving disabled
[JENKINS] Archiving disabled
[JENKINS] Archiving disabled
[JENKINS] Archiving disabled
[JENKINS] Archiving disabled
2017-08-18T23:19:41.687 [INFO] ------------------------------------------------------------------------
2017-08-18T23:19:41.687 [INFO] Reactor Summary:
2017-08-18T23:19:41.687 [INFO] 
2017-08-18T23:19:41.688 [INFO] Apache Beam :: Parent .............................. SUCCESS
[ 26.954 s]
2017-08-18T23:19:41.688 [INFO] Apache Beam :: SDKs :: Java :: Build Tools ......... SUCCESS
[  9.703 s]
2017-08-18T23:19:41.688 [INFO] Apache Beam :: SDKs ................................ SUCCESS
[  2.373 s]
2017-08-18T23:19:41.688 [INFO] Apache Beam :: SDKs :: Common ...................... SUCCESS
[  2.790 s]
2017-08-18T23:19:41.688 [INFO] Apache Beam :: SDKs :: Common :: Runner API ........ SUCCESS
[ 15.871 s]
2017-08-18T23:19:41.688 [INFO] Apache Beam :: SDKs :: Common :: Fn API ............ SUCCESS
[ 11.070 s]
2017-08-18T23:19:41.688 [INFO] Apache Beam :: SDKs :: Java ........................ SUCCESS
[  2.156 s]
2017-08-18T23:19:41.688 [INFO] Apache Beam :: SDKs :: Java :: Core ................ FAILURE
[  2.119 s]
2017-08-18T23:19:41.688 [INFO] Apache Beam :: Runners ............................. SKIPPED
2017-08-18T23:19:41.688 [INFO] Apache Beam :: Runners :: Core Construction Java ... SKIPPED
2017-08-18T23:19:41.688 [INFO] Apache Beam :: Runners :: Core Java ................ SKIPPED
2017-08-18T23:19:41.688 [INFO] Apache Beam :: Runners :: Direct Java .............. SKIPPED
2017-08-18T23:19:41.688 [INFO] Apache Beam :: SDKs :: Java :: IO .................. SKIPPED
2017-08-18T23:19:41.688 [INFO] Apache Beam :: SDKs :: Java :: Extensions .......... SKIPPED
2017-08-18T23:19:41.688 [INFO] Apache Beam :: SDKs :: Java :: Extensions :: Google Cloud Platform
Core SKIPPED
2017-08-18T23:19:41.688 [INFO] Apache Beam :: SDKs :: Java :: Extensions :: Protobuf SKIPPED
2017-08-18T23:19:41.688 [INFO] Apache Beam :: SDKs :: Java :: IO :: Google Cloud Platform
SKIPPED
2017-08-18T23:19:41.688 [INFO] Apache Beam :: Runners :: Google Cloud Dataflow .... SKIPPED
2017-08-18T23:19:41.688 [INFO] ------------------------------------------------------------------------
2017-08-18T23:19:41.688 [INFO] BUILD FAILURE
2017-08-18T23:19:41.688 [INFO] ------------------------------------------------------------------------
2017-08-18T23:19:41.688 [INFO] Total time: 02:11 min
2017-08-18T23:19:41.688 [INFO] Finished at: 2017-08-18T23:19:41+00:00
2017-08-18T23:19:41.974 [INFO] Final Memory: 96M/1380M
2017-08-18T23:19:41.974 [INFO] ------------------------------------------------------------------------
2017-08-18T23:19:41.978 [ERROR] Failed to execute goal on project beam-sdks-java-core: Could
not resolve dependencies for project org.apache.beam:beam-sdks-java-core:jar:2.2.0-SNAPSHOT:
Could not transfer artifact net.bytebuddy:byte-buddy:jar:1.6.8 from/to central (https://repo.maven.apache.org/maven2):
GET request of: net/bytebuddy/byte-buddy/1.6.8/byte-buddy-1.6.8.jar from central failed: Connection
reset -> [Help 1]
org.apache.maven.lifecycle.LifecycleExecutionException: Failed to execute goal on project
beam-sdks-java-core: Could not resolve dependencies for project org.apache.beam:beam-sdks-java-core:jar:2.2.0-SNAPSHOT:
Could not transfer artifact net.bytebuddy:byte-buddy:jar:1.6.8 from/to central (https://repo.maven.apache.org/maven2):
GET request of: net/bytebuddy/byte-buddy/1.6.8/byte-buddy-1.6.8.jar from central failed
	at org.apache.maven.lifecycle.internal.LifecycleDependencyResolver.getDependencies(LifecycleDependencyResolver.java:221)
	at org.apache.maven.lifecycle.internal.LifecycleDependencyResolver.resolveProjectDependencies(LifecycleDependencyResolver.java:127)
	at org.apache.maven.lifecycle.internal.MojoExecutor.ensureDependenciesAreResolved(MojoExecutor.java:257)
	at org.apache.maven.lifecycle.internal.MojoExecutor.execute(MojoExecutor.java:200)
	at org.apache.maven.lifecycle.internal.MojoExecutor.execute(MojoExecutor.java:153)
	at org.apache.maven.lifecycle.internal.MojoExecutor.execute(MojoExecutor.java:145)
	at org.apache.maven.lifecycle.internal.LifecycleModuleBuilder.buildProject(LifecycleModuleBuilder.java:116)
	at org.apache.maven.lifecycle.internal.LifecycleModuleBuilder.buildProject(LifecycleModuleBuilder.java:80)
	at org.apache.maven.lifecycle.internal.builder.singlethreaded.SingleThreadedBuilder.build(SingleThreadedBuilder.java:51)
	at org.apache.maven.lifecycle.internal.LifecycleStarter.execute(LifecycleStarter.java:128)
	at org.apache.maven.DefaultMaven.doExecute(DefaultMaven.java:307)
	at org.apache.maven.DefaultMaven.doExecute(DefaultMaven.java:193)
	at org.apache.maven.DefaultMaven.execute(DefaultMaven.java:106)
	at org.jvnet.hudson.maven3.launcher.Maven33Launcher.main(Maven33Launcher.java:129)
	at sun.reflect.NativeMethodAccessorImpl.invoke0(Native Method)
	at sun.reflect.NativeMethodAccessorImpl.invoke(NativeMethodAccessorImpl.java:62)
	at sun.reflect.DelegatingMethodAccessorImpl.invoke(DelegatingMethodAccessorImpl.java:43)
	at java.lang.reflect.Method.invoke(Method.java:498)
	at org.codehaus.plexus.classworlds.launcher.Launcher.launchStandard(Launcher.java:330)
	at org.codehaus.plexus.classworlds.launcher.Launcher.launch(Launcher.java:238)
	at jenkins.maven3.agent.Maven33Main.launch(Maven33Main.java:176)
	at sun.reflect.NativeMethodAccessorImpl.invoke0(Native Method)
	at sun.reflect.NativeMethodAccessorImpl.invoke(NativeMethodAccessorImpl.java:62)
	at sun.reflect.DelegatingMethodAccessorImpl.invoke(DelegatingMethodAccessorImpl.java:43)
	at java.lang.reflect.Method.invoke(Method.java:498)
	at hudson.maven.Maven3Builder.call(Maven3Builder.java:139)
	at hudson.maven.Maven3Builder.call(Maven3Builder.java:70)
	at hudson.remoting.UserRequest.perform(UserRequest.java:153)
	at hudson.remoting.UserRequest.perform(UserRequest.java:50)
	at hudson.remoting.Request$2.run(Request.java:336)
	at hudson.remoting.InterceptingExecutorService$1.call(InterceptingExecutorService.java:68)
	at java.util.concurrent.FutureTask.run(FutureTask.java:266)
	at java.util.concurrent.ThreadPoolExecutor.runWorker(ThreadPoolExecutor.java:1149)
	at java.util.concurrent.ThreadPoolExecutor$Worker.run(ThreadPoolExecutor.java:624)
	at java.lang.Thread.run(Thread.java:748)
Caused by: org.apache.maven.project.DependencyResolutionException: Could not resolve dependencies
for project org.apache.beam:beam-sdks-java-core:jar:2.2.0-SNAPSHOT: Could not transfer artifact
net.bytebuddy:byte-buddy:jar:1.6.8 from/to central (https://repo.maven.apache.org/maven2):
GET request of: net/bytebuddy/byte-buddy/1.6.8/byte-buddy-1.6.8.jar from central failed
	at org.apache.maven.project.DefaultProjectDependenciesResolver.resolve(DefaultProjectDependenciesResolver.java:211)
	at org.apache.maven.lifecycle.internal.LifecycleDependencyResolver.getDependencies(LifecycleDependencyResolver.java:195)
	... 34 more
Caused by: org.eclipse.aether.resolution.DependencyResolutionException: Could not transfer
artifact net.bytebuddy:byte-buddy:jar:1.6.8 from/to central (https://repo.maven.apache.org/maven2):
GET request of: net/bytebuddy/byte-buddy/1.6.8/byte-buddy-1.6.8.jar from central failed
	at org.eclipse.aether.internal.impl.DefaultRepositorySystem.resolveDependencies(DefaultRepositorySystem.java:384)
	at org.apache.maven.project.DefaultProjectDependenciesResolver.resolve(DefaultProjectDependenciesResolver.java:205)
	... 35 more
Caused by: org.eclipse.aether.resolution.ArtifactResolutionException: Could not transfer artifact
net.bytebuddy:byte-buddy:jar:1.6.8 from/to central (https://repo.maven.apache.org/maven2):
GET request of: net/bytebuddy/byte-buddy/1.6.8/byte-buddy-1.6.8.jar from central failed
	at org.eclipse.aether.internal.impl.DefaultArtifactResolver.resolve(DefaultArtifactResolver.java:444)
	at org.eclipse.aether.internal.impl.DefaultArtifactResolver.resolveArtifacts(DefaultArtifactResolver.java:246)
	at org.eclipse.aether.internal.impl.DefaultRepositorySystem.resolveDependencies(DefaultRepositorySystem.java:367)
	... 36 more
Caused by: org.eclipse.aether.transfer.ArtifactTransferException: Could not transfer artifact
net.bytebuddy:byte-buddy:jar:1.6.8 from/to central (https://repo.maven.apache.org/maven2):
GET request of: net/bytebuddy/byte-buddy/1.6.8/byte-buddy-1.6.8.jar from central failed
	at org.eclipse.aether.connector.basic.ArtifactTransportListener.transferFailed(ArtifactTransportListener.java:43)
	at org.eclipse.aether.connector.basic.BasicRepositoryConnector$TaskRunner.run(BasicRepositoryConnector.java:355)
	at org.eclipse.aether.util.concurrency.RunnableErrorForwarder$1.run(RunnableErrorForwarder.java:67)
	... 3 more
Caused by: org.apache.maven.wagon.TransferFailedException: GET request of: net/bytebuddy/byte-buddy/1.6.8/byte-buddy-1.6.8.jar
from central failed
	at org.apache.maven.wagon.AbstractWagon.getTransfer(AbstractWagon.java:363)
	at org.apache.maven.wagon.AbstractWagon.getTransfer(AbstractWagon.java:316)
	at org.apache.maven.wagon.AbstractWagon.getTransfer(AbstractWagon.java:285)
	at org.apache.maven.wagon.StreamWagon.getIfNewer(StreamWagon.java:97)
	at org.apache.maven.wagon.StreamWagon.get(StreamWagon.java:61)
	at org.eclipse.aether.transport.wagon.WagonTransporter$GetTaskRunner.run(WagonTransporter.java:560)
	at org.eclipse.aether.transport.wagon.WagonTransporter.execute(WagonTransporter.java:427)
	at org.eclipse.aether.transport.wagon.WagonTransporter.get(WagonTransporter.java:404)
	at org.eclipse.aether.connector.basic.BasicRepositoryConnector$GetTaskRunner.runTask(BasicRepositoryConnector.java:447)
	at org.eclipse.aether.connector.basic.BasicRepositoryConnector$TaskRunner.run(BasicRepositoryConnector.java:350)
	... 4 more
Caused by: java.net.SocketException: Connection reset
	at java.net.SocketInputStream.read(SocketInputStream.java:210)
	at java.net.SocketInputStream.read(SocketInputStream.java:141)
	at sun.security.ssl.InputRecord.readFully(InputRecord.java:465)
	at sun.security.ssl.InputRecord.readV3Record(InputRecord.java:593)
	at sun.security.ssl.InputRecord.read(InputRecord.java:532)
	at sun.security.ssl.SSLSocketImpl.readRecord(SSLSocketImpl.java:983)
	at sun.security.ssl.SSLSocketImpl.readDataRecord(SSLSocketImpl.java:940)
	at sun.security.ssl.AppInputStream.read(AppInputStream.java:105)
	at org.apache.maven.wagon.providers.http.httpclient.impl.io.SessionInputBufferImpl.streamRead(SessionInputBufferImpl.java:136)
	at org.apache.maven.wagon.providers.http.httpclient.impl.io.SessionInputBufferImpl.read(SessionInputBufferImpl.java:195)
	at org.apache.maven.wagon.providers.http.httpclient.impl.io.ContentLengthInputStream.read(ContentLengthInputStream.java:178)
	at org.apache.maven.wagon.providers.http.httpclient.conn.EofSensorInputStream.read(EofSensorInputStream.java:137)
	at org.apache.maven.wagon.AbstractWagon.transfer(AbstractWagon.java:531)
	at org.apache.maven.wagon.AbstractWagon.getTransfer(AbstractWagon.java:353)
	... 13 more
2017-08-18T23:19:41.982 [ERROR] 
2017-08-18T23:19:41.982 [ERROR] Re-run Maven using the -X switch to enable full debug logging.
2017-08-18T23:19:41.982 [ERROR] 
2017-08-18T23:19:41.982 [ERROR] For more information about the errors and possible solutions,
please read the following articles:
2017-08-18T23:19:41.982 [ERROR] [Help 1] http://cwiki.apache.org/confluence/display/MAVEN/DependencyResolutionException
2017-08-18T23:19:41.983 [ERROR] 
2017-08-18T23:19:41.983 [ERROR] After correcting the problems, you can resume the build with
the command
2017-08-18T23:19:41.983 [ERROR]   mvn <goals> -rf :beam-sdks-java-core
channel stopped
Not sending mail to unregistered user owenzhang1990@gmail.com
Not sending mail to unregistered user sourabhbajaj@google.com
Not sending mail to unregistered user relax@relax-macbookpro.roam.corp.google.com
Not sending mail to unregistered user aljoscha.krettek@gmail.com
Not sending mail to unregistered user kirpichov@google.com
Not sending mail to unregistered user klk@google.com
Not sending mail to unregistered user alex-filatov@users.noreply.github.com
Not sending mail to unregistered user echauchot@gmail.com+jbonofre@apache.org
Not sending mail to unregistered user fipsy@google.com

Mime
View raw message