beam-commits mailing list archives

Site index · List index
Message view « Date » · « Thread »
Top « Date » · « Thread »
From Apache Jenkins Server <jenk...@builds.apache.org>
Subject Build failed in Jenkins: beam_PostCommit_Java_MavenInstall #4645
Date Fri, 25 Aug 2017 18:38:18 GMT
See <https://builds.apache.org/job/beam_PostCommit_Java_MavenInstall/4645/display/redirect>

------------------------------------------
[...truncated 1.44 MB...]
2017-08-25T18:37:24.139 [INFO] Downloaded: https://repo.maven.apache.org/maven2/org/eclipse/jetty/jetty-servlet/9.2.13.v20150730/jetty-servlet-9.2.13.v20150730.jar
(113 KB at 164.7 KB/sec)
2017-08-25T18:37:24.139 [INFO] Downloading: https://repo.maven.apache.org/maven2/org/eclipse/jetty/jetty-webapp/9.2.13.v20150730/jetty-webapp-9.2.13.v20150730.jar
2017-08-25T18:37:24.155 [INFO] Downloaded: https://repo.maven.apache.org/maven2/org/eclipse/jetty/jetty-servlets/9.2.13.v20150730/jetty-servlets-9.2.13.v20150730.jar
(120 KB at 170.6 KB/sec)
2017-08-25T18:37:24.155 [INFO] Downloading: https://repo.maven.apache.org/maven2/org/eclipse/jetty/jetty-xml/9.2.13.v20150730/jetty-xml-9.2.13.v20150730.jar
2017-08-25T18:37:24.160 [INFO] Downloaded: https://repo.maven.apache.org/maven2/org/eclipse/jetty/jetty-server/9.2.13.v20150730/jetty-server-9.2.13.v20150730.jar
(409 KB at 578.5 KB/sec)
2017-08-25T18:37:24.161 [INFO] Downloading: https://repo.maven.apache.org/maven2/org/htrace/htrace-core/3.0.4/htrace-core-3.0.4.jar
2017-08-25T18:37:24.181 [INFO] Downloaded: https://repo.maven.apache.org/maven2/org/apache/ant/ant/1.8.2/ant-1.8.2.jar
(1889 KB at 2594.0 KB/sec)
2017-08-25T18:37:24.181 [INFO] Downloading: https://repo.maven.apache.org/maven2/org/ow2/asm/asm/5.0.4/asm-5.0.4.jar
2017-08-25T18:37:24.188 [INFO] Downloaded: https://repo.maven.apache.org/maven2/org/eclipse/jetty/jetty-xml/9.2.13.v20150730/jetty-xml-9.2.13.v20150730.jar
(44 KB at 58.6 KB/sec)
2017-08-25T18:37:24.188 [INFO] Downloading: https://repo.maven.apache.org/maven2/org/ow2/asm/asm-commons/5.0.4/asm-commons-5.0.4.jar
2017-08-25T18:37:24.189 [INFO] Downloaded: https://repo.maven.apache.org/maven2/org/htrace/htrace-core/3.0.4/htrace-core-3.0.4.jar
(31 KB at 41.4 KB/sec)
2017-08-25T18:37:24.189 [INFO] Downloading: https://repo.maven.apache.org/maven2/org/restlet/jee/org.restlet/2.3.0/org.restlet-2.3.0.jar
2017-08-25T18:37:24.196 [INFO] Downloaded: https://repo.maven.apache.org/maven2/org/eclipse/jetty/jetty-webapp/9.2.13.v20150730/jetty-webapp-9.2.13.v20150730.jar
(106 KB at 141.8 KB/sec)
2017-08-25T18:37:24.196 [INFO] Downloading: https://repo.maven.apache.org/maven2/org/restlet/jee/org.restlet.ext.servlet/2.3.0/org.restlet.ext.servlet-2.3.0.jar
2017-08-25T18:37:24.202 [INFO] Downloading: https://repo.maven.apache.org/maven2/org/apache/solr/solr-core/5.5.4/solr-core-5.5.4.jar
2017-08-25T18:37:24.202 [INFO] Downloaded: https://repo.maven.apache.org/maven2/org/eclipse/jetty/jetty-util/9.2.13.v20150730/jetty-util-9.2.13.v20150730.jar
(350 KB at 467.0 KB/sec)
2017-08-25T18:37:24.202 [INFO] Downloading: https://repo.maven.apache.org/maven2/com/carrotsearch/randomizedtesting/randomizedtesting-runner/2.3.2/randomizedtesting-runner-2.3.2.jar
2017-08-25T18:37:24.208 [INFO] Downloading: https://repo.maven.apache.org/maven2/org/slf4j/slf4j-log4j12/1.7.14/slf4j-log4j12-1.7.14.jar
2017-08-25T18:37:24.211 [INFO] Downloaded: https://repo.maven.apache.org/maven2/org/ow2/asm/asm/5.0.4/asm-5.0.4.jar
(53 KB at 68.7 KB/sec)
2017-08-25T18:37:24.216 [INFO] Downloaded: https://repo.maven.apache.org/maven2/org/ow2/asm/asm-commons/5.0.4/asm-commons-5.0.4.jar
(41 KB at 53.5 KB/sec)
2017-08-25T18:37:24.257 [INFO] Downloaded: https://repo.maven.apache.org/maven2/org/slf4j/slf4j-log4j12/1.7.14/slf4j-log4j12-1.7.14.jar
(10 KB at 11.3 KB/sec)
2017-08-25T18:37:24.299 [INFO] Downloaded: https://repo.maven.apache.org/maven2/com/carrotsearch/randomizedtesting/randomizedtesting-runner/2.3.2/randomizedtesting-runner-2.3.2.jar
(233 KB at 274.6 KB/sec)
2017-08-25T18:37:24.565 [INFO] Downloaded: https://repo.maven.apache.org/maven2/org/apache/solr/solr-core/5.5.4/solr-core-5.5.4.jar
(3805 KB at 3420.9 KB/sec)
2017-08-25T18:37:24.577 [INFO] Downloading: http://maven.restlet.org/org/apache/lucene/lucene-analyzers-kuromoji/5.5.4/lucene-analyzers-kuromoji-5.5.4.jar
2017-08-25T18:37:24.577 [INFO] Downloading: http://maven.restlet.org/org/restlet/jee/org.restlet/2.3.0/org.restlet-2.3.0.jar
2017-08-25T18:37:24.580 [INFO] Downloading: http://maven.restlet.org/org/restlet/jee/org.restlet.ext.servlet/2.3.0/org.restlet.ext.servlet-2.3.0.jar
2017-08-25T18:37:24.985 [INFO] Downloaded: http://maven.restlet.org/org/restlet/jee/org.restlet.ext.servlet/2.3.0/org.restlet.ext.servlet-2.3.0.jar
(23 KB at 55.0 KB/sec)
2017-08-25T18:37:25.221 [INFO] Downloaded: http://maven.restlet.org/org/restlet/jee/org.restlet/2.3.0/org.restlet-2.3.0.jar
(692 KB at 1073.7 KB/sec)
2017-08-25T18:37:25.222 [INFO] Downloading: https://repository.cloudera.com/artifactory/libs-release/org/apache/lucene/lucene-analyzers-kuromoji/5.5.4/lucene-analyzers-kuromoji-5.5.4.jar
[JENKINS] Archiving disabled
2017-08-25T18:37:26.109 [INFO]                                                           
             
2017-08-25T18:37:26.110 [INFO] ------------------------------------------------------------------------
2017-08-25T18:37:26.110 [INFO] Skipping Apache Beam :: Parent
2017-08-25T18:37:26.110 [INFO] This project has been banned from the build due to previous
failures.
2017-08-25T18:37:26.110 [INFO] ------------------------------------------------------------------------
[JENKINS] Archiving disabled
[JENKINS] Archiving disabled
[JENKINS] Archiving disabled
[JENKINS] Archiving disabled
[JENKINS] Archiving disabled
[JENKINS] Archiving disabled
[JENKINS] Archiving disabled
[JENKINS] Archiving disabled
[JENKINS] Archiving disabled
[JENKINS] Archiving disabled
[JENKINS] Archiving disabled
[JENKINS] Archiving disabled
[JENKINS] Archiving disabled
[JENKINS] Archiving disabled
[JENKINS] Archiving disabled
[JENKINS] Archiving disabled
[JENKINS] Archiving disabled
[JENKINS] Archiving disabled
[JENKINS] Archiving disabled
[JENKINS] Archiving disabled
[JENKINS] Archiving disabled
[JENKINS] Archiving disabled
[JENKINS] Archiving disabled
[JENKINS] Archiving disabled
[JENKINS] Archiving disabled
[JENKINS] Archiving disabled
[JENKINS] Archiving disabled
[JENKINS] Archiving disabled
[JENKINS] Archiving disabled
[JENKINS] Archiving disabled
[JENKINS] Archiving disabled
[JENKINS] Archiving disabled
[JENKINS] Archiving disabled
[JENKINS] Archiving disabled
[JENKINS] Archiving disabled
[JENKINS] Archiving disabled
[JENKINS] Archiving disabled
[JENKINS] Archiving disabled
[JENKINS] Archiving disabled
[JENKINS] Archiving disabled
[JENKINS] Archiving disabled
[JENKINS] Archiving disabled
[JENKINS] Archiving disabled
[JENKINS] Archiving disabled
[JENKINS] Archiving disabled
[JENKINS] Archiving disabled
[JENKINS] Archiving disabled
[JENKINS] Archiving disabled
[JENKINS] Archiving disabled
[JENKINS] Archiving disabled
[JENKINS] Archiving disabled
[JENKINS] Archiving disabled
[JENKINS] Archiving disabled
[JENKINS] Archiving disabled
[JENKINS] Archiving disabled
[JENKINS] Archiving disabled2017-08-25T18:38:05.893 [INFO] ------------------------------------------------------------------------
2017-08-25T18:38:05.893 [INFO] Reactor Summary:
2017-08-25T18:38:05.893 [INFO] 
2017-08-25T18:38:05.893 [INFO] Apache Beam :: Parent .............................. SUCCESS
[ 45.206 s]
2017-08-25T18:38:05.893 [INFO] Apache Beam :: SDKs :: Java :: Build Tools ......... SUCCESS
[ 15.100 s]
2017-08-25T18:38:05.893 [INFO] Apache Beam :: SDKs ................................ SUCCESS
[  5.978 s]
2017-08-25T18:38:05.893 [INFO] Apache Beam :: SDKs :: Common ...................... SUCCESS
[  3.282 s]
2017-08-25T18:38:05.893 [INFO] Apache Beam :: SDKs :: Common :: Runner API ........ SUCCESS
[ 35.122 s]
2017-08-25T18:38:05.893 [INFO] Apache Beam :: SDKs :: Common :: Fn API ............ SUCCESS
[ 17.848 s]
2017-08-25T18:38:05.893 [INFO] Apache Beam :: SDKs :: Java ........................ SUCCESS
[  3.232 s]
2017-08-25T18:38:05.893 [INFO] Apache Beam :: SDKs :: Java :: Core ................ SUCCESS
[03:03 min]
2017-08-25T18:38:05.893 [INFO] Apache Beam :: Runners ............................. SUCCESS
[  3.194 s]
2017-08-25T18:38:05.893 [INFO] Apache Beam :: Runners :: Core Construction Java ... SUCCESS
[ 33.926 s]
2017-08-25T18:38:05.893 [INFO] Apache Beam :: Runners :: Core Java ................ SUCCESS
[ 58.485 s]
2017-08-25T18:38:05.893 [INFO] Apache Beam :: Runners :: Direct Java .............. SUCCESS
[04:52 min]
2017-08-25T18:38:05.893 [INFO] Apache Beam :: SDKs :: Java :: IO .................. SUCCESS
[ 15.907 s]
2017-08-25T18:38:05.893 [INFO] Apache Beam :: SDKs :: Java :: IO :: AMQP .......... SUCCESS
[ 39.799 s]
2017-08-25T18:38:05.893 [INFO] Apache Beam :: SDKs :: Java :: IO :: Common ........ SUCCESS
[  7.278 s]
2017-08-25T18:38:05.893 [INFO] Apache Beam :: SDKs :: Java :: IO :: Cassandra ..... SUCCESS
[ 29.858 s]
2017-08-25T18:38:05.893 [INFO] Apache Beam :: SDKs :: Java :: IO :: Elasticsearch . SUCCESS
[ 41.586 s]
2017-08-25T18:38:05.893 [INFO] Apache Beam :: SDKs :: Java :: Extensions .......... SUCCESS
[  3.045 s]
2017-08-25T18:38:05.893 [INFO] Apache Beam :: SDKs :: Java :: Extensions :: Google Cloud Platform
Core SUCCESS [ 32.200 s]
2017-08-25T18:38:05.893 [INFO] Apache Beam :: SDKs :: Java :: Extensions :: Protobuf SUCCESS
[ 22.640 s]
2017-08-25T18:38:05.893 [INFO] Apache Beam :: SDKs :: Java :: IO :: Google Cloud Platform
SUCCESS [01:37 min]
2017-08-25T18:38:05.893 [INFO] Apache Beam :: SDKs :: Java :: IO :: Hadoop Common . SUCCESS
[ 24.455 s]
2017-08-25T18:38:05.893 [INFO] Apache Beam :: SDKs :: Java :: IO :: Hadoop File System SUCCESS
[ 49.618 s]
2017-08-25T18:38:05.893 [INFO] Apache Beam :: SDKs :: Java :: IO :: Hadoop ........ SUCCESS
[  5.513 s]
2017-08-25T18:38:05.893 [INFO] Apache Beam :: SDKs :: Java :: IO :: Hadoop :: input-format
SUCCESS [ 27.098 s]
2017-08-25T18:38:05.893 [INFO] Apache Beam :: Runners :: Google Cloud Dataflow .... SUCCESS
[07:30 min]
2017-08-25T18:38:05.893 [INFO] Apache Beam :: SDKs :: Java :: IO :: Hadoop :: jdk1.8-tests
SUCCESS [01:43 min]
2017-08-25T18:38:05.893 [INFO] Apache Beam :: SDKs :: Java :: IO :: HBase ......... SUCCESS
[01:49 min]
2017-08-25T18:38:05.893 [INFO] Apache Beam :: SDKs :: Java :: IO :: HCatalog ...... SUCCESS
[01:10 min]
2017-08-25T18:38:05.893 [INFO] Apache Beam :: SDKs :: Java :: IO :: JDBC .......... SUCCESS
[ 43.108 s]
2017-08-25T18:38:05.893 [INFO] Apache Beam :: SDKs :: Java :: IO :: JMS ........... SUCCESS
[ 26.399 s]
2017-08-25T18:38:05.893 [INFO] Apache Beam :: SDKs :: Java :: IO :: Kafka ......... SUCCESS
[ 40.954 s]
2017-08-25T18:38:05.894 [INFO] Apache Beam :: SDKs :: Java :: IO :: Kinesis ....... SUCCESS
[ 28.465 s]
2017-08-25T18:38:05.894 [INFO] Apache Beam :: SDKs :: Java :: IO :: MongoDB ....... SUCCESS
[ 45.091 s]
2017-08-25T18:38:05.894 [INFO] Apache Beam :: SDKs :: Java :: IO :: MQTT .......... SUCCESS
[ 40.373 s]
2017-08-25T18:38:05.894 [INFO] Apache Beam :: SDKs :: Java :: IO :: Solr .......... FAILURE
[  5.196 s]
2017-08-25T18:38:05.894 [INFO] Apache Beam :: SDKs :: Java :: IO :: XML ........... SKIPPED
2017-08-25T18:38:05.894 [INFO] Apache Beam :: SDKs :: Java :: Maven Archetypes .... SKIPPED
2017-08-25T18:38:05.894 [INFO] Apache Beam :: SDKs :: Java :: Maven Archetypes :: Starter
SKIPPED
2017-08-25T18:38:05.894 [INFO] Apache Beam :: Examples ............................ SKIPPED
2017-08-25T18:38:05.894 [INFO] Apache Beam :: Examples :: Java .................... SKIPPED
2017-08-25T18:38:05.894 [INFO] Apache Beam :: SDKs :: Java :: Maven Archetypes :: Examples
SKIPPED
2017-08-25T18:38:05.894 [INFO] Apache Beam :: Examples :: Java 8 .................. SKIPPED
2017-08-25T18:38:05.894 [INFO] Apache Beam :: SDKs :: Java :: Maven Archetypes :: Examples
- Java 8 SKIPPED
2017-08-25T18:38:05.894 [INFO] Apache Beam :: SDKs :: Java :: Extensions :: Jackson SKIPPED
2017-08-25T18:38:05.894 [INFO] Apache Beam :: SDKs :: Java :: Extensions :: Join library SKIPPED
2017-08-25T18:38:05.894 [INFO] Apache Beam :: SDKs :: Java :: Extensions :: Sorter  SKIPPED
2017-08-25T18:38:05.894 [INFO] Apache Beam :: SDKs :: Java :: Nexmark ............. SKIPPED
2017-08-25T18:38:05.894 [INFO] Apache Beam :: SDKs :: Java :: Harness ............. SKIPPED
2017-08-25T18:38:05.894 [INFO] Apache Beam :: SDKs :: Java :: Java 8 Tests ........ SKIPPED
2017-08-25T18:38:05.894 [INFO] Apache Beam :: SDKs :: Python ...................... SKIPPED
2017-08-25T18:38:05.894 [INFO] Apache Beam :: Runners :: Flink .................... SKIPPED
2017-08-25T18:38:05.894 [INFO] Apache Beam :: Runners :: Spark .................... SKIPPED
2017-08-25T18:38:05.894 [INFO] Apache Beam :: Runners :: Apex ..................... SKIPPED
2017-08-25T18:38:05.894 [INFO] Apache Beam :: Runners :: Gearpump ................. SKIPPED
2017-08-25T18:38:05.894 [INFO] Apache Beam :: SDKs :: Java :: Aggregated Javadoc .. SKIPPED
2017-08-25T18:38:05.894 [INFO] ------------------------------------------------------------------------
2017-08-25T18:38:05.894 [INFO] BUILD FAILURE
2017-08-25T18:38:05.894 [INFO] ------------------------------------------------------------------------
2017-08-25T18:38:05.894 [INFO] Total time: 35:56 min
2017-08-25T18:38:05.894 [INFO] Finished at: 2017-08-25T18:38:05+00:00

2017-08-25T18:38:06.898 [INFO] Final Memory: 284M/1911M
2017-08-25T18:38:06.899 [INFO] ------------------------------------------------------------------------
2017-08-25T18:38:06.904 [ERROR] Failed to execute goal on project beam-sdks-java-io-solr:
Could not resolve dependencies for project org.apache.beam:beam-sdks-java-io-solr:jar:2.2.0-SNAPSHOT:
Could not transfer artifact org.apache.lucene:lucene-analyzers-kuromoji:jar:5.5.4 from/to
central (https://repo.maven.apache.org/maven2): GET request of: org/apache/lucene/lucene-analyzers-kuromoji/5.5.4/lucene-analyzers-kuromoji-5.5.4.jar
from central failed: Connection reset -> [Help 1]
org.apache.maven.lifecycle.LifecycleExecutionException: Failed to execute goal on project
beam-sdks-java-io-solr: Could not resolve dependencies for project org.apache.beam:beam-sdks-java-io-solr:jar:2.2.0-SNAPSHOT:
Could not transfer artifact org.apache.lucene:lucene-analyzers-kuromoji:jar:5.5.4 from/to
central (https://repo.maven.apache.org/maven2): GET request of: org/apache/lucene/lucene-analyzers-kuromoji/5.5.4/lucene-analyzers-kuromoji-5.5.4.jar
from central failed
	at org.apache.maven.lifecycle.internal.LifecycleDependencyResolver.getDependencies(LifecycleDependencyResolver.java:221)
	at org.apache.maven.lifecycle.internal.LifecycleDependencyResolver.resolveProjectDependencies(LifecycleDependencyResolver.java:127)
	at org.apache.maven.lifecycle.internal.MojoExecutor.ensureDependenciesAreResolved(MojoExecutor.java:257)
	at org.apache.maven.lifecycle.internal.MojoExecutor.execute(MojoExecutor.java:200)
	at org.apache.maven.lifecycle.internal.MojoExecutor.execute(MojoExecutor.java:153)
	at org.apache.maven.lifecycle.internal.MojoExecutor.execute(MojoExecutor.java:145)
	at org.apache.maven.lifecycle.internal.LifecycleModuleBuilder.buildProject(LifecycleModuleBuilder.java:116)
	at org.apache.maven.lifecycle.internal.LifecycleModuleBuilder.buildProject(LifecycleModuleBuilder.java:80)
	at org.apache.maven.lifecycle.internal.builder.singlethreaded.SingleThreadedBuilder.build(SingleThreadedBuilder.java:51)
	at org.apache.maven.lifecycle.internal.LifecycleStarter.execute(LifecycleStarter.java:128)
	at org.apache.maven.DefaultMaven.doExecute(DefaultMaven.java:307)
	at org.apache.maven.DefaultMaven.doExecute(DefaultMaven.java:193)
	at org.apache.maven.DefaultMaven.execute(DefaultMaven.java:106)
	at org.jvnet.hudson.maven3.launcher.Maven33Launcher.main(Maven33Launcher.java:129)
	at sun.reflect.NativeMethodAccessorImpl.invoke0(Native Method)
	at sun.reflect.NativeMethodAccessorImpl.invoke(NativeMethodAccessorImpl.java:62)
	at sun.reflect.DelegatingMethodAccessorImpl.invoke(DelegatingMethodAccessorImpl.java:43)
	at java.lang.reflect.Method.invoke(Method.java:498)
	at org.codehaus.plexus.classworlds.launcher.Launcher.launchStandard(Launcher.java:330)
	at org.codehaus.plexus.classworlds.launcher.Launcher.launch(Launcher.java:238)
	at jenkins.maven3.agent.Maven33Main.launch(Maven33Main.java:176)
	at sun.reflect.NativeMethodAccessorImpl.invoke0(Native Method)
	at sun.reflect.NativeMethodAccessorImpl.invoke(NativeMethodAccessorImpl.java:62)
	at sun.reflect.DelegatingMethodAccessorImpl.invoke(DelegatingMethodAccessorImpl.java:43)
	at java.lang.reflect.Method.invoke(Method.java:498)
	at hudson.maven.Maven3Builder.call(Maven3Builder.java:139)
	at hudson.maven.Maven3Builder.call(Maven3Builder.java:70)
	at hudson.remoting.UserRequest.perform(UserRequest.java:153)
	at hudson.remoting.UserRequest.perform(UserRequest.java:50)
	at hudson.remoting.Request$2.run(Request.java:336)
	at hudson.remoting.InterceptingExecutorService$1.call(InterceptingExecutorService.java:68)
	at java.util.concurrent.FutureTask.run(FutureTask.java:266)
	at java.util.concurrent.ThreadPoolExecutor.runWorker(ThreadPoolExecutor.java:1149)
	at java.util.concurrent.ThreadPoolExecutor$Worker.run(ThreadPoolExecutor.java:624)
	at java.lang.Thread.run(Thread.java:748)
Caused by: org.apache.maven.project.DependencyResolutionException: Could not resolve dependencies
for project org.apache.beam:beam-sdks-java-io-solr:jar:2.2.0-SNAPSHOT: Could not transfer
artifact org.apache.lucene:lucene-analyzers-kuromoji:jar:5.5.4 from/to central (https://repo.maven.apache.org/maven2):
GET request of: org/apache/lucene/lucene-analyzers-kuromoji/5.5.4/lucene-analyzers-kuromoji-5.5.4.jar
from central failed
	at org.apache.maven.project.DefaultProjectDependenciesResolver.resolve(DefaultProjectDependenciesResolver.java:211)
	at org.apache.maven.lifecycle.internal.LifecycleDependencyResolver.getDependencies(LifecycleDependencyResolver.java:195)
	... 34 more
Caused by: org.eclipse.aether.resolution.DependencyResolutionException: Could not transfer
artifact org.apache.lucene:lucene-analyzers-kuromoji:jar:5.5.4 from/to central (https://repo.maven.apache.org/maven2):
GET request of: org/apache/lucene/lucene-analyzers-kuromoji/5.5.4/lucene-analyzers-kuromoji-5.5.4.jar
from central failed
	at org.eclipse.aether.internal.impl.DefaultRepositorySystem.resolveDependencies(DefaultRepositorySystem.java:384)
	at org.apache.maven.project.DefaultProjectDependenciesResolver.resolve(DefaultProjectDependenciesResolver.java:205)
	... 35 more
Caused by: org.eclipse.aether.resolution.ArtifactResolutionException: Could not transfer artifact
org.apache.lucene:lucene-analyzers-kuromoji:jar:5.5.4 from/to central (https://repo.maven.apache.org/maven2):
GET request of: org/apache/lucene/lucene-analyzers-kuromoji/5.5.4/lucene-analyzers-kuromoji-5.5.4.jar
from central failed
	at org.eclipse.aether.internal.impl.DefaultArtifactResolver.resolve(DefaultArtifactResolver.java:444)
	at org.eclipse.aether.internal.impl.DefaultArtifactResolver.resolveArtifacts(DefaultArtifactResolver.java:246)
	at org.eclipse.aether.internal.impl.DefaultRepositorySystem.resolveDependencies(DefaultRepositorySystem.java:367)
	... 36 more
Caused by: org.eclipse.aether.transfer.ArtifactTransferException: Could not transfer artifact
org.apache.lucene:lucene-analyzers-kuromoji:jar:5.5.4 from/to central (https://repo.maven.apache.org/maven2):
GET request of: org/apache/lucene/lucene-analyzers-kuromoji/5.5.4/lucene-analyzers-kuromoji-5.5.4.jar
from central failed
	at org.eclipse.aether.connector.basic.ArtifactTransportListener.transferFailed(ArtifactTransportListener.java:43)
	at org.eclipse.aether.connector.basic.BasicRepositoryConnector$TaskRunner.run(BasicRepositoryConnector.java:355)
	at org.eclipse.aether.util.concurrency.RunnableErrorForwarder$1.run(RunnableErrorForwarder.java:67)
	... 3 more
Caused by: org.apache.maven.wagon.TransferFailedException: GET request of: org/apache/lucene/lucene-analyzers-kuromoji/5.5.4/lucene-analyzers-kuromoji-5.5.4.jar
from central failed
	at org.apache.maven.wagon.AbstractWagon.getTransfer(AbstractWagon.java:363)
	at org.apache.maven.wagon.AbstractWagon.getTransfer(AbstractWagon.java:316)
	at org.apache.maven.wagon.AbstractWagon.getTransfer(AbstractWagon.java:285)
	at org.apache.maven.wagon.StreamWagon.getIfNewer(StreamWagon.java:97)
	at org.apache.maven.wagon.StreamWagon.get(StreamWagon.java:61)
	at org.eclipse.aether.transport.wagon.WagonTransporter$GetTaskRunner.run(WagonTransporter.java:560)
	at org.eclipse.aether.transport.wagon.WagonTransporter.execute(WagonTransporter.java:427)
	at org.eclipse.aether.transport.wagon.WagonTransporter.get(WagonTransporter.java:404)
	at org.eclipse.aether.connector.basic.BasicRepositoryConnector$GetTaskRunner.runTask(BasicRepositoryConnector.java:447)
	at org.eclipse.aether.connector.basic.BasicRepositoryConnector$TaskRunner.run(BasicRepositoryConnector.java:350)
	... 4 more
Caused by: java.net.SocketException: Connection reset
	at java.net.SocketInputStream.read(SocketInputStream.java:210)
	at java.net.SocketInputStream.read(SocketInputStream.java:141)
	at sun.security.ssl.InputRecord.readFully(InputRecord.java:465)
	at sun.security.ssl.InputRecord.readV3Record(InputRecord.java:593)
	at sun.security.ssl.InputRecord.read(InputRecord.java:532)
	at sun.security.ssl.SSLSocketImpl.readRecord(SSLSocketImpl.java:983)
	at sun.security.ssl.SSLSocketImpl.readDataRecord(SSLSocketImpl.java:940)
	at sun.security.ssl.AppInputStream.read(AppInputStream.java:105)
	at org.apache.maven.wagon.providers.http.httpclient.impl.io.SessionInputBufferImpl.streamRead(SessionInputBufferImpl.java:136)
	at org.apache.maven.wagon.providers.http.httpclient.impl.io.SessionInputBufferImpl.read(SessionInputBufferImpl.java:195)
	at org.apache.maven.wagon.providers.http.httpclient.impl.io.ContentLengthInputStream.read(ContentLengthInputStream.java:178)
	at org.apache.maven.wagon.providers.http.httpclient.conn.EofSensorInputStream.read(EofSensorInputStream.java:137)
	at org.apache.maven.wagon.AbstractWagon.transfer(AbstractWagon.java:531)
	at org.apache.maven.wagon.AbstractWagon.getTransfer(AbstractWagon.java:353)
	... 13 more
2017-08-25T18:38:06.906 [ERROR] 
2017-08-25T18:38:06.906 [ERROR] Re-run Maven using the -X switch to enable full debug logging.
2017-08-25T18:38:06.906 [ERROR] 
2017-08-25T18:38:06.906 [ERROR] For more information about the errors and possible solutions,
please read the following articles:
2017-08-25T18:38:06.906 [ERROR] [Help 1] http://cwiki.apache.org/confluence/display/MAVEN/DependencyResolutionException
2017-08-25T18:38:06.906 [ERROR] 
2017-08-25T18:38:06.906 [ERROR] After correcting the problems, you can resume the build with
the command
2017-08-25T18:38:06.906 [ERROR]   mvn <goals> -rf :beam-sdks-java-io-solr
channel stopped

Mime
View raw message