beam-commits mailing list archives

Site index · List index
Message view « Date » · « Thread »
Top « Date » · « Thread »
From Apache Jenkins Server <jenk...@builds.apache.org>
Subject Build failed in Jenkins: beam_PerformanceTests_JDBC #177
Date Mon, 07 Aug 2017 12:07:00 GMT
See <https://builds.apache.org/job/beam_PerformanceTests_JDBC/177/display/redirect?page=changes>

Changes:

[klk] Uniquify application nodes in TextIOReadTest and only run pipeline once

[tgroh] Register a PTransformTranslator for Combine

[klk] Use RehydratedComponents for memoized rehydration

[klk] Use dehydration-insensitive APIs in WindowEvaluatorFactory

[klk] Use dehydration-insensitive APIs in ParDoEvaluatorFactory

[kirpichov] Unbreaks AvroSource compatibility with Dataflow worker

[lcwik] [BEAM-2662] Fix Java quickstart for Spark to include Spark version

[pei] ReshuffleTest: replace Iterable equal tests with matchers.

[aljoscha.krettek] [BEAM-2571] Change DoFnOperator to use Long.MAX_VALUE as max watermark

[aljoscha.krettek] [BEAM-2571] Clarify pushedback variable name in DoFnOperator

[aljoscha.krettek] [BEAM-2571] Respect watermark contract in Flink DoFnOperator

[aviemzur] [BEAM-2314] Add ValidatesRunner test for merging custom windows

[klk] Add stub DisplayDataTranslation

[klk] Fix tests that passed invalid input to DynamicDestinations

[klk] Add Pipeline rehydration from proto

[klk] Dehydrate then rehydrate Pipeline before DirectRunner.run()

[klk] ReduceFnRunner: test when watermark leapfrogs EOW and GC

[robertwb] Let IsBounded take True value.

[kirpichov] Adds ValueProvider support to AvroIO.Read

[kirpichov] Extracts common logic from TextIO.ReadAll into a utility transform

[kirpichov] Introduces AvroIO.readAll() and readAllGenericRecords()

[chamikara] We shouldn't write to re-created tables for 2 mins

[kirpichov] Sets desired bundle size on AvroIO.readAll

[lcwik] [BEAM-2658] register DefaultCoder first and SerializableCoder last

[robertwb] Use runner API for read operation.

[robertwb] Disable abc metaclass due to issues with pickling.

[robertwb] Create common superclass for all Sources.

[robertwb] Translate combining operations through the Runner API.

[robertwb] Migrate checkCombineFn in TestUtils to CombineFnTester

[iemejia] [BEAM-1984] Fix scope for dependencies needed only for test purposes

[jbonofre] [BEAM-2541] Check Elasticsearch backend version when the pipeline is run

[kirpichov] Fixes BigQueryIO.Write javadoc for to(ValueInSingleWindow)

[kirpichov] [BEAM-2640] Introduces Create.ofProvider(ValueProvider)

[kirpichov] [BEAM-2641] Introduces TextIO.read().withHintMatchesManyFiles()

[kirpichov] Adds AvroIO.read().withHintMatchesManyFiles()

[alex-filatov] Fix View.asMultimap javadoc.

[iemejia] Add missing displayData to ElasticsearchIO.Read

[kirpichov] Introduces TypeDescriptors.extractFromTypeParameters

[kirpichov] [BEAM-2677] AvroIO.parseGenericRecords - schemaless AvroIO.read

[kirpichov] Removes TransformingSource that is now unused

[tgroh] Perform a Multi-step combine in the DirectRunner

[kirpichov] [BEAM-92] Supports DynamicDestinations in AvroIO.

[kirpichov] [BEAM-2623] Introduces Watch transform

[tgroh] Programmatically Create Beam Jenkins View.

[jbonofre] [BEAM-2530] Upgrade maven plugins to the latest versions

[iemejia] [BEAM-2690] HCatalogIO needs provided scope dependencies on Hadoop, Hive

[tgroh] Remove References to CloudObject from the Java Harness

[robertwb] Translate ParDo operations through the Runner API.

[robertwb] Streaming fixes.

[robertwb] Translate GroupByKey[Only] through the Runner API.

[robertwb] More informative references in the proto representation.

[tgroh] Add the Beam Job API service definition

[kirpichov] [BEAM-2670] Fixes SparkRuntimeContext.getPipelineOptions()

[kirpichov] Introduces SerializablePipelineOptions in core-construction

[jbonofre] [BEAM-2708] Configure BZIP2 to read all "streams"

[kirpichov] [BEAM-1542] Specifies a User Agent in Spanner Client

[robertwb] Fix typo in dataflow_runner.

[jbonofre] Remove unneeded surefire configuration for hadoop-file-system

[lcwik] Add local filesystem as default and strip away prefix from local files

[robertwb] Improving naming of steps that consume side inputs

[chamikara] Adds support for reading concatenated bzip2 files.

[lcwik] [BEAM-1347] Add utility to be able to model inbound reading as a single

[kirpichov] Makes all Source classes override getOutputCoder instead of

[kirpichov] Requires specifying a Coder on PCollection.createPrimitiveOutputInternal

[kirpichov] Removes all overrides of PTransform.getDefaultOutputCoder and deprecates

[kirpichov] Remembers the output coders of SplittableParDo

[robertwb] Refactor FnApiRunner to operate directly on the runner API protos.

[altay] [BEAM-1584] Add clean up in bigquery integration test

[robertwb] [BEAM-2729] Allow GBK of union-typed PCollections.

[kirpichov] Adds coders for boolean, ResourceId and Metadata

[kirpichov] Introduces EmptyMatchTreatment parameter to FileSystems.match()

[kirpichov] [BEAM-2512] Introduces TextIO.watchForNewFiles() and Match

[kirpichov] [BEAM-2734] Unbreaks some Dataflow ValidatesRunner tests

------------------------------------------
[...truncated 46.85 KB...]
[INFO] --- maven-install-plugin:2.5.2:install (default-install) @ beam-runners-google-cloud-dataflow-java
---
[INFO] Installing <https://builds.apache.org/job/beam_PerformanceTests_JDBC/ws/runners/google-cloud-dataflow-java/target/beam-runners-google-cloud-dataflow-java-2.2.0-SNAPSHOT.jar>
to /home/jenkins/.m2/repository/org/apache/beam/beam-runners-google-cloud-dataflow-java/2.2.0-SNAPSHOT/beam-runners-google-cloud-dataflow-java-2.2.0-SNAPSHOT.jar
[INFO] Installing <https://builds.apache.org/job/beam_PerformanceTests_JDBC/ws/runners/google-cloud-dataflow-java/dependency-reduced-pom.xml>
to /home/jenkins/.m2/repository/org/apache/beam/beam-runners-google-cloud-dataflow-java/2.2.0-SNAPSHOT/beam-runners-google-cloud-dataflow-java-2.2.0-SNAPSHOT.pom
[INFO] Installing <https://builds.apache.org/job/beam_PerformanceTests_JDBC/ws/runners/google-cloud-dataflow-java/target/beam-runners-google-cloud-dataflow-java-2.2.0-SNAPSHOT-tests.jar>
to /home/jenkins/.m2/repository/org/apache/beam/beam-runners-google-cloud-dataflow-java/2.2.0-SNAPSHOT/beam-runners-google-cloud-dataflow-java-2.2.0-SNAPSHOT-tests.jar
[INFO] Installing <https://builds.apache.org/job/beam_PerformanceTests_JDBC/ws/runners/google-cloud-dataflow-java/target/beam-runners-google-cloud-dataflow-java-2.2.0-SNAPSHOT-tests.jar>
to /home/jenkins/.m2/repository/org/apache/beam/beam-runners-google-cloud-dataflow-java/2.2.0-SNAPSHOT/beam-runners-google-cloud-dataflow-java-2.2.0-SNAPSHOT-tests.jar
[INFO] ------------------------------------------------------------------------
[INFO] BUILD SUCCESS
[INFO] ------------------------------------------------------------------------
[INFO] Total time: 58.221 s
[INFO] Finished at: 2017-08-07T12:06:33Z
[INFO] Final Memory: 92M/1364M
[INFO] ------------------------------------------------------------------------
[beam_PerformanceTests_JDBC] $ /bin/bash -xe /tmp/jenkins4289095311494128758.sh
+ /home/jenkins/tools/maven/latest/bin/mvn -B -e verify -pl sdks/java/io/jdbc -Dio-it-suite
-DpkbLocation=<https://builds.apache.org/job/beam_PerformanceTests_JDBC/ws/PerfKitBenchmarker/pkb.py>
-DmvnBinary=/home/jenkins/tools/maven/latest/bin/mvn '-DintegrationTestPipelineOptions=[ "--project=apache-beam-testing",
"--tempRoot=gs://temp-storage-for-end-to-end-tests" ]'
[INFO] Error stacktraces are turned on.
[INFO] Scanning for projects...
[INFO] ------------------------------------------------------------------------
[INFO] Detecting the operating system and CPU architecture
[INFO] ------------------------------------------------------------------------
[INFO] os.detected.name: linux
[INFO] os.detected.arch: x86_64
[INFO] os.detected.version: 3.19
[INFO] os.detected.version.major: 3
[INFO] os.detected.version.minor: 19
[INFO] os.detected.release: ubuntu
[INFO] os.detected.release.version: 14.04
[INFO] os.detected.release.like.ubuntu: true
[INFO] os.detected.release.like.debian: true
[INFO] os.detected.classifier: linux-x86_64
[INFO] 
[INFO] ------------------------------------------------------------------------
[INFO] Building Apache Beam :: SDKs :: Java :: IO :: JDBC 2.2.0-SNAPSHOT
[INFO] ------------------------------------------------------------------------
[INFO] Downloading: http://repository.apache.org/snapshots/org/apache/beam/beam-runners-direct-java/2.2.0-SNAPSHOT/maven-metadata.xml
[INFO] Downloaded: http://repository.apache.org/snapshots/org/apache/beam/beam-runners-direct-java/2.2.0-SNAPSHOT/maven-metadata.xml
(1.7 kB at 3.4 kB/s)
[INFO] Downloading: http://repository.apache.org/snapshots/org/apache/beam/beam-runners-direct-java/2.2.0-SNAPSHOT/beam-runners-direct-java-2.2.0-20170807.071408-24.pom
[INFO] Downloaded: http://repository.apache.org/snapshots/org/apache/beam/beam-runners-direct-java/2.2.0-SNAPSHOT/beam-runners-direct-java-2.2.0-20170807.071408-24.pom
(10 kB at 63 kB/s)
[INFO] Downloading: http://repository.apache.org/snapshots/org/apache/beam/beam-sdks-java-io-common/2.2.0-SNAPSHOT/maven-metadata.xml
[INFO] Downloaded: http://repository.apache.org/snapshots/org/apache/beam/beam-sdks-java-io-common/2.2.0-SNAPSHOT/maven-metadata.xml
(1.4 kB at 8.8 kB/s)
[INFO] Downloading: http://repository.apache.org/snapshots/org/apache/beam/beam-sdks-java-io-common/2.2.0-SNAPSHOT/beam-sdks-java-io-common-2.2.0-20170807.071515-22.pom
[INFO] Downloaded: http://repository.apache.org/snapshots/org/apache/beam/beam-sdks-java-io-common/2.2.0-SNAPSHOT/beam-sdks-java-io-common-2.2.0-20170807.071515-22.pom
(1.4 kB at 8.8 kB/s)
[INFO] Downloading: http://repository.apache.org/snapshots/org/apache/beam/beam-sdks-java-io-common/2.2.0-SNAPSHOT/beam-sdks-java-io-common-2.2.0-20170807.071515-22-tests.jar
[INFO] Downloading: http://repository.apache.org/snapshots/org/apache/beam/beam-sdks-java-io-common/2.2.0-SNAPSHOT/beam-sdks-java-io-common-2.2.0-20170807.071515-22.jar
[INFO] Downloading: http://repository.apache.org/snapshots/org/apache/beam/beam-runners-direct-java/2.2.0-SNAPSHOT/beam-runners-direct-java-2.2.0-20170807.071408-24.jar
[INFO] Downloaded: http://repository.apache.org/snapshots/org/apache/beam/beam-sdks-java-io-common/2.2.0-SNAPSHOT/beam-sdks-java-io-common-2.2.0-20170807.071515-22-tests.jar
(17 kB at 83 kB/s)
[INFO] Downloaded: http://repository.apache.org/snapshots/org/apache/beam/beam-sdks-java-io-common/2.2.0-SNAPSHOT/beam-sdks-java-io-common-2.2.0-20170807.071515-22.jar
(2.7 MB at 5.5 MB/s)
[INFO] Downloaded: http://repository.apache.org/snapshots/org/apache/beam/beam-runners-direct-java/2.2.0-SNAPSHOT/beam-runners-direct-java-2.2.0-20170807.071408-24.jar
(12 MB at 15 MB/s)
[INFO] 
[INFO] --- maven-enforcer-plugin:3.0.0-M1:enforce (enforce) @ beam-sdks-java-io-jdbc ---
[INFO] 
[INFO] --- maven-enforcer-plugin:3.0.0-M1:enforce (enforce-banned-dependencies) @ beam-sdks-java-io-jdbc
---
[INFO] 
[INFO] --- groovy-maven-plugin:2.0:execute (find-supported-python-for-compile) @ beam-sdks-java-io-jdbc
---
[INFO] Using python interpreter binary 'python2.7' with pip 'pip2.7'
[INFO] 
[INFO] --- maven-remote-resources-plugin:1.5:process (process-resource-bundles) @ beam-sdks-java-io-jdbc
---
[INFO] 
[INFO] --- maven-resources-plugin:3.0.2:resources (default-resources) @ beam-sdks-java-io-jdbc
---
[INFO] Using 'UTF-8' encoding to copy filtered resources.
[INFO] skip non existing resourceDirectory <https://builds.apache.org/job/beam_PerformanceTests_JDBC/ws/sdks/java/io/jdbc/src/main/resources>
[INFO] Copying 3 resources
[INFO] 
[INFO] --- maven-compiler-plugin:3.6.2:compile (default-compile) @ beam-sdks-java-io-jdbc
---
[INFO] Changes detected - recompiling the module!
[INFO] Compiling 2 source files to <https://builds.apache.org/job/beam_PerformanceTests_JDBC/ws/sdks/java/io/jdbc/target/classes>
[WARNING] bootstrap class path not set in conjunction with -source 1.7
[INFO] 
[INFO] --- maven-resources-plugin:3.0.2:testResources (default-testResources) @ beam-sdks-java-io-jdbc
---
[INFO] Using 'UTF-8' encoding to copy filtered resources.
[INFO] skip non existing resourceDirectory <https://builds.apache.org/job/beam_PerformanceTests_JDBC/ws/sdks/java/io/jdbc/src/test/resources>
[INFO] Copying 3 resources
[INFO] 
[INFO] --- maven-compiler-plugin:3.6.2:testCompile (default-testCompile) @ beam-sdks-java-io-jdbc
---
[INFO] Changes detected - recompiling the module!
[INFO] Compiling 3 source files to <https://builds.apache.org/job/beam_PerformanceTests_JDBC/ws/sdks/java/io/jdbc/target/test-classes>
[INFO] 
[INFO] --- maven-checkstyle-plugin:2.17:check (default) @ beam-sdks-java-io-jdbc ---
[INFO] Starting audit...
Audit done.
[INFO] 
[INFO] --- maven-surefire-plugin:2.20:test (default-test) @ beam-sdks-java-io-jdbc ---
[INFO] Tests are skipped.
[INFO] 
[INFO] --- build-helper-maven-plugin:3.0.0:regex-properties (render-artifact-id) @ beam-sdks-java-io-jdbc
---
[INFO] 
[INFO] --- maven-jar-plugin:3.0.2:jar (default-jar) @ beam-sdks-java-io-jdbc ---
[INFO] Building jar: <https://builds.apache.org/job/beam_PerformanceTests_JDBC/ws/sdks/java/io/jdbc/target/beam-sdks-java-io-jdbc-2.2.0-SNAPSHOT.jar>
[INFO] 
[INFO] --- maven-site-plugin:3.5.1:attach-descriptor (attach-descriptor) @ beam-sdks-java-io-jdbc
---
[INFO] 
[INFO] --- maven-jar-plugin:3.0.2:test-jar (default-test-jar) @ beam-sdks-java-io-jdbc ---
[INFO] Building jar: <https://builds.apache.org/job/beam_PerformanceTests_JDBC/ws/sdks/java/io/jdbc/target/beam-sdks-java-io-jdbc-2.2.0-SNAPSHOT-tests.jar>
[INFO] 
[INFO] --- maven-shade-plugin:3.0.0:shade (bundle-and-repackage) @ beam-sdks-java-io-jdbc
---
[INFO] Excluding org.apache.beam:beam-sdks-java-core:jar:2.2.0-SNAPSHOT from the shaded jar.
[INFO] Excluding com.fasterxml.jackson.core:jackson-core:jar:2.8.9 from the shaded jar.
[INFO] Excluding com.fasterxml.jackson.core:jackson-annotations:jar:2.8.9 from the shaded
jar.
[INFO] Excluding com.fasterxml.jackson.core:jackson-databind:jar:2.8.9 from the shaded jar.
[INFO] Excluding org.apache.avro:avro:jar:1.8.2 from the shaded jar.
[INFO] Excluding org.codehaus.jackson:jackson-core-asl:jar:1.9.13 from the shaded jar.
[INFO] Excluding org.codehaus.jackson:jackson-mapper-asl:jar:1.9.13 from the shaded jar.
[INFO] Excluding com.thoughtworks.paranamer:paranamer:jar:2.7 from the shaded jar.
[INFO] Excluding org.apache.commons:commons-compress:jar:1.14 from the shaded jar.
[INFO] Excluding org.tukaani:xz:jar:1.5 from the shaded jar.
[INFO] Excluding org.xerial.snappy:snappy-java:jar:1.1.4-M3 from the shaded jar.
[INFO] Excluding joda-time:joda-time:jar:2.4 from the shaded jar.
[INFO] Including com.google.guava:guava:jar:20.0 in the shaded jar.
[INFO] Excluding com.google.code.findbugs:jsr305:jar:3.0.1 from the shaded jar.
[INFO] Excluding org.apache.commons:commons-dbcp2:jar:2.1.1 from the shaded jar.
[INFO] Excluding org.apache.commons:commons-pool2:jar:2.4.2 from the shaded jar.
[INFO] Excluding commons-logging:commons-logging:jar:1.2 from the shaded jar.
[INFO] Replacing original artifact with shaded artifact.
[INFO] Replacing <https://builds.apache.org/job/beam_PerformanceTests_JDBC/ws/sdks/java/io/jdbc/target/beam-sdks-java-io-jdbc-2.2.0-SNAPSHOT.jar>
with <https://builds.apache.org/job/beam_PerformanceTests_JDBC/ws/sdks/java/io/jdbc/target/beam-sdks-java-io-jdbc-2.2.0-SNAPSHOT-shaded.jar>
[INFO] Replacing original test artifact with shaded test artifact.
[INFO] Replacing <https://builds.apache.org/job/beam_PerformanceTests_JDBC/ws/sdks/java/io/jdbc/target/beam-sdks-java-io-jdbc-2.2.0-SNAPSHOT-tests.jar>
with <https://builds.apache.org/job/beam_PerformanceTests_JDBC/ws/sdks/java/io/jdbc/target/beam-sdks-java-io-jdbc-2.2.0-SNAPSHOT-shaded-tests.jar>
[INFO] Dependency-reduced POM written at: <https://builds.apache.org/job/beam_PerformanceTests_JDBC/ws/sdks/java/io/jdbc/dependency-reduced-pom.xml>
[INFO] 
[INFO] --- maven-dependency-plugin:3.0.1:analyze-only (default) @ beam-sdks-java-io-jdbc ---
[INFO] No dependency problems found
[INFO] 
[INFO] --- exec-maven-plugin:1.6.0:exec (default) @ beam-sdks-java-io-jdbc ---
WARNING:root:File resource loader root perfkitbenchmarker/data/ycsb is not a directory.
2017-08-07 12:06:59,041 ea75283b MainThread INFO     Verbose logging to: /tmp/perfkitbenchmarker/runs/ea75283b/pkb.log
2017-08-07 12:06:59,041 ea75283b MainThread INFO     PerfKitBenchmarker version: v1.12.0-94-g8c7b5a4
2017-08-07 12:06:59,042 ea75283b MainThread INFO     Flag values:
--beam_it_class=org.apache.beam.sdk.io.jdbc.JdbcIOIT
--beam_sdk=java
--beam_it_options=[ "--project=apache-beam-testing", "--tempRoot=gs://temp-storage-for-end-to-end-tests"
]
--beam_prebuilt
--kubeconfig=/home/jenkins/.kube/config
--kubectl=kubectl
--beam_kubernetes_scripts=<https://builds.apache.org/job/beam_PerformanceTests_JDBC/ws/.test-infra/kubernetes/postgres/postgres.yml>
--beam_it_module=sdks/java/io/jdbc
--beam_options_config_file=<https://builds.apache.org/job/beam_PerformanceTests_JDBC/ws/.test-infra/kubernetes/postgres/pkb-config.yml>
--beam_location=<https://builds.apache.org/job/beam_PerformanceTests_JDBC/ws/>
--beam_it_profile=io-it
--benchmarks=beam_integration_benchmark
2017-08-07 12:06:59,329 ea75283b MainThread WARNING  The key "flags" was not in the default
config, but was in user overrides. This may indicate a typo.
2017-08-07 12:06:59,437 ea75283b MainThread beam_integration_benchmark(1/1) INFO     Provisioning
resources for benchmark beam_integration_benchmark
2017-08-07 12:06:59,440 ea75283b MainThread beam_integration_benchmark(1/1) INFO     Preparing
benchmark beam_integration_benchmark
2017-08-07 12:06:59,440 ea75283b MainThread beam_integration_benchmark(1/1) INFO     Running:
kubectl --kubeconfig=/home/jenkins/.kube/config create -f <https://builds.apache.org/job/beam_PerformanceTests_JDBC/ws/.test-infra/kubernetes/postgres/postgres.yml>
2017-08-07 12:06:59,452 ea75283b MainThread beam_integration_benchmark(1/1) ERROR    Error
during benchmark beam_integration_benchmark
Traceback (most recent call last):
  File "<https://builds.apache.org/job/beam_PerformanceTests_JDBC/ws/PerfKitBenchmarker/perfkitbenchmarker/pkb.py",>
line 555, in RunBenchmark
    DoPreparePhase(spec, detailed_timer)
  File "<https://builds.apache.org/job/beam_PerformanceTests_JDBC/ws/PerfKitBenchmarker/perfkitbenchmarker/pkb.py",>
line 450, in DoPreparePhase
    spec.BenchmarkPrepare(spec)
  File "<https://builds.apache.org/job/beam_PerformanceTests_JDBC/ws/PerfKitBenchmarker/perfkitbenchmarker/linux_benchmarks/beam_integration_benchmark.py",>
line 109, in Prepare
    kubernetes_helper.CreateAllFiles(getKubernetesScripts())
  File "<https://builds.apache.org/job/beam_PerformanceTests_JDBC/ws/PerfKitBenchmarker/perfkitbenchmarker/kubernetes_helper.py",>
line 54, in CreateAllFiles
    CreateFromFile(file)
  File "<https://builds.apache.org/job/beam_PerformanceTests_JDBC/ws/PerfKitBenchmarker/perfkitbenchmarker/kubernetes_helper.py",>
line 37, in CreateFromFile
    return vm_util.IssueCommand(create_cmd)
  File "<https://builds.apache.org/job/beam_PerformanceTests_JDBC/ws/PerfKitBenchmarker/perfkitbenchmarker/vm_util.py",>
line 294, in IssueCommand
    stderr=tf_err, cwd=cwd)
  File "/usr/lib/python2.7/subprocess.py", line 710, in __init__
    errread, errwrite)
  File "/usr/lib/python2.7/subprocess.py", line 1327, in _execute_child
    raise child_exception
OSError: [Errno 2] No such file or directory
2017-08-07 12:06:59,453 ea75283b MainThread beam_integration_benchmark(1/1) INFO     Cleaning
up benchmark beam_integration_benchmark
2017-08-07 12:06:59,454 ea75283b MainThread beam_integration_benchmark(1/1) INFO     Running:
kubectl --kubeconfig=/home/jenkins/.kube/config delete -f <https://builds.apache.org/job/beam_PerformanceTests_JDBC/ws/.test-infra/kubernetes/postgres/postgres.yml>
2017-08-07 12:06:59,459 ea75283b MainThread beam_integration_benchmark(1/1) ERROR    Benchmark
1/1 beam_integration_benchmark (UID: beam_integration_benchmark0) failed. Execution will continue.
2017-08-07 12:06:59,469 ea75283b MainThread INFO     Benchmark run statuses:
---------------------------------------------------------------
Name                        UID                          Status
---------------------------------------------------------------
beam_integration_benchmark  beam_integration_benchmark0  FAILED
---------------------------------------------------------------
Success rate: 0.00% (0/1)
2017-08-07 12:06:59,470 ea75283b MainThread INFO     Complete logs can be found at: /tmp/perfkitbenchmarker/runs/ea75283b/pkb.log
2017-08-07 12:06:59,470 ea75283b MainThread INFO     Completion statuses can be found at:
/tmp/perfkitbenchmarker/runs/ea75283b/completion_statuses.json
[ERROR] Command execution failed.
org.apache.commons.exec.ExecuteException: Process exited with an error: 1 (Exit value: 1)
	at org.apache.commons.exec.DefaultExecutor.executeInternal(DefaultExecutor.java:404)
	at org.apache.commons.exec.DefaultExecutor.execute(DefaultExecutor.java:166)
	at org.codehaus.mojo.exec.ExecMojo.executeCommandLine(ExecMojo.java:804)
	at org.codehaus.mojo.exec.ExecMojo.executeCommandLine(ExecMojo.java:751)
	at org.codehaus.mojo.exec.ExecMojo.execute(ExecMojo.java:313)
	at org.apache.maven.plugin.DefaultBuildPluginManager.executeMojo(DefaultBuildPluginManager.java:134)
	at org.apache.maven.lifecycle.internal.MojoExecutor.execute(MojoExecutor.java:208)
	at org.apache.maven.lifecycle.internal.MojoExecutor.execute(MojoExecutor.java:154)
	at org.apache.maven.lifecycle.internal.MojoExecutor.execute(MojoExecutor.java:146)
	at org.apache.maven.lifecycle.internal.LifecycleModuleBuilder.buildProject(LifecycleModuleBuilder.java:117)
	at org.apache.maven.lifecycle.internal.LifecycleModuleBuilder.buildProject(LifecycleModuleBuilder.java:81)
	at org.apache.maven.lifecycle.internal.builder.singlethreaded.SingleThreadedBuilder.build(SingleThreadedBuilder.java:51)
	at org.apache.maven.lifecycle.internal.LifecycleStarter.execute(LifecycleStarter.java:128)
	at org.apache.maven.DefaultMaven.doExecute(DefaultMaven.java:309)
	at org.apache.maven.DefaultMaven.doExecute(DefaultMaven.java:194)
	at org.apache.maven.DefaultMaven.execute(DefaultMaven.java:107)
	at org.apache.maven.cli.MavenCli.execute(MavenCli.java:993)
	at org.apache.maven.cli.MavenCli.doMain(MavenCli.java:345)
	at org.apache.maven.cli.MavenCli.main(MavenCli.java:191)
	at sun.reflect.NativeMethodAccessorImpl.invoke0(Native Method)
	at sun.reflect.NativeMethodAccessorImpl.invoke(NativeMethodAccessorImpl.java:62)
	at sun.reflect.DelegatingMethodAccessorImpl.invoke(DelegatingMethodAccessorImpl.java:43)
	at java.lang.reflect.Method.invoke(Method.java:498)
	at org.codehaus.plexus.classworlds.launcher.Launcher.launchEnhanced(Launcher.java:289)
	at org.codehaus.plexus.classworlds.launcher.Launcher.launch(Launcher.java:229)
	at org.codehaus.plexus.classworlds.launcher.Launcher.mainWithExitCode(Launcher.java:415)
	at org.codehaus.plexus.classworlds.launcher.Launcher.main(Launcher.java:356)
[INFO] ------------------------------------------------------------------------
[INFO] BUILD FAILURE
[INFO] ------------------------------------------------------------------------
[INFO] Total time: 24.053 s
[INFO] Finished at: 2017-08-07T12:06:59Z
[INFO] Final Memory: 75M/878M
[INFO] ------------------------------------------------------------------------
[ERROR] Failed to execute goal org.codehaus.mojo:exec-maven-plugin:1.6.0:exec (default) on
project beam-sdks-java-io-jdbc: Command execution failed. Process exited with an error: 1
(Exit value: 1) -> [Help 1]
org.apache.maven.lifecycle.LifecycleExecutionException: Failed to execute goal org.codehaus.mojo:exec-maven-plugin:1.6.0:exec
(default) on project beam-sdks-java-io-jdbc: Command execution failed.
	at org.apache.maven.lifecycle.internal.MojoExecutor.execute(MojoExecutor.java:213)
	at org.apache.maven.lifecycle.internal.MojoExecutor.execute(MojoExecutor.java:154)
	at org.apache.maven.lifecycle.internal.MojoExecutor.execute(MojoExecutor.java:146)
	at org.apache.maven.lifecycle.internal.LifecycleModuleBuilder.buildProject(LifecycleModuleBuilder.java:117)
	at org.apache.maven.lifecycle.internal.LifecycleModuleBuilder.buildProject(LifecycleModuleBuilder.java:81)
	at org.apache.maven.lifecycle.internal.builder.singlethreaded.SingleThreadedBuilder.build(SingleThreadedBuilder.java:51)
	at org.apache.maven.lifecycle.internal.LifecycleStarter.execute(LifecycleStarter.java:128)
	at org.apache.maven.DefaultMaven.doExecute(DefaultMaven.java:309)
	at org.apache.maven.DefaultMaven.doExecute(DefaultMaven.java:194)
	at org.apache.maven.DefaultMaven.execute(DefaultMaven.java:107)
	at org.apache.maven.cli.MavenCli.execute(MavenCli.java:993)
	at org.apache.maven.cli.MavenCli.doMain(MavenCli.java:345)
	at org.apache.maven.cli.MavenCli.main(MavenCli.java:191)
	at sun.reflect.NativeMethodAccessorImpl.invoke0(Native Method)
	at sun.reflect.NativeMethodAccessorImpl.invoke(NativeMethodAccessorImpl.java:62)
	at sun.reflect.DelegatingMethodAccessorImpl.invoke(DelegatingMethodAccessorImpl.java:43)
	at java.lang.reflect.Method.invoke(Method.java:498)
	at org.codehaus.plexus.classworlds.launcher.Launcher.launchEnhanced(Launcher.java:289)
	at org.codehaus.plexus.classworlds.launcher.Launcher.launch(Launcher.java:229)
	at org.codehaus.plexus.classworlds.launcher.Launcher.mainWithExitCode(Launcher.java:415)
	at org.codehaus.plexus.classworlds.launcher.Launcher.main(Launcher.java:356)
Caused by: org.apache.maven.plugin.MojoExecutionException: Command execution failed.
	at org.codehaus.mojo.exec.ExecMojo.execute(ExecMojo.java:326)
	at org.apache.maven.plugin.DefaultBuildPluginManager.executeMojo(DefaultBuildPluginManager.java:134)
	at org.apache.maven.lifecycle.internal.MojoExecutor.execute(MojoExecutor.java:208)
	... 20 more
Caused by: org.apache.commons.exec.ExecuteException: Process exited with an error: 1 (Exit
value: 1)
	at org.apache.commons.exec.DefaultExecutor.executeInternal(DefaultExecutor.java:404)
	at org.apache.commons.exec.DefaultExecutor.execute(DefaultExecutor.java:166)
	at org.codehaus.mojo.exec.ExecMojo.executeCommandLine(ExecMojo.java:804)
	at org.codehaus.mojo.exec.ExecMojo.executeCommandLine(ExecMojo.java:751)
	at org.codehaus.mojo.exec.ExecMojo.execute(ExecMojo.java:313)
	... 22 more
[ERROR] 
[ERROR] Re-run Maven using the -X switch to enable full debug logging.
[ERROR] 
[ERROR] For more information about the errors and possible solutions, please read the following
articles:
[ERROR] [Help 1] http://cwiki.apache.org/confluence/display/MAVEN/MojoExecutionException
Build step 'Execute shell' marked build as failure

Mime
View raw message