beam-commits mailing list archives

Site index · List index
Message view « Date » · « Thread »
Top « Date » · « Thread »
From Apache Jenkins Server <jenk...@builds.apache.org>
Subject Build failed in Jenkins: beam_PostCommit_Java_MavenInstall #4610
Date Mon, 21 Aug 2017 13:25:02 GMT
See <https://builds.apache.org/job/beam_PostCommit_Java_MavenInstall/4610/display/redirect>

------------------------------------------
[...truncated 3.67 MB...]
2017-08-21T13:23:02.494 [INFO] Downloaded: https://repo.maven.apache.org/maven2/org/sonatype/sisu/sisu-guice/2.9.2/sisu-guice-2.9.2.pom
(8 KB at 265.8 KB/sec)
2017-08-21T13:23:02.496 [INFO] Downloading: https://repo.maven.apache.org/maven2/org/sonatype/sisu/inject/guice-parent/2.9.2/guice-parent-2.9.2.pom
2017-08-21T13:23:02.551 [INFO] Downloaded: https://repo.maven.apache.org/maven2/org/sonatype/sisu/inject/guice-parent/2.9.2/guice-parent-2.9.2.pom
(12 KB at 217.4 KB/sec)
2017-08-21T13:23:02.554 [INFO] Downloading: https://repo.maven.apache.org/maven2/org/slf4j/jcl-over-slf4j/1.7.21/jcl-over-slf4j-1.7.21.pom
2017-08-21T13:23:02.581 [INFO] Downloaded: https://repo.maven.apache.org/maven2/org/slf4j/jcl-over-slf4j/1.7.21/jcl-over-slf4j-1.7.21.pom
(963 B at 34.8 KB/sec)
2017-08-21T13:23:02.586 [INFO] Downloading: https://repo.maven.apache.org/maven2/org/apache/httpcomponents/httpmime/4.5.2/httpmime-4.5.2.jar
2017-08-21T13:23:02.586 [INFO] Downloading: https://repo.maven.apache.org/maven2/com/fasterxml/jackson/core/jackson-core/2.8.3/jackson-core-2.8.3.jar
2017-08-21T13:23:02.587 [INFO] Downloading: https://repo.maven.apache.org/maven2/com/fasterxml/jackson/core/jackson-annotations/2.8.3/jackson-annotations-2.8.3.jar
2017-08-21T13:23:02.587 [INFO] Downloading: https://repo.maven.apache.org/maven2/com/fasterxml/jackson/core/jackson-databind/2.8.3/jackson-databind-2.8.3.jar
2017-08-21T13:23:02.588 [INFO] Downloading: https://repo.maven.apache.org/maven2/org/eclipse/jgit/org.eclipse.jgit/4.5.0.201609210915-r/org.eclipse.jgit-4.5.0.201609210915-r.jar
2017-08-21T13:23:02.623 [INFO] Downloaded: https://repo.maven.apache.org/maven2/org/apache/httpcomponents/httpmime/4.5.2/httpmime-4.5.2.jar
(41 KB at 1082.9 KB/sec)
2017-08-21T13:23:02.623 [INFO] Downloading: https://repo.maven.apache.org/maven2/com/jcraft/jsch/0.1.53/jsch-0.1.53.jar
2017-08-21T13:23:02.625 [INFO] Downloaded: https://repo.maven.apache.org/maven2/com/fasterxml/jackson/core/jackson-annotations/2.8.3/jackson-annotations-2.8.3.jar
(55 KB at 1393.5 KB/sec)
2017-08-21T13:23:02.625 [INFO] Downloading: https://repo.maven.apache.org/maven2/com/googlecode/javaewah/JavaEWAH/0.7.9/JavaEWAH-0.7.9.jar
2017-08-21T13:23:02.644 [INFO] Downloaded: https://repo.maven.apache.org/maven2/com/fasterxml/jackson/core/jackson-core/2.8.3/jackson-core-2.8.3.jar
(275 KB at 4732.6 KB/sec)
2017-08-21T13:23:02.644 [INFO] Downloading: https://repo.maven.apache.org/maven2/org/codehaus/plexus/plexus-utils/2.0.7/plexus-utils-2.0.7.jar
2017-08-21T13:23:02.667 [INFO] Downloaded: https://repo.maven.apache.org/maven2/com/googlecode/javaewah/JavaEWAH/0.7.9/JavaEWAH-0.7.9.jar
(123 KB at 1527.7 KB/sec)
2017-08-21T13:23:02.668 [INFO] Downloading: https://repo.maven.apache.org/maven2/org/sonatype/sisu/sisu-inject-plexus/1.4.3.2/sisu-inject-plexus-1.4.3.2.jar
2017-08-21T13:23:02.690 [INFO] Downloaded: https://repo.maven.apache.org/maven2/com/jcraft/jsch/0.1.53/jsch-0.1.53.jar
(274 KB at 2656.7 KB/sec)
2017-08-21T13:23:02.690 [INFO] Downloading: https://repo.maven.apache.org/maven2/org/sonatype/sisu/sisu-inject-bean/1.4.3.2/sisu-inject-bean-1.4.3.2.jar
2017-08-21T13:23:02.702 [INFO] Downloaded: https://repo.maven.apache.org/maven2/org/codehaus/plexus/plexus-utils/2.0.7/plexus-utils-2.0.7.jar
(219 KB at 1901.7 KB/sec)
2017-08-21T13:23:02.702 [INFO] Downloading: https://repo.maven.apache.org/maven2/org/sonatype/sisu/sisu-guice/2.9.2/sisu-guice-2.9.2-no_aop.jar
2017-08-21T13:23:02.721 [INFO] Downloaded: https://repo.maven.apache.org/maven2/org/sonatype/sisu/sisu-inject-plexus/1.4.3.2/sisu-inject-plexus-1.4.3.2.jar
(201 KB at 1493.1 KB/sec)
2017-08-21T13:23:02.721 [INFO] Downloading: https://repo.maven.apache.org/maven2/org/slf4j/slf4j-api/1.7.21/slf4j-api-1.7.21.jar
2017-08-21T13:23:02.741 [INFO] Downloaded: https://repo.maven.apache.org/maven2/org/sonatype/sisu/sisu-inject-bean/1.4.3.2/sisu-inject-bean-1.4.3.2.jar
(157 KB at 1017.3 KB/sec)
2017-08-21T13:23:02.741 [INFO] Downloading: https://repo.maven.apache.org/maven2/org/slf4j/jcl-over-slf4j/1.7.21/jcl-over-slf4j-1.7.21.jar
2017-08-21T13:23:02.753 [INFO] Downloaded: https://repo.maven.apache.org/maven2/org/slf4j/slf4j-api/1.7.21/slf4j-api-1.7.21.jar
(41 KB at 241.6 KB/sec)
2017-08-21T13:23:02.754 [INFO] Downloaded: https://repo.maven.apache.org/maven2/com/fasterxml/jackson/core/jackson-databind/2.8.3/jackson-databind-2.8.3.jar
(1205 KB at 7171.4 KB/sec)
2017-08-21T13:23:02.770 [INFO] Downloaded: https://repo.maven.apache.org/maven2/org/slf4j/jcl-over-slf4j/1.7.21/jcl-over-slf4j-1.7.21.jar
(17 KB at 87.7 KB/sec)
2017-08-21T13:23:02.789 [INFO] Downloaded: https://repo.maven.apache.org/maven2/org/sonatype/sisu/sisu-guice/2.9.2/sisu-guice-2.9.2-no_aop.jar
(469 KB at 2319.7 KB/sec)
2017-08-21T13:23:02.843 [INFO] Downloaded: https://repo.maven.apache.org/maven2/org/eclipse/jgit/org.eclipse.jgit/4.5.0.201609210915-r/org.eclipse.jgit-4.5.0.201609210915-r.jar
(2324 KB at 9040.3 KB/sec)
2017-08-21T13:23:04.124 [INFO] Starting Coveralls job for jenkins (4610 / https://builds.apache.org/job/beam_PostCommit_Java_MavenInstall/4610/)
2017-08-21T13:23:04.124 [INFO] Using repository token <secret>
2017-08-21T13:23:04.124 [INFO] Git commit d338b44 in master
2017-08-21T13:23:04.124 [INFO] Writing Coveralls data to <https://builds.apache.org/job/beam_PostCommit_Java_MavenInstall/ws/target/coveralls.json...>
2017-08-21T13:23:04.171 [INFO] Processing coverage report from <https://builds.apache.org/job/beam_PostCommit_Java_MavenInstall/ws/sdks/java/core/target/site/jacoco/jacoco.xml>
2017-08-21T13:23:04.537 [INFO] Processing coverage report from <https://builds.apache.org/job/beam_PostCommit_Java_MavenInstall/ws/sdks/java/extensions/google-cloud-platform-core/target/site/jacoco/jacoco.xml>
2017-08-21T13:23:04.587 [INFO] Processing coverage report from <https://builds.apache.org/job/beam_PostCommit_Java_MavenInstall/ws/sdks/java/extensions/protobuf/target/site/jacoco/jacoco.xml>
2017-08-21T13:23:04.609 [INFO] Processing coverage report from <https://builds.apache.org/job/beam_PostCommit_Java_MavenInstall/ws/sdks/java/java8tests/target/site/jacoco/jacoco.xml>
2017-08-21T13:23:04.610 [INFO] Processing coverage report from <https://builds.apache.org/job/beam_PostCommit_Java_MavenInstall/ws/runners/core-java/target/site/jacoco/jacoco.xml>
2017-08-21T13:23:04.814 [INFO] Processing coverage report from <https://builds.apache.org/job/beam_PostCommit_Java_MavenInstall/ws/runners/direct-java/target/site/jacoco/jacoco.xml>
2017-08-21T13:23:04.993 [INFO] Processing coverage report from <https://builds.apache.org/job/beam_PostCommit_Java_MavenInstall/ws/runners/google-cloud-dataflow-java/target/site/jacoco/jacoco.xml>
2017-08-21T13:23:05.115 [INFO] Processing coverage report from <https://builds.apache.org/job/beam_PostCommit_Java_MavenInstall/ws/examples/java/target/site/jacoco/jacoco.xml>
2017-08-21T13:23:05.161 [INFO] Processing coverage report from <https://builds.apache.org/job/beam_PostCommit_Java_MavenInstall/ws/examples/java8/target/site/jacoco/jacoco.xml>
2017-08-21T13:23:05.208 [INFO] Successfully wrote Coveralls data in 1084ms
2017-08-21T13:23:05.208 [INFO] Gathered code coverage metrics for 526 source files with 119418
lines of code:
2017-08-21T13:23:05.208 [INFO] - 30317 relevant lines
2017-08-21T13:23:05.208 [INFO] - 21214 covered lines
2017-08-21T13:23:05.208 [INFO] - 9103 missed lines
2017-08-21T13:23:05.208 [INFO] Submitting Coveralls data to API
2017-08-21T13:24:05.418 [ERROR] Submission failed in 60210ms while handling I/O operations
[JENKINS] Archiving disabled
[JENKINS] Archiving disabled
[JENKINS] Archiving disabled
[JENKINS] Archiving disabled
[JENKINS] Archiving disabled
[JENKINS] Archiving disabled
[JENKINS] Archiving disabled
[JENKINS] Archiving disabled
[JENKINS] Archiving disabled
[JENKINS] Archiving disabled
[JENKINS] Archiving disabled
[JENKINS] Archiving disabled
[JENKINS] Archiving disabled
[JENKINS] Archiving disabled
[JENKINS] Archiving disabled
[JENKINS] Archiving disabled
[JENKINS] Archiving disabled
[JENKINS] Archiving disabled
[JENKINS] Archiving disabled
[JENKINS] Archiving disabled
[JENKINS] Archiving disabled
[JENKINS] Archiving disabled
[JENKINS] Archiving disabled
[JENKINS] Archiving disabled
[JENKINS] Archiving disabled
[JENKINS] Archiving disabled
[JENKINS] Archiving disabled
[JENKINS] Archiving disabled
[JENKINS] Archiving disabled
[JENKINS] Archiving disabled
[JENKINS] Archiving disabled
[JENKINS] Archiving disabled
[JENKINS] Archiving disabled
[JENKINS] Archiving disabled
[JENKINS] Archiving disabled
[JENKINS] Archiving disabled
[JENKINS] Archiving disabled
[JENKINS] Archiving disabled
[JENKINS] Archiving disabled
[JENKINS] Archiving disabled
[JENKINS] Archiving disabled
[JENKINS] Archiving disabled
[JENKINS] Archiving disabled
[JENKINS] Archiving disabled
[JENKINS] Archiving disabled
[JENKINS] Archiving disabled
[JENKINS] Archiving disabled
[JENKINS] Archiving disabled
[JENKINS] Archiving disabled
[JENKINS] Archiving disabled
[JENKINS] Archiving disabled
[JENKINS] Archiving disabled
[JENKINS] Archiving disabled
[JENKINS] Archiving disabled
[JENKINS] Archiving disabled
[JENKINS] Archiving disabled
2017-08-21T13:24:55.072 [INFO] ------------------------------------------------------------------------
2017-08-21T13:24:55.073 [INFO] Reactor Summary:
2017-08-21T13:24:55.073 [INFO] 
2017-08-21T13:24:55.073 [INFO] Apache Beam :: Parent .............................. FAILURE
[01:03 min]
2017-08-21T13:24:55.073 [INFO] Apache Beam :: SDKs :: Java :: Build Tools ......... SUCCESS
[ 15.086 s]
2017-08-21T13:24:55.073 [INFO] Apache Beam :: SDKs ................................ SUCCESS
[  6.245 s]
2017-08-21T13:24:55.073 [INFO] Apache Beam :: SDKs :: Common ...................... SUCCESS
[  2.784 s]
2017-08-21T13:24:55.073 [INFO] Apache Beam :: SDKs :: Common :: Runner API ........ SUCCESS
[ 29.914 s]
2017-08-21T13:24:55.073 [INFO] Apache Beam :: SDKs :: Common :: Fn API ............ SUCCESS
[ 17.414 s]
2017-08-21T13:24:55.073 [INFO] Apache Beam :: SDKs :: Java ........................ SUCCESS
[  2.786 s]
2017-08-21T13:24:55.073 [INFO] Apache Beam :: SDKs :: Java :: Core ................ SUCCESS
[02:45 min]
2017-08-21T13:24:55.073 [INFO] Apache Beam :: Runners ............................. SUCCESS
[  3.066 s]
2017-08-21T13:24:55.073 [INFO] Apache Beam :: Runners :: Core Construction Java ... SUCCESS
[ 40.886 s]
2017-08-21T13:24:55.073 [INFO] Apache Beam :: Runners :: Core Java ................ SUCCESS
[ 49.298 s]
2017-08-21T13:24:55.073 [INFO] Apache Beam :: Runners :: Direct Java .............. SUCCESS
[04:29 min]
2017-08-21T13:24:55.073 [INFO] Apache Beam :: SDKs :: Java :: IO .................. SUCCESS
[  2.953 s]
2017-08-21T13:24:55.073 [INFO] Apache Beam :: SDKs :: Java :: IO :: AMQP .......... SUCCESS
[ 38.298 s]
2017-08-21T13:24:55.073 [INFO] Apache Beam :: SDKs :: Java :: IO :: Common ........ SUCCESS
[  6.345 s]
2017-08-21T13:24:55.073 [INFO] Apache Beam :: SDKs :: Java :: IO :: Cassandra ..... SUCCESS
[ 29.976 s]
2017-08-21T13:24:55.073 [INFO] Apache Beam :: SDKs :: Java :: IO :: Elasticsearch . SUCCESS
[ 40.544 s]
2017-08-21T13:24:55.073 [INFO] Apache Beam :: SDKs :: Java :: Extensions .......... SUCCESS
[  2.988 s]
2017-08-21T13:24:55.073 [INFO] Apache Beam :: SDKs :: Java :: Extensions :: Google Cloud Platform
Core SUCCESS [ 30.241 s]
2017-08-21T13:24:55.073 [INFO] Apache Beam :: SDKs :: Java :: Extensions :: Protobuf SUCCESS
[ 21.322 s]
2017-08-21T13:24:55.073 [INFO] Apache Beam :: SDKs :: Java :: IO :: Google Cloud Platform
SUCCESS [01:32 min]
2017-08-21T13:24:55.073 [INFO] Apache Beam :: SDKs :: Java :: IO :: Hadoop Common . SUCCESS
[ 23.644 s]
2017-08-21T13:24:55.073 [INFO] Apache Beam :: SDKs :: Java :: IO :: Hadoop File System SUCCESS
[ 42.938 s]
2017-08-21T13:24:55.073 [INFO] Apache Beam :: SDKs :: Java :: IO :: Hadoop ........ SUCCESS
[  5.219 s]
2017-08-21T13:24:55.073 [INFO] Apache Beam :: SDKs :: Java :: IO :: Hadoop :: input-format
SUCCESS [ 24.778 s]
2017-08-21T13:24:55.073 [INFO] Apache Beam :: Runners :: Google Cloud Dataflow .... SUCCESS
[07:36 min]
2017-08-21T13:24:55.073 [INFO] Apache Beam :: SDKs :: Java :: IO :: Hadoop :: jdk1.8-tests
SUCCESS [01:31 min]
2017-08-21T13:24:55.073 [INFO] Apache Beam :: SDKs :: Java :: IO :: HBase ......... SUCCESS
[01:05 min]
2017-08-21T13:24:55.073 [INFO] Apache Beam :: SDKs :: Java :: IO :: HCatalog ...... SUCCESS
[01:13 min]
2017-08-21T13:24:55.073 [INFO] Apache Beam :: SDKs :: Java :: IO :: JDBC .......... SUCCESS
[ 41.169 s]
2017-08-21T13:24:55.073 [INFO] Apache Beam :: SDKs :: Java :: IO :: JMS ........... SUCCESS
[ 24.593 s]
2017-08-21T13:24:55.073 [INFO] Apache Beam :: SDKs :: Java :: IO :: Kafka ......... SUCCESS
[ 40.838 s]
2017-08-21T13:24:55.073 [INFO] Apache Beam :: SDKs :: Java :: IO :: Kinesis ....... SUCCESS
[ 29.895 s]
2017-08-21T13:24:55.073 [INFO] Apache Beam :: SDKs :: Java :: IO :: MongoDB ....... SUCCESS
[ 41.646 s]
2017-08-21T13:24:55.073 [INFO] Apache Beam :: SDKs :: Java :: IO :: MQTT .......... SUCCESS
[ 28.039 s]
2017-08-21T13:24:55.073 [INFO] Apache Beam :: SDKs :: Java :: IO :: Solr .......... SUCCESS
[ 46.924 s]
2017-08-21T13:24:55.073 [INFO] Apache Beam :: SDKs :: Java :: IO :: XML ........... SUCCESS
[ 31.860 s]
2017-08-21T13:24:55.073 [INFO] Apache Beam :: SDKs :: Java :: Maven Archetypes .... SUCCESS
[  2.279 s]
2017-08-21T13:24:55.073 [INFO] Apache Beam :: SDKs :: Java :: Maven Archetypes :: Starter
SUCCESS [ 16.029 s]
2017-08-21T13:24:55.073 [INFO] Apache Beam :: Examples ............................ SUCCESS
[  2.772 s]
2017-08-21T13:24:55.073 [INFO] Apache Beam :: Examples :: Java .................... SUCCESS
[08:12 min]
2017-08-21T13:24:55.073 [INFO] Apache Beam :: SDKs :: Java :: Maven Archetypes :: Examples
SUCCESS [ 45.003 s]
2017-08-21T13:24:55.073 [INFO] Apache Beam :: Examples :: Java 8 .................. SUCCESS
[ 34.084 s]
2017-08-21T13:24:55.073 [INFO] Apache Beam :: SDKs :: Java :: Maven Archetypes :: Examples
- Java 8 SUCCESS [ 46.315 s]
2017-08-21T13:24:55.073 [INFO] Apache Beam :: SDKs :: Java :: Extensions :: Jackson SUCCESS
[ 23.481 s]
2017-08-21T13:24:55.073 [INFO] Apache Beam :: SDKs :: Java :: Extensions :: Join library SUCCESS
[ 24.540 s]
2017-08-21T13:24:55.073 [INFO] Apache Beam :: SDKs :: Java :: Extensions :: Sorter  SUCCESS
[ 48.398 s]
2017-08-21T13:24:55.074 [INFO] Apache Beam :: SDKs :: Java :: Harness ............. SUCCESS
[ 42.887 s]
2017-08-21T13:24:55.074 [INFO] Apache Beam :: SDKs :: Java :: Java 8 Tests ........ SUCCESS
[ 22.393 s]
2017-08-21T13:24:55.074 [INFO] Apache Beam :: SDKs :: Python ...................... SUCCESS
[28:54 min]
2017-08-21T13:24:55.074 [INFO] Apache Beam :: Runners :: Flink .................... SUCCESS
[ 50.832 s]
2017-08-21T13:24:55.074 [INFO] Apache Beam :: Runners :: Spark .................... SUCCESS
[02:22 min]
2017-08-21T13:24:55.074 [INFO] Apache Beam :: Runners :: Apex ..................... SUCCESS
[ 59.114 s]
2017-08-21T13:24:55.074 [INFO] Apache Beam :: Runners :: Gearpump ................. SUCCESS
[ 41.579 s]
2017-08-21T13:24:55.074 [INFO] Apache Beam :: SDKs :: Java :: Aggregated Javadoc .. SUCCESS
[ 25.978 s]
2017-08-21T13:24:55.074 [INFO] ------------------------------------------------------------------------
2017-08-21T13:24:55.074 [INFO] BUILD FAILURE
2017-08-21T13:24:55.074 [INFO] ------------------------------------------------------------------------
2017-08-21T13:24:55.074 [INFO] Total time: 01:23 h
2017-08-21T13:24:55.074 [INFO] Finished at: 2017-08-21T13:24:55+00:00
2017-08-21T13:24:55.843 [INFO] Final Memory: 325M/1367M
2017-08-21T13:24:55.843 [INFO] ------------------------------------------------------------------------
2017-08-21T13:24:55.850 [ERROR] Failed to execute goal org.eluder.coveralls:coveralls-maven-plugin:4.3.0:report
(default-cli) on project beam-parent: I/O operation failed: Read timed out -> [Help 1]
org.apache.maven.lifecycle.LifecycleExecutionException: Failed to execute goal org.eluder.coveralls:coveralls-maven-plugin:4.3.0:report
(default-cli) on project beam-parent: I/O operation failed
	at org.apache.maven.lifecycle.internal.MojoExecutor.execute(MojoExecutor.java:212)
	at org.apache.maven.lifecycle.internal.MojoExecutor.execute(MojoExecutor.java:153)
	at org.apache.maven.lifecycle.internal.MojoExecutor.execute(MojoExecutor.java:145)
	at org.apache.maven.lifecycle.internal.LifecycleModuleBuilder.buildProject(LifecycleModuleBuilder.java:116)
	at org.apache.maven.lifecycle.internal.LifecycleModuleBuilder.buildProject(LifecycleModuleBuilder.java:80)
	at org.apache.maven.lifecycle.internal.builder.singlethreaded.SingleThreadedBuilder.build(SingleThreadedBuilder.java:51)
	at org.apache.maven.lifecycle.internal.LifecycleStarter.execute(LifecycleStarter.java:128)
	at org.apache.maven.DefaultMaven.doExecute(DefaultMaven.java:307)
	at org.apache.maven.DefaultMaven.doExecute(DefaultMaven.java:193)
	at org.apache.maven.DefaultMaven.execute(DefaultMaven.java:106)
	at org.jvnet.hudson.maven3.launcher.Maven33Launcher.main(Maven33Launcher.java:129)
	at sun.reflect.NativeMethodAccessorImpl.invoke0(Native Method)
	at sun.reflect.NativeMethodAccessorImpl.invoke(NativeMethodAccessorImpl.java:62)
	at sun.reflect.DelegatingMethodAccessorImpl.invoke(DelegatingMethodAccessorImpl.java:43)
	at java.lang.reflect.Method.invoke(Method.java:498)
	at org.codehaus.plexus.classworlds.launcher.Launcher.launchStandard(Launcher.java:330)
	at org.codehaus.plexus.classworlds.launcher.Launcher.launch(Launcher.java:238)
	at jenkins.maven3.agent.Maven33Main.launch(Maven33Main.java:176)
	at sun.reflect.NativeMethodAccessorImpl.invoke0(Native Method)
	at sun.reflect.NativeMethodAccessorImpl.invoke(NativeMethodAccessorImpl.java:62)
	at sun.reflect.DelegatingMethodAccessorImpl.invoke(DelegatingMethodAccessorImpl.java:43)
	at java.lang.reflect.Method.invoke(Method.java:498)
	at hudson.maven.Maven3Builder.call(Maven3Builder.java:139)
	at hudson.maven.Maven3Builder.call(Maven3Builder.java:70)
	at hudson.remoting.UserRequest.perform(UserRequest.java:153)
	at hudson.remoting.UserRequest.perform(UserRequest.java:50)
	at hudson.remoting.Request$2.run(Request.java:336)
	at hudson.remoting.InterceptingExecutorService$1.call(InterceptingExecutorService.java:68)
	at java.util.concurrent.FutureTask.run(FutureTask.java:266)
	at java.util.concurrent.ThreadPoolExecutor.runWorker(ThreadPoolExecutor.java:1149)
	at java.util.concurrent.ThreadPoolExecutor$Worker.run(ThreadPoolExecutor.java:624)
	at java.lang.Thread.run(Thread.java:748)
Caused by: org.apache.maven.plugin.MojoFailureException: I/O operation failed
	at org.eluder.coveralls.maven.plugin.CoverallsReportMojo.execute(CoverallsReportMojo.java:259)
	at org.apache.maven.plugin.DefaultBuildPluginManager.executeMojo(DefaultBuildPluginManager.java:134)
	at org.apache.maven.lifecycle.internal.MojoExecutor.execute(MojoExecutor.java:208)
	... 31 more
Caused by: java.net.SocketTimeoutException: Read timed out
	at java.net.SocketInputStream.socketRead0(Native Method)
	at java.net.SocketInputStream.socketRead(SocketInputStream.java:116)
	at java.net.SocketInputStream.read(SocketInputStream.java:171)
	at java.net.SocketInputStream.read(SocketInputStream.java:141)
	at sun.security.ssl.InputRecord.readFully(InputRecord.java:465)
	at sun.security.ssl.InputRecord.read(InputRecord.java:503)
	at sun.security.ssl.SSLSocketImpl.readRecord(SSLSocketImpl.java:983)
	at sun.security.ssl.SSLSocketImpl.readDataRecord(SSLSocketImpl.java:940)
	at sun.security.ssl.AppInputStream.read(AppInputStream.java:105)
	at org.apache.http.impl.io.SessionInputBufferImpl.streamRead(SessionInputBufferImpl.java:139)
	at org.apache.http.impl.io.SessionInputBufferImpl.fillBuffer(SessionInputBufferImpl.java:155)
	at org.apache.http.impl.io.SessionInputBufferImpl.readLine(SessionInputBufferImpl.java:284)
	at org.apache.http.impl.conn.DefaultHttpResponseParser.parseHead(DefaultHttpResponseParser.java:140)
	at org.apache.http.impl.conn.DefaultHttpResponseParser.parseHead(DefaultHttpResponseParser.java:57)
	at org.apache.http.impl.io.AbstractMessageParser.parse(AbstractMessageParser.java:261)
	at org.apache.http.impl.DefaultBHttpClientConnection.receiveResponseHeader(DefaultBHttpClientConnection.java:165)
	at org.apache.http.impl.conn.CPoolProxy.receiveResponseHeader(CPoolProxy.java:167)
	at org.apache.http.protocol.HttpRequestExecutor.doReceiveResponse(HttpRequestExecutor.java:272)
	at org.apache.http.protocol.HttpRequestExecutor.execute(HttpRequestExecutor.java:124)
	at org.apache.http.impl.execchain.MainClientExec.execute(MainClientExec.java:271)
	at org.apache.http.impl.execchain.ProtocolExec.execute(ProtocolExec.java:184)
	at org.apache.http.impl.execchain.RetryExec.execute(RetryExec.java:88)
	at org.apache.http.impl.execchain.RedirectExec.execute(RedirectExec.java:110)
	at org.apache.http.impl.client.InternalHttpClient.doExecute(InternalHttpClient.java:184)
	at org.apache.http.impl.client.CloseableHttpClient.execute(CloseableHttpClient.java:82)
	at org.apache.http.impl.client.CloseableHttpClient.execute(CloseableHttpClient.java:107)
	at org.apache.http.impl.client.CloseableHttpClient.execute(CloseableHttpClient.java:55)
	at org.eluder.coveralls.maven.plugin.httpclient.CoverallsClient.submit(CoverallsClient.java:84)
	at org.eluder.coveralls.maven.plugin.CoverallsReportMojo.submitData(CoverallsReportMojo.java:400)
	at org.eluder.coveralls.maven.plugin.CoverallsReportMojo.execute(CoverallsReportMojo.java:254)
	... 33 more
2017-08-21T13:24:55.851 [ERROR] 
2017-08-21T13:24:55.851 [ERROR] Re-run Maven using the -X switch to enable full debug logging.
2017-08-21T13:24:55.851 [ERROR] 
2017-08-21T13:24:55.851 [ERROR] For more information about the errors and possible solutions,
please read the following articles:
2017-08-21T13:24:55.851 [ERROR] [Help 1] http://cwiki.apache.org/confluence/display/MAVEN/MojoFailureException
channel stopped

Mime
View raw message