beam-commits mailing list archives

Site index · List index
Message view « Date » · « Thread »
Top « Date » · « Thread »
From Apache Jenkins Server <jenk...@builds.apache.org>
Subject Build failed in Jenkins: beam_PostCommit_Java_MavenInstall #4546
Date Thu, 10 Aug 2017 00:28:11 GMT
See <https://builds.apache.org/job/beam_PostCommit_Java_MavenInstall/4546/display/redirect>

------------------------------------------
[...truncated 1.14 MB...]
2017-08-10T00:27:15.882 [INFO] Downloading: https://repo.maven.apache.org/maven2/org/apache/hbase/hbase-hadoop-compat/1.2.6/hbase-hadoop-compat-1.2.6.jar
2017-08-10T00:27:15.910 [INFO] Downloaded: https://repo.maven.apache.org/maven2/org/apache/hbase/hbase-hadoop-compat/1.2.6/hbase-hadoop-compat-1.2.6.jar
(37 KB at 68.0 KB/sec)
2017-08-10T00:27:15.910 [INFO] Downloading: https://repo.maven.apache.org/maven2/org/apache/hbase/hbase-hadoop2-compat/1.2.6/hbase-hadoop2-compat-1.2.6.jar
2017-08-10T00:27:15.922 [INFO] Downloaded: https://repo.maven.apache.org/maven2/commons-codec/commons-codec/1.9/commons-codec-1.9.jar
(258 KB at 474.7 KB/sec)
2017-08-10T00:27:15.922 [INFO] Downloading: https://repo.maven.apache.org/maven2/com/yammer/metrics/metrics-core/2.2.0/metrics-core-2.2.0.jar
2017-08-10T00:27:15.945 [INFO] Downloaded: https://repo.maven.apache.org/maven2/org/apache/hbase/hbase-hadoop2-compat/1.2.6/hbase-hadoop2-compat-1.2.6.jar
(99 KB at 173.8 KB/sec)
2017-08-10T00:27:15.945 [INFO] Downloading: https://repo.maven.apache.org/maven2/org/apache/commons/commons-math/2.2/commons-math-2.2.jar
2017-08-10T00:27:15.948 [INFO] Downloaded: https://repo.maven.apache.org/maven2/org/apache/hbase/hbase-server/1.2.6/hbase-server-1.2.6-tests.jar
(7413 KB at 12980.8 KB/sec)
2017-08-10T00:27:15.948 [INFO] Downloading: https://repo.maven.apache.org/maven2/org/mortbay/jetty/jetty-sslengine/6.1.26/jetty-sslengine-6.1.26.jar
2017-08-10T00:27:15.960 [INFO] Downloaded: https://repo.maven.apache.org/maven2/com/yammer/metrics/metrics-core/2.2.0/metrics-core-2.2.0.jar
(81 KB at 138.0 KB/sec)
2017-08-10T00:27:15.960 [INFO] Downloading: https://repo.maven.apache.org/maven2/tomcat/jasper-compiler/5.5.23/jasper-compiler-5.5.23.jar
2017-08-10T00:27:15.974 [INFO] Downloaded: https://repo.maven.apache.org/maven2/org/mortbay/jetty/jetty-sslengine/6.1.26/jetty-sslengine-6.1.26.jar
(19 KB at 31.0 KB/sec)
2017-08-10T00:27:15.974 [INFO] Downloading: https://repo.maven.apache.org/maven2/tomcat/jasper-runtime/5.5.23/jasper-runtime-5.5.23.jar
2017-08-10T00:27:16.010 [INFO] Downloaded: https://repo.maven.apache.org/maven2/tomcat/jasper-runtime/5.5.23/jasper-runtime-5.5.23.jar
(76 KB at 118.9 KB/sec)
2017-08-10T00:27:16.010 [INFO] Downloading: https://repo.maven.apache.org/maven2/org/jamon/jamon-runtime/2.4.1/jamon-runtime-2.4.1.jar
2017-08-10T00:27:16.018 [INFO] Downloaded: https://repo.maven.apache.org/maven2/tomcat/jasper-compiler/5.5.23/jasper-compiler-5.5.23.jar
(399 KB at 623.7 KB/sec)
2017-08-10T00:27:16.018 [INFO] Downloading: https://repo.maven.apache.org/maven2/com/lmax/disruptor/3.3.0/disruptor-3.3.0.jar
2017-08-10T00:27:16.037 [INFO] Downloaded: https://repo.maven.apache.org/maven2/org/jamon/jamon-runtime/2.4.1/jamon-runtime-2.4.1.jar
(24 KB at 36.4 KB/sec)
2017-08-10T00:27:16.037 [INFO] Downloading: https://repo.maven.apache.org/maven2/org/apache/hadoop/hadoop-auth/2.5.1/hadoop-auth-2.5.1.jar
2017-08-10T00:27:16.050 [INFO] Downloaded: https://repo.maven.apache.org/maven2/org/apache/commons/commons-math/2.2/commons-math-2.2.jar
(966 KB at 1438.7 KB/sec)
2017-08-10T00:27:16.051 [INFO] Downloaded: https://repo.maven.apache.org/maven2/com/lmax/disruptor/3.3.0/disruptor-3.3.0.jar
(78 KB at 115.6 KB/sec)
2017-08-10T00:27:16.051 [INFO] Downloading: https://repo.maven.apache.org/maven2/org/apache/httpcomponents/httpclient/4.2.5/httpclient-4.2.5.jar
2017-08-10T00:27:16.051 [INFO] Downloading: https://repo.maven.apache.org/maven2/org/apache/hbase/hbase-hadoop-compat/1.2.6/hbase-hadoop-compat-1.2.6-tests.jar
2017-08-10T00:27:16.065 [INFO] Downloaded: https://repo.maven.apache.org/maven2/org/apache/hadoop/hadoop-auth/2.5.1/hadoop-auth-2.5.1.jar
(52 KB at 74.7 KB/sec)
2017-08-10T00:27:16.065 [INFO] Downloading: https://repo.maven.apache.org/maven2/org/apache/hbase/hbase-hadoop2-compat/1.2.6/hbase-hadoop2-compat-1.2.6-tests.jar
2017-08-10T00:27:16.078 [INFO] Downloaded: https://repo.maven.apache.org/maven2/org/apache/hbase/hbase-hadoop-compat/1.2.6/hbase-hadoop-compat-1.2.6-tests.jar
(20 KB at 27.3 KB/sec)
2017-08-10T00:27:16.079 [INFO] Downloading: https://repo.maven.apache.org/maven2/org/apache/hbase/hbase-annotations/1.2.6/hbase-annotations-1.2.6.jar
2017-08-10T00:27:16.092 [INFO] Downloaded: https://repo.maven.apache.org/maven2/org/apache/hbase/hbase-hadoop2-compat/1.2.6/hbase-hadoop2-compat-1.2.6-tests.jar
(30 KB at 41.1 KB/sec)
2017-08-10T00:27:16.107 [INFO] Downloaded: https://repo.maven.apache.org/maven2/org/apache/hbase/hbase-annotations/1.2.6/hbase-annotations-1.2.6.jar
(21 KB at 28.0 KB/sec)
2017-08-10T00:27:16.111 [INFO] Downloaded: https://repo.maven.apache.org/maven2/org/apache/httpcomponents/httpclient/4.2.5/httpclient-4.2.5.jar
(424 KB at 578.9 KB/sec)
2017-08-10T00:27:17.462 [INFO] Downloaded: https://repo.maven.apache.org/maven2/org/apache/hbase/hbase-shaded-client/1.2.6/hbase-shaded-client-1.2.6.jar
(29957 KB at 14340.2 KB/sec)
[JENKINS] Archiving disabled
2017-08-10T00:27:19.193 [INFO]                                                           
             
2017-08-10T00:27:19.193 [INFO] ------------------------------------------------------------------------
2017-08-10T00:27:19.193 [INFO] Skipping Apache Beam :: Parent
2017-08-10T00:27:19.193 [INFO] This project has been banned from the build due to previous
failures.
2017-08-10T00:27:19.193 [INFO] ------------------------------------------------------------------------
[JENKINS] Archiving disabled
[JENKINS] Archiving disabled
[JENKINS] Archiving disabled
[JENKINS] Archiving disabled
[JENKINS] Archiving disabled
[JENKINS] Archiving disabled
[JENKINS] Archiving disabled
[JENKINS] Archiving disabled
[JENKINS] Archiving disabled
[JENKINS] Archiving disabled
[JENKINS] Archiving disabled
[JENKINS] Archiving disabled
[JENKINS] Archiving disabled
[JENKINS] Archiving disabled
[JENKINS] Archiving disabled
[JENKINS] Archiving disabled
[JENKINS] Archiving disabled
[JENKINS] Archiving disabled
[JENKINS] Archiving disabled
[JENKINS] Archiving disabled
[JENKINS] Archiving disabled
[JENKINS] Archiving disabled
[JENKINS] Archiving disabled
[JENKINS] Archiving disabled
[JENKINS] Archiving disabled
[JENKINS] Archiving disabled
[JENKINS] Archiving disabled
[JENKINS] Archiving disabled
[JENKINS] Archiving disabled
[JENKINS] Archiving disabled
[JENKINS] Archiving disabled
[JENKINS] Archiving disabled
[JENKINS] Archiving disabled
[JENKINS] Archiving disabled
[JENKINS] Archiving disabled
[JENKINS] Archiving disabled
[JENKINS] Archiving disabled
[JENKINS] Archiving disabled
[JENKINS] Archiving disabled
[JENKINS] Archiving disabled
[JENKINS] Archiving disabled
[JENKINS] Archiving disabled
[JENKINS] Archiving disabled
[JENKINS] Archiving disabled
[JENKINS] Archiving disabled
[JENKINS] Archiving disabled
[JENKINS] Archiving disabled
[JENKINS] Archiving disabled
[JENKINS] Archiving disabled
[JENKINS] Archiving disabled
[JENKINS] Archiving disabled
[JENKINS] Archiving disabled
[JENKINS] Archiving disabled
[JENKINS] Archiving disabled
[JENKINS] Archiving disabled
2017-08-10T00:28:01.528 [INFO] ------------------------------------------------------------------------
2017-08-10T00:28:01.529 [INFO] Reactor Summary:
2017-08-10T00:28:01.529 [INFO] 
2017-08-10T00:28:01.529 [INFO] Apache Beam :: Parent .............................. SUCCESS
[ 51.948 s]
2017-08-10T00:28:01.529 [INFO] Apache Beam :: SDKs :: Java :: Build Tools ......... SUCCESS
[ 10.776 s]
2017-08-10T00:28:01.529 [INFO] Apache Beam :: SDKs ................................ SUCCESS
[  6.200 s]
2017-08-10T00:28:01.529 [INFO] Apache Beam :: SDKs :: Common ...................... SUCCESS
[  2.918 s]
2017-08-10T00:28:01.529 [INFO] Apache Beam :: SDKs :: Common :: Runner API ........ SUCCESS
[ 28.757 s]
2017-08-10T00:28:01.529 [INFO] Apache Beam :: SDKs :: Common :: Fn API ............ SUCCESS
[ 19.927 s]
2017-08-10T00:28:01.529 [INFO] Apache Beam :: SDKs :: Java ........................ SUCCESS
[  2.850 s]
2017-08-10T00:28:01.529 [INFO] Apache Beam :: SDKs :: Java :: Core ................ SUCCESS
[02:31 min]
2017-08-10T00:28:01.529 [INFO] Apache Beam :: Runners ............................. SUCCESS
[  3.414 s]
2017-08-10T00:28:01.529 [INFO] Apache Beam :: Runners :: Core Construction Java ... SUCCESS
[ 32.316 s]
2017-08-10T00:28:01.529 [INFO] Apache Beam :: Runners :: Core Java ................ SUCCESS
[ 48.047 s]
2017-08-10T00:28:01.529 [INFO] Apache Beam :: Runners :: Direct Java .............. SUCCESS
[05:08 min]
2017-08-10T00:28:01.529 [INFO] Apache Beam :: SDKs :: Java :: IO .................. SUCCESS
[  2.909 s]
2017-08-10T00:28:01.529 [INFO] Apache Beam :: SDKs :: Java :: IO :: AMQP .......... SUCCESS
[ 21.812 s]
2017-08-10T00:28:01.529 [INFO] Apache Beam :: SDKs :: Java :: IO :: Common ........ SUCCESS
[  6.839 s]
2017-08-10T00:28:01.529 [INFO] Apache Beam :: SDKs :: Java :: IO :: Cassandra ..... SUCCESS
[ 22.602 s]
2017-08-10T00:28:01.530 [INFO] Apache Beam :: SDKs :: Java :: IO :: Elasticsearch . SUCCESS
[ 33.165 s]
2017-08-10T00:28:01.530 [INFO] Apache Beam :: SDKs :: Java :: Extensions .......... SUCCESS
[  2.929 s]
2017-08-10T00:28:01.530 [INFO] Apache Beam :: SDKs :: Java :: Extensions :: Google Cloud Platform
Core SUCCESS [ 24.566 s]
2017-08-10T00:28:01.530 [INFO] Apache Beam :: SDKs :: Java :: Extensions :: Protobuf SUCCESS
[ 18.035 s]
2017-08-10T00:28:01.530 [INFO] Apache Beam :: SDKs :: Java :: IO :: Google Cloud Platform
SUCCESS [01:22 min]
2017-08-10T00:28:01.530 [INFO] Apache Beam :: SDKs :: Java :: IO :: Hadoop Common . SUCCESS
[ 19.817 s]
2017-08-10T00:28:01.530 [INFO] Apache Beam :: SDKs :: Java :: IO :: Hadoop File System SUCCESS
[ 30.070 s]
2017-08-10T00:28:01.530 [INFO] Apache Beam :: SDKs :: Java :: IO :: Hadoop ........ SUCCESS
[  5.233 s]
2017-08-10T00:28:01.530 [INFO] Apache Beam :: SDKs :: Java :: IO :: Hadoop :: input-format
SUCCESS [ 19.058 s]
2017-08-10T00:28:01.530 [INFO] Apache Beam :: Runners :: Google Cloud Dataflow .... SUCCESS
[07:40 min]
2017-08-10T00:28:01.530 [INFO] Apache Beam :: SDKs :: Java :: IO :: Hadoop :: jdk1.8-tests
SUCCESS [01:16 min]
2017-08-10T00:28:01.530 [INFO] Apache Beam :: SDKs :: Java :: IO :: HBase ......... FAILURE
[  4.260 s]
2017-08-10T00:28:01.530 [INFO] Apache Beam :: SDKs :: Java :: IO :: HCatalog ...... SKIPPED
2017-08-10T00:28:01.530 [INFO] Apache Beam :: SDKs :: Java :: IO :: JDBC .......... SKIPPED
2017-08-10T00:28:01.530 [INFO] Apache Beam :: SDKs :: Java :: IO :: JMS ........... SKIPPED
2017-08-10T00:28:01.530 [INFO] Apache Beam :: SDKs :: Java :: IO :: Kafka ......... SKIPPED
2017-08-10T00:28:01.530 [INFO] Apache Beam :: SDKs :: Java :: IO :: Kinesis ....... SKIPPED
2017-08-10T00:28:01.530 [INFO] Apache Beam :: SDKs :: Java :: IO :: MongoDB ....... SKIPPED
2017-08-10T00:28:01.530 [INFO] Apache Beam :: SDKs :: Java :: IO :: MQTT .......... SKIPPED
2017-08-10T00:28:01.530 [INFO] Apache Beam :: SDKs :: Java :: IO :: Solr .......... SKIPPED
2017-08-10T00:28:01.530 [INFO] Apache Beam :: SDKs :: Java :: IO :: XML ........... SKIPPED
2017-08-10T00:28:01.530 [INFO] Apache Beam :: SDKs :: Java :: Maven Archetypes .... SKIPPED
2017-08-10T00:28:01.530 [INFO] Apache Beam :: SDKs :: Java :: Maven Archetypes :: Starter
SKIPPED
2017-08-10T00:28:01.530 [INFO] Apache Beam :: Examples ............................ SKIPPED
2017-08-10T00:28:01.530 [INFO] Apache Beam :: Examples :: Java .................... SKIPPED
2017-08-10T00:28:01.530 [INFO] Apache Beam :: SDKs :: Java :: Maven Archetypes :: Examples
SKIPPED
2017-08-10T00:28:01.530 [INFO] Apache Beam :: Examples :: Java 8 .................. SKIPPED
2017-08-10T00:28:01.530 [INFO] Apache Beam :: SDKs :: Java :: Maven Archetypes :: Examples
- Java 8 SKIPPED
2017-08-10T00:28:01.530 [INFO] Apache Beam :: SDKs :: Java :: Extensions :: Jackson SKIPPED
2017-08-10T00:28:01.530 [INFO] Apache Beam :: SDKs :: Java :: Extensions :: Join library SKIPPED
2017-08-10T00:28:01.531 [INFO] Apache Beam :: SDKs :: Java :: Extensions :: Sorter  SKIPPED
2017-08-10T00:28:01.531 [INFO] Apache Beam :: SDKs :: Java :: Harness ............. SKIPPED
2017-08-10T00:28:01.531 [INFO] Apache Beam :: SDKs :: Java :: Java 8 Tests ........ SKIPPED
2017-08-10T00:28:01.531 [INFO] Apache Beam :: SDKs :: Python ...................... SKIPPED
2017-08-10T00:28:01.531 [INFO] Apache Beam :: Runners :: Flink .................... SKIPPED
2017-08-10T00:28:01.531 [INFO] Apache Beam :: Runners :: Spark .................... SKIPPED
2017-08-10T00:28:01.531 [INFO] Apache Beam :: Runners :: Apex ..................... SKIPPED
2017-08-10T00:28:01.531 [INFO] Apache Beam :: Runners :: Gearpump ................. SKIPPED
2017-08-10T00:28:01.531 [INFO] Apache Beam :: SDKs :: Java :: Aggregated Javadoc .. SKIPPED
2017-08-10T00:28:01.531 [INFO] ------------------------------------------------------------------------
2017-08-10T00:28:01.531 [INFO] BUILD FAILURE
2017-08-10T00:28:01.531 [INFO] ------------------------------------------------------------------------
2017-08-10T00:28:01.531 [INFO] Total time: 26:23 min
2017-08-10T00:28:01.531 [INFO] Finished at: 2017-08-10T00:28:01+00:00
2017-08-10T00:28:02.254 [INFO] Final Memory: 220M/2113M
2017-08-10T00:28:02.254 [INFO] ------------------------------------------------------------------------
2017-08-10T00:28:02.259 [ERROR] Failed to execute goal on project beam-sdks-java-io-hbase:
Could not resolve dependencies for project org.apache.beam:beam-sdks-java-io-hbase:jar:2.2.0-SNAPSHOT:
Could not transfer artifact org.apache.hbase:hbase-shaded-server:jar:1.2.6 from/to central
(https://repo.maven.apache.org/maven2): GET request of: org/apache/hbase/hbase-shaded-server/1.2.6/hbase-shaded-server-1.2.6.jar
from central failed: Connection reset -> [Help 1]
org.apache.maven.lifecycle.LifecycleExecutionException: Failed to execute goal on project
beam-sdks-java-io-hbase: Could not resolve dependencies for project org.apache.beam:beam-sdks-java-io-hbase:jar:2.2.0-SNAPSHOT:
Could not transfer artifact org.apache.hbase:hbase-shaded-server:jar:1.2.6 from/to central
(https://repo.maven.apache.org/maven2): GET request of: org/apache/hbase/hbase-shaded-server/1.2.6/hbase-shaded-server-1.2.6.jar
from central failed
	at org.apache.maven.lifecycle.internal.LifecycleDependencyResolver.getDependencies(LifecycleDependencyResolver.java:221)
	at org.apache.maven.lifecycle.internal.LifecycleDependencyResolver.resolveProjectDependencies(LifecycleDependencyResolver.java:127)
	at org.apache.maven.lifecycle.internal.MojoExecutor.ensureDependenciesAreResolved(MojoExecutor.java:257)
	at org.apache.maven.lifecycle.internal.MojoExecutor.execute(MojoExecutor.java:200)
	at org.apache.maven.lifecycle.internal.MojoExecutor.execute(MojoExecutor.java:153)
	at org.apache.maven.lifecycle.internal.MojoExecutor.execute(MojoExecutor.java:145)
	at org.apache.maven.lifecycle.internal.LifecycleModuleBuilder.buildProject(LifecycleModuleBuilder.java:116)
	at org.apache.maven.lifecycle.internal.LifecycleModuleBuilder.buildProject(LifecycleModuleBuilder.java:80)
	at org.apache.maven.lifecycle.internal.builder.singlethreaded.SingleThreadedBuilder.build(SingleThreadedBuilder.java:51)
	at org.apache.maven.lifecycle.internal.LifecycleStarter.execute(LifecycleStarter.java:128)
	at org.apache.maven.DefaultMaven.doExecute(DefaultMaven.java:307)
	at org.apache.maven.DefaultMaven.doExecute(DefaultMaven.java:193)
	at org.apache.maven.DefaultMaven.execute(DefaultMaven.java:106)
	at org.jvnet.hudson.maven3.launcher.Maven33Launcher.main(Maven33Launcher.java:129)
	at sun.reflect.NativeMethodAccessorImpl.invoke0(Native Method)
	at sun.reflect.NativeMethodAccessorImpl.invoke(NativeMethodAccessorImpl.java:62)
	at sun.reflect.DelegatingMethodAccessorImpl.invoke(DelegatingMethodAccessorImpl.java:43)
	at java.lang.reflect.Method.invoke(Method.java:498)
	at org.codehaus.plexus.classworlds.launcher.Launcher.launchStandard(Launcher.java:330)
	at org.codehaus.plexus.classworlds.launcher.Launcher.launch(Launcher.java:238)
	at jenkins.maven3.agent.Maven33Main.launch(Maven33Main.java:176)
	at sun.reflect.NativeMethodAccessorImpl.invoke0(Native Method)
	at sun.reflect.NativeMethodAccessorImpl.invoke(NativeMethodAccessorImpl.java:62)
	at sun.reflect.DelegatingMethodAccessorImpl.invoke(DelegatingMethodAccessorImpl.java:43)
	at java.lang.reflect.Method.invoke(Method.java:498)
	at hudson.maven.Maven3Builder.call(Maven3Builder.java:139)
	at hudson.maven.Maven3Builder.call(Maven3Builder.java:70)
	at hudson.remoting.UserRequest.perform(UserRequest.java:153)
	at hudson.remoting.UserRequest.perform(UserRequest.java:50)
	at hudson.remoting.Request$2.run(Request.java:336)
	at hudson.remoting.InterceptingExecutorService$1.call(InterceptingExecutorService.java:68)
	at java.util.concurrent.FutureTask.run(FutureTask.java:266)
	at java.util.concurrent.ThreadPoolExecutor.runWorker(ThreadPoolExecutor.java:1149)
	at java.util.concurrent.ThreadPoolExecutor$Worker.run(ThreadPoolExecutor.java:624)
	at java.lang.Thread.run(Thread.java:748)
Caused by: org.apache.maven.project.DependencyResolutionException: Could not resolve dependencies
for project org.apache.beam:beam-sdks-java-io-hbase:jar:2.2.0-SNAPSHOT: Could not transfer
artifact org.apache.hbase:hbase-shaded-server:jar:1.2.6 from/to central (https://repo.maven.apache.org/maven2):
GET request of: org/apache/hbase/hbase-shaded-server/1.2.6/hbase-shaded-server-1.2.6.jar from
central failed
	at org.apache.maven.project.DefaultProjectDependenciesResolver.resolve(DefaultProjectDependenciesResolver.java:211)
	at org.apache.maven.lifecycle.internal.LifecycleDependencyResolver.getDependencies(LifecycleDependencyResolver.java:195)
	... 34 more
Caused by: org.eclipse.aether.resolution.DependencyResolutionException: Could not transfer
artifact org.apache.hbase:hbase-shaded-server:jar:1.2.6 from/to central (https://repo.maven.apache.org/maven2):
GET request of: org/apache/hbase/hbase-shaded-server/1.2.6/hbase-shaded-server-1.2.6.jar from
central failed
	at org.eclipse.aether.internal.impl.DefaultRepositorySystem.resolveDependencies(DefaultRepositorySystem.java:384)
	at org.apache.maven.project.DefaultProjectDependenciesResolver.resolve(DefaultProjectDependenciesResolver.java:205)
	... 35 more
Caused by: org.eclipse.aether.resolution.ArtifactResolutionException: Could not transfer artifact
org.apache.hbase:hbase-shaded-server:jar:1.2.6 from/to central (https://repo.maven.apache.org/maven2):
GET request of: org/apache/hbase/hbase-shaded-server/1.2.6/hbase-shaded-server-1.2.6.jar from
central failed
	at org.eclipse.aether.internal.impl.DefaultArtifactResolver.resolve(DefaultArtifactResolver.java:444)
	at org.eclipse.aether.internal.impl.DefaultArtifactResolver.resolveArtifacts(DefaultArtifactResolver.java:246)
	at org.eclipse.aether.internal.impl.DefaultRepositorySystem.resolveDependencies(DefaultRepositorySystem.java:367)
	... 36 more
Caused by: org.eclipse.aether.transfer.ArtifactTransferException: Could not transfer artifact
org.apache.hbase:hbase-shaded-server:jar:1.2.6 from/to central (https://repo.maven.apache.org/maven2):
GET request of: org/apache/hbase/hbase-shaded-server/1.2.6/hbase-shaded-server-1.2.6.jar from
central failed
	at org.eclipse.aether.connector.basic.ArtifactTransportListener.transferFailed(ArtifactTransportListener.java:43)
	at org.eclipse.aether.connector.basic.BasicRepositoryConnector$TaskRunner.run(BasicRepositoryConnector.java:355)
	at org.eclipse.aether.util.concurrency.RunnableErrorForwarder$1.run(RunnableErrorForwarder.java:67)
	... 3 more
Caused by: org.apache.maven.wagon.TransferFailedException: GET request of: org/apache/hbase/hbase-shaded-server/1.2.6/hbase-shaded-server-1.2.6.jar
from central failed
	at org.apache.maven.wagon.AbstractWagon.getTransfer(AbstractWagon.java:363)
	at org.apache.maven.wagon.AbstractWagon.getTransfer(AbstractWagon.java:316)
	at org.apache.maven.wagon.AbstractWagon.getTransfer(AbstractWagon.java:285)
	at org.apache.maven.wagon.StreamWagon.getIfNewer(StreamWagon.java:97)
	at org.apache.maven.wagon.StreamWagon.get(StreamWagon.java:61)
	at org.eclipse.aether.transport.wagon.WagonTransporter$GetTaskRunner.run(WagonTransporter.java:560)
	at org.eclipse.aether.transport.wagon.WagonTransporter.execute(WagonTransporter.java:427)
	at org.eclipse.aether.transport.wagon.WagonTransporter.get(WagonTransporter.java:404)
	at org.eclipse.aether.connector.basic.BasicRepositoryConnector$GetTaskRunner.runTask(BasicRepositoryConnector.java:447)
	at org.eclipse.aether.connector.basic.BasicRepositoryConnector$TaskRunner.run(BasicRepositoryConnector.java:350)
	... 4 more
Caused by: java.net.SocketException: Connection reset
	at java.net.SocketInputStream.read(SocketInputStream.java:210)
	at java.net.SocketInputStream.read(SocketInputStream.java:141)
	at sun.security.ssl.InputRecord.readFully(InputRecord.java:465)
	at sun.security.ssl.InputRecord.readV3Record(InputRecord.java:593)
	at sun.security.ssl.InputRecord.read(InputRecord.java:532)
	at sun.security.ssl.SSLSocketImpl.readRecord(SSLSocketImpl.java:983)
	at sun.security.ssl.SSLSocketImpl.readDataRecord(SSLSocketImpl.java:940)
	at sun.security.ssl.AppInputStream.read(AppInputStream.java:105)
	at org.apache.maven.wagon.providers.http.httpclient.impl.io.SessionInputBufferImpl.streamRead(SessionInputBufferImpl.java:136)
	at org.apache.maven.wagon.providers.http.httpclient.impl.io.SessionInputBufferImpl.read(SessionInputBufferImpl.java:195)
	at org.apache.maven.wagon.providers.http.httpclient.impl.io.ContentLengthInputStream.read(ContentLengthInputStream.java:178)
	at org.apache.maven.wagon.providers.http.httpclient.conn.EofSensorInputStream.read(EofSensorInputStream.java:137)
	at org.apache.maven.wagon.AbstractWagon.transfer(AbstractWagon.java:531)
	at org.apache.maven.wagon.AbstractWagon.getTransfer(AbstractWagon.java:353)
	... 13 more
2017-08-10T00:28:02.261 [ERROR] 
2017-08-10T00:28:02.261 [ERROR] Re-run Maven using the -X switch to enable full debug logging.
2017-08-10T00:28:02.261 [ERROR] 
2017-08-10T00:28:02.261 [ERROR] For more information about the errors and possible solutions,
please read the following articles:
2017-08-10T00:28:02.261 [ERROR] [Help 1] http://cwiki.apache.org/confluence/display/MAVEN/DependencyResolutionException
2017-08-10T00:28:02.261 [ERROR] 
2017-08-10T00:28:02.261 [ERROR] After correcting the problems, you can resume the build with
the command
2017-08-10T00:28:02.261 [ERROR]   mvn <goals> -rf :beam-sdks-java-io-hbase
channel stopped

Mime
View raw message