beam-commits mailing list archives

Site index · List index
Message view « Date » · « Thread »
Top « Date » · « Thread »
From Apache Jenkins Server <jenk...@builds.apache.org>
Subject Build failed in Jenkins: beam_PostCommit_Java_MavenInstall #4659
Date Mon, 28 Aug 2017 01:22:24 GMT
See <https://builds.apache.org/job/beam_PostCommit_Java_MavenInstall/4659/display/redirect>

------------------------------------------
[...truncated 3.79 MB...]
2017-08-28T01:20:08.654 [INFO] Downloaded: https://repo.maven.apache.org/maven2/org/sonatype/sisu/inject/guice-parent/2.9.2/guice-parent-2.9.2.pom
(12 KB at 427.0 KB/sec)
2017-08-28T01:20:08.657 [INFO] Downloading: https://repo.maven.apache.org/maven2/org/slf4j/jcl-over-slf4j/1.7.21/jcl-over-slf4j-1.7.21.pom
2017-08-28T01:20:08.684 [INFO] Downloaded: https://repo.maven.apache.org/maven2/org/slf4j/jcl-over-slf4j/1.7.21/jcl-over-slf4j-1.7.21.pom
(963 B at 34.8 KB/sec)
2017-08-28T01:20:08.689 [INFO] Downloading: https://repo.maven.apache.org/maven2/org/apache/httpcomponents/httpmime/4.5.2/httpmime-4.5.2.jar
2017-08-28T01:20:08.689 [INFO] Downloading: https://repo.maven.apache.org/maven2/com/fasterxml/jackson/core/jackson-core/2.8.3/jackson-core-2.8.3.jar
2017-08-28T01:20:08.690 [INFO] Downloading: https://repo.maven.apache.org/maven2/com/fasterxml/jackson/core/jackson-annotations/2.8.3/jackson-annotations-2.8.3.jar
2017-08-28T01:20:08.690 [INFO] Downloading: https://repo.maven.apache.org/maven2/com/fasterxml/jackson/core/jackson-databind/2.8.3/jackson-databind-2.8.3.jar
2017-08-28T01:20:08.690 [INFO] Downloading: https://repo.maven.apache.org/maven2/org/eclipse/jgit/org.eclipse.jgit/4.5.0.201609210915-r/org.eclipse.jgit-4.5.0.201609210915-r.jar
2017-08-28T01:20:08.722 [INFO] Downloaded: https://repo.maven.apache.org/maven2/org/apache/httpcomponents/httpmime/4.5.2/httpmime-4.5.2.jar
(41 KB at 1252.1 KB/sec)
2017-08-28T01:20:08.722 [INFO] Downloading: https://repo.maven.apache.org/maven2/com/jcraft/jsch/0.1.53/jsch-0.1.53.jar
2017-08-28T01:20:08.723 [INFO] Downloaded: https://repo.maven.apache.org/maven2/com/fasterxml/jackson/core/jackson-annotations/2.8.3/jackson-annotations-2.8.3.jar
(55 KB at 1598.4 KB/sec)
2017-08-28T01:20:08.724 [INFO] Downloading: https://repo.maven.apache.org/maven2/com/googlecode/javaewah/JavaEWAH/0.7.9/JavaEWAH-0.7.9.jar
2017-08-28T01:20:08.743 [INFO] Downloaded: https://repo.maven.apache.org/maven2/com/fasterxml/jackson/core/jackson-core/2.8.3/jackson-core-2.8.3.jar
(275 KB at 5083.2 KB/sec)
2017-08-28T01:20:08.743 [INFO] Downloading: https://repo.maven.apache.org/maven2/org/codehaus/plexus/plexus-utils/2.0.7/plexus-utils-2.0.7.jar
2017-08-28T01:20:08.766 [INFO] Downloaded: https://repo.maven.apache.org/maven2/com/googlecode/javaewah/JavaEWAH/0.7.9/JavaEWAH-0.7.9.jar
(123 KB at 1608.1 KB/sec)
2017-08-28T01:20:08.766 [INFO] Downloading: https://repo.maven.apache.org/maven2/org/sonatype/sisu/sisu-inject-plexus/1.4.3.2/sisu-inject-plexus-1.4.3.2.jar
2017-08-28T01:20:08.785 [INFO] Downloaded: https://repo.maven.apache.org/maven2/com/jcraft/jsch/0.1.53/jsch-0.1.53.jar
(274 KB at 2880.4 KB/sec)
2017-08-28T01:20:08.785 [INFO] Downloading: https://repo.maven.apache.org/maven2/org/sonatype/sisu/sisu-inject-bean/1.4.3.2/sisu-inject-bean-1.4.3.2.jar
2017-08-28T01:20:08.797 [INFO] Downloaded: https://repo.maven.apache.org/maven2/org/codehaus/plexus/plexus-utils/2.0.7/plexus-utils-2.0.7.jar
(219 KB at 2063.2 KB/sec)
2017-08-28T01:20:08.797 [INFO] Downloading: https://repo.maven.apache.org/maven2/org/sonatype/sisu/sisu-guice/2.9.2/sisu-guice-2.9.2-no_aop.jar
2017-08-28T01:20:08.820 [INFO] Downloaded: https://repo.maven.apache.org/maven2/org/sonatype/sisu/sisu-inject-plexus/1.4.3.2/sisu-inject-plexus-1.4.3.2.jar
(201 KB at 1550.9 KB/sec)
2017-08-28T01:20:08.820 [INFO] Downloading: https://repo.maven.apache.org/maven2/org/slf4j/slf4j-api/1.7.21/slf4j-api-1.7.21.jar
2017-08-28T01:20:08.834 [INFO] Downloaded: https://repo.maven.apache.org/maven2/org/sonatype/sisu/sisu-inject-bean/1.4.3.2/sisu-inject-bean-1.4.3.2.jar
(157 KB at 1095.6 KB/sec)
2017-08-28T01:20:08.834 [INFO] Downloading: https://repo.maven.apache.org/maven2/org/slf4j/jcl-over-slf4j/1.7.21/jcl-over-slf4j-1.7.21.jar
2017-08-28T01:20:08.854 [INFO] Downloaded: https://repo.maven.apache.org/maven2/org/slf4j/slf4j-api/1.7.21/slf4j-api-1.7.21.jar
(41 KB at 246.1 KB/sec)
2017-08-28T01:20:08.858 [INFO] Downloaded: https://repo.maven.apache.org/maven2/com/fasterxml/jackson/core/jackson-databind/2.8.3/jackson-databind-2.8.3.jar
(1205 KB at 7128.9 KB/sec)
2017-08-28T01:20:08.866 [INFO] Downloaded: https://repo.maven.apache.org/maven2/org/slf4j/jcl-over-slf4j/1.7.21/jcl-over-slf4j-1.7.21.jar
(17 KB at 91.7 KB/sec)
2017-08-28T01:20:08.885 [INFO] Downloaded: https://repo.maven.apache.org/maven2/org/sonatype/sisu/sisu-guice/2.9.2/sisu-guice-2.9.2-no_aop.jar
(469 KB at 2415.4 KB/sec)
2017-08-28T01:20:08.950 [INFO] Downloaded: https://repo.maven.apache.org/maven2/org/eclipse/jgit/org.eclipse.jgit/4.5.0.201609210915-r/org.eclipse.jgit-4.5.0.201609210915-r.jar
(2324 KB at 8936.0 KB/sec)
2017-08-28T01:20:09.717 [INFO] Starting Coveralls job for jenkins (4659 / https://builds.apache.org/job/beam_PostCommit_Java_MavenInstall/4659/)
2017-08-28T01:20:09.717 [INFO] Using repository token <secret>
2017-08-28T01:20:09.717 [INFO] Git commit d50c964 in master
2017-08-28T01:20:09.717 [INFO] Writing Coveralls data to <https://builds.apache.org/job/beam_PostCommit_Java_MavenInstall/ws/target/coveralls.json...>
2017-08-28T01:20:09.764 [INFO] Processing coverage report from <https://builds.apache.org/job/beam_PostCommit_Java_MavenInstall/ws/sdks/java/core/target/site/jacoco/jacoco.xml>
2017-08-28T01:20:10.136 [INFO] Processing coverage report from <https://builds.apache.org/job/beam_PostCommit_Java_MavenInstall/ws/sdks/java/extensions/google-cloud-platform-core/target/site/jacoco/jacoco.xml>
2017-08-28T01:20:10.185 [INFO] Processing coverage report from <https://builds.apache.org/job/beam_PostCommit_Java_MavenInstall/ws/sdks/java/extensions/protobuf/target/site/jacoco/jacoco.xml>
2017-08-28T01:20:10.243 [INFO] Processing coverage report from <https://builds.apache.org/job/beam_PostCommit_Java_MavenInstall/ws/sdks/java/java8tests/target/site/jacoco/jacoco.xml>
2017-08-28T01:20:10.244 [INFO] Processing coverage report from <https://builds.apache.org/job/beam_PostCommit_Java_MavenInstall/ws/runners/core-java/target/site/jacoco/jacoco.xml>
2017-08-28T01:20:10.403 [INFO] Processing coverage report from <https://builds.apache.org/job/beam_PostCommit_Java_MavenInstall/ws/runners/direct-java/target/site/jacoco/jacoco.xml>
2017-08-28T01:20:10.554 [INFO] Processing coverage report from <https://builds.apache.org/job/beam_PostCommit_Java_MavenInstall/ws/runners/google-cloud-dataflow-java/target/site/jacoco/jacoco.xml>
2017-08-28T01:20:10.681 [INFO] Processing coverage report from <https://builds.apache.org/job/beam_PostCommit_Java_MavenInstall/ws/examples/java/target/site/jacoco/jacoco.xml>
2017-08-28T01:20:10.752 [INFO] Processing coverage report from <https://builds.apache.org/job/beam_PostCommit_Java_MavenInstall/ws/examples/java8/target/site/jacoco/jacoco.xml>
2017-08-28T01:20:10.803 [INFO] Successfully wrote Coveralls data in 1085ms
2017-08-28T01:20:10.803 [INFO] Gathered code coverage metrics for 526 source files with 119425
lines of code:
2017-08-28T01:20:10.803 [INFO] - 30318 relevant lines
2017-08-28T01:20:10.803 [INFO] - 21212 covered lines
2017-08-28T01:20:10.803 [INFO] - 9106 missed lines
2017-08-28T01:20:10.803 [INFO] Submitting Coveralls data to API
2017-08-28T01:21:10.989 [ERROR] Submission failed in 60186ms while handling I/O operations
[JENKINS] Archiving disabled
[JENKINS] Archiving disabled
[JENKINS] Archiving disabled
[JENKINS] Archiving disabled
[JENKINS] Archiving disabled
[JENKINS] Archiving disabled
[JENKINS] Archiving disabled
[JENKINS] Archiving disabled
[JENKINS] Archiving disabled
[JENKINS] Archiving disabled
[JENKINS] Archiving disabled
[JENKINS] Archiving disabled
[JENKINS] Archiving disabled
[JENKINS] Archiving disabled
[JENKINS] Archiving disabled
[JENKINS] Archiving disabled
[JENKINS] Archiving disabled
[JENKINS] Archiving disabled
[JENKINS] Archiving disabled
[JENKINS] Archiving disabled
[JENKINS] Archiving disabled
[JENKINS] Archiving disabled
[JENKINS] Archiving disabled
[JENKINS] Archiving disabled
[JENKINS] Archiving disabled
[JENKINS] Archiving disabled
[JENKINS] Archiving disabled
[JENKINS] Archiving disabled
[JENKINS] Archiving disabled
[JENKINS] Archiving disabled
[JENKINS] Archiving disabled
[JENKINS] Archiving disabled
[JENKINS] Archiving disabled
[JENKINS] Archiving disabled
[JENKINS] Archiving disabled
[JENKINS] Archiving disabled
[JENKINS] Archiving disabled
[JENKINS] Archiving disabled
[JENKINS] Archiving disabled
[JENKINS] Archiving disabled
[JENKINS] Archiving disabled
[JENKINS] Archiving disabled
[JENKINS] Archiving disabled
[JENKINS] Archiving disabled
[JENKINS] Archiving disabled
[JENKINS] Archiving disabled
[JENKINS] Archiving disabled
[JENKINS] Archiving disabled
[JENKINS] Archiving disabled
[JENKINS] Archiving disabled
[JENKINS] Archiving disabled
[JENKINS] Archiving disabled
[JENKINS] Archiving disabled
[JENKINS] Archiving disabled
[JENKINS] Archiving disabled
[JENKINS] Archiving disabled
[JENKINS] Archiving disabled
2017-08-28T01:22:17.528 [INFO] ------------------------------------------------------------------------
2017-08-28T01:22:17.528 [INFO] Reactor Summary:
2017-08-28T01:22:17.528 [INFO] 
2017-08-28T01:22:17.528 [INFO] Apache Beam :: Parent .............................. FAILURE
[01:03 min]
2017-08-28T01:22:17.528 [INFO] Apache Beam :: SDKs :: Java :: Build Tools ......... SUCCESS
[ 11.276 s]
2017-08-28T01:22:17.528 [INFO] Apache Beam :: SDKs ................................ SUCCESS
[  5.521 s]
2017-08-28T01:22:17.528 [INFO] Apache Beam :: SDKs :: Common ...................... SUCCESS
[  3.276 s]
2017-08-28T01:22:17.528 [INFO] Apache Beam :: SDKs :: Common :: Runner API ........ SUCCESS
[ 31.444 s]
2017-08-28T01:22:17.528 [INFO] Apache Beam :: SDKs :: Common :: Fn API ............ SUCCESS
[ 18.367 s]
2017-08-28T01:22:17.528 [INFO] Apache Beam :: SDKs :: Java ........................ SUCCESS
[  2.941 s]
2017-08-28T01:22:17.528 [INFO] Apache Beam :: SDKs :: Java :: Core ................ SUCCESS
[02:42 min]
2017-08-28T01:22:17.528 [INFO] Apache Beam :: Runners ............................. SUCCESS
[  2.928 s]
2017-08-28T01:22:17.528 [INFO] Apache Beam :: Runners :: Core Construction Java ... SUCCESS
[ 32.800 s]
2017-08-28T01:22:17.528 [INFO] Apache Beam :: Runners :: Core Java ................ SUCCESS
[ 50.118 s]
2017-08-28T01:22:17.528 [INFO] Apache Beam :: Runners :: Direct Java .............. SUCCESS
[04:51 min]
2017-08-28T01:22:17.528 [INFO] Apache Beam :: SDKs :: Java :: IO .................. SUCCESS
[  2.914 s]
2017-08-28T01:22:17.529 [INFO] Apache Beam :: SDKs :: Java :: IO :: AMQP .......... SUCCESS
[ 58.483 s]
2017-08-28T01:22:17.529 [INFO] Apache Beam :: SDKs :: Java :: IO :: Common ........ SUCCESS
[  7.608 s]
2017-08-28T01:22:17.529 [INFO] Apache Beam :: SDKs :: Java :: IO :: Cassandra ..... SUCCESS
[ 30.987 s]
2017-08-28T01:22:17.529 [INFO] Apache Beam :: SDKs :: Java :: IO :: Elasticsearch . SUCCESS
[ 41.008 s]
2017-08-28T01:22:17.529 [INFO] Apache Beam :: SDKs :: Java :: Extensions .......... SUCCESS
[  3.013 s]
2017-08-28T01:22:17.529 [INFO] Apache Beam :: SDKs :: Java :: Extensions :: Google Cloud Platform
Core SUCCESS [ 34.680 s]
2017-08-28T01:22:17.529 [INFO] Apache Beam :: SDKs :: Java :: Extensions :: Protobuf SUCCESS
[ 23.724 s]
2017-08-28T01:22:17.529 [INFO] Apache Beam :: SDKs :: Java :: IO :: Google Cloud Platform
SUCCESS [02:06 min]
2017-08-28T01:22:17.529 [INFO] Apache Beam :: SDKs :: Java :: IO :: Hadoop Common . SUCCESS
[ 23.783 s]
2017-08-28T01:22:17.529 [INFO] Apache Beam :: SDKs :: Java :: IO :: Hadoop File System SUCCESS
[ 50.040 s]
2017-08-28T01:22:17.529 [INFO] Apache Beam :: SDKs :: Java :: IO :: Hadoop ........ SUCCESS
[  5.573 s]
2017-08-28T01:22:17.529 [INFO] Apache Beam :: SDKs :: Java :: IO :: Hadoop :: input-format
SUCCESS [ 19.421 s]
2017-08-28T01:22:17.529 [INFO] Apache Beam :: Runners :: Google Cloud Dataflow .... SUCCESS
[06:49 min]
2017-08-28T01:22:17.529 [INFO] Apache Beam :: SDKs :: Java :: IO :: Hadoop :: jdk1.8-tests
SUCCESS [01:38 min]
2017-08-28T01:22:17.529 [INFO] Apache Beam :: SDKs :: Java :: IO :: HBase ......... SUCCESS
[01:39 min]
2017-08-28T01:22:17.529 [INFO] Apache Beam :: SDKs :: Java :: IO :: HCatalog ...... SUCCESS
[01:20 min]
2017-08-28T01:22:17.529 [INFO] Apache Beam :: SDKs :: Java :: IO :: JDBC .......... SUCCESS
[ 47.445 s]
2017-08-28T01:22:17.529 [INFO] Apache Beam :: SDKs :: Java :: IO :: JMS ........... SUCCESS
[ 25.930 s]
2017-08-28T01:22:17.529 [INFO] Apache Beam :: SDKs :: Java :: IO :: Kafka ......... SUCCESS
[ 42.025 s]
2017-08-28T01:22:17.529 [INFO] Apache Beam :: SDKs :: Java :: IO :: Kinesis ....... SUCCESS
[ 28.439 s]
2017-08-28T01:22:17.529 [INFO] Apache Beam :: SDKs :: Java :: IO :: MongoDB ....... SUCCESS
[ 47.770 s]
2017-08-28T01:22:17.529 [INFO] Apache Beam :: SDKs :: Java :: IO :: MQTT .......... SUCCESS
[ 27.259 s]
2017-08-28T01:22:17.529 [INFO] Apache Beam :: SDKs :: Java :: IO :: Solr .......... SUCCESS
[ 50.153 s]
2017-08-28T01:22:17.529 [INFO] Apache Beam :: SDKs :: Java :: IO :: XML ........... SUCCESS
[ 38.022 s]
2017-08-28T01:22:17.529 [INFO] Apache Beam :: SDKs :: Java :: Maven Archetypes .... SUCCESS
[  2.496 s]
2017-08-28T01:22:17.529 [INFO] Apache Beam :: SDKs :: Java :: Maven Archetypes :: Starter
SUCCESS [ 19.676 s]
2017-08-28T01:22:17.529 [INFO] Apache Beam :: Examples ............................ SUCCESS
[  2.902 s]
2017-08-28T01:22:17.529 [INFO] Apache Beam :: Examples :: Java .................... SUCCESS
[07:32 min]
2017-08-28T01:22:17.529 [INFO] Apache Beam :: SDKs :: Java :: Maven Archetypes :: Examples
SUCCESS [ 45.860 s]
2017-08-28T01:22:17.529 [INFO] Apache Beam :: Examples :: Java 8 .................. SUCCESS
[ 35.369 s]
2017-08-28T01:22:17.529 [INFO] Apache Beam :: SDKs :: Java :: Maven Archetypes :: Examples
- Java 8 SUCCESS [ 44.470 s]
2017-08-28T01:22:17.529 [INFO] Apache Beam :: SDKs :: Java :: Extensions :: Jackson SUCCESS
[ 24.311 s]
2017-08-28T01:22:17.529 [INFO] Apache Beam :: SDKs :: Java :: Extensions :: Join library SUCCESS
[ 24.228 s]
2017-08-28T01:22:17.529 [INFO] Apache Beam :: SDKs :: Java :: Extensions :: Sorter  SUCCESS
[ 58.012 s]
2017-08-28T01:22:17.529 [INFO] Apache Beam :: SDKs :: Java :: Nexmark ............. SUCCESS
[02:35 min]
2017-08-28T01:22:17.529 [INFO] Apache Beam :: SDKs :: Java :: Harness ............. SUCCESS
[ 46.426 s]
2017-08-28T01:22:17.529 [INFO] Apache Beam :: SDKs :: Java :: Java 8 Tests ........ SUCCESS
[ 22.664 s]
2017-08-28T01:22:17.529 [INFO] Apache Beam :: SDKs :: Python ...................... SUCCESS
[21:10 min]
2017-08-28T01:22:17.529 [INFO] Apache Beam :: Runners :: Flink .................... SUCCESS
[ 52.063 s]
2017-08-28T01:22:17.529 [INFO] Apache Beam :: Runners :: Spark .................... SUCCESS
[02:46 min]
2017-08-28T01:22:17.529 [INFO] Apache Beam :: Runners :: Apex ..................... SUCCESS
[01:09 min]
2017-08-28T01:22:17.529 [INFO] Apache Beam :: Runners :: Gearpump ................. SUCCESS
[ 41.717 s]
2017-08-28T01:22:17.529 [INFO] Apache Beam :: SDKs :: Java :: Aggregated Javadoc .. SUCCESS
[ 33.342 s]
2017-08-28T01:22:17.529 [INFO] ------------------------------------------------------------------------
2017-08-28T01:22:17.529 [INFO] BUILD FAILURE
2017-08-28T01:22:17.529 [INFO] ------------------------------------------------------------------------
2017-08-28T01:22:17.529 [INFO] Total time: 01:20 h
2017-08-28T01:22:17.530 [INFO] Finished at: 2017-08-28T01:22:17+00:00
2017-08-28T01:22:18.206 [INFO] Final Memory: 329M/1436M
2017-08-28T01:22:18.206 [INFO] ------------------------------------------------------------------------
2017-08-28T01:22:18.212 [ERROR] Failed to execute goal org.eluder.coveralls:coveralls-maven-plugin:4.3.0:report
(default-cli) on project beam-parent: I/O operation failed: Read timed out -> [Help 1]
org.apache.maven.lifecycle.LifecycleExecutionException: Failed to execute goal org.eluder.coveralls:coveralls-maven-plugin:4.3.0:report
(default-cli) on project beam-parent: I/O operation failed
	at org.apache.maven.lifecycle.internal.MojoExecutor.execute(MojoExecutor.java:212)
	at org.apache.maven.lifecycle.internal.MojoExecutor.execute(MojoExecutor.java:153)
	at org.apache.maven.lifecycle.internal.MojoExecutor.execute(MojoExecutor.java:145)
	at org.apache.maven.lifecycle.internal.LifecycleModuleBuilder.buildProject(LifecycleModuleBuilder.java:116)
	at org.apache.maven.lifecycle.internal.LifecycleModuleBuilder.buildProject(LifecycleModuleBuilder.java:80)
	at org.apache.maven.lifecycle.internal.builder.singlethreaded.SingleThreadedBuilder.build(SingleThreadedBuilder.java:51)
	at org.apache.maven.lifecycle.internal.LifecycleStarter.execute(LifecycleStarter.java:128)
	at org.apache.maven.DefaultMaven.doExecute(DefaultMaven.java:307)
	at org.apache.maven.DefaultMaven.doExecute(DefaultMaven.java:193)
	at org.apache.maven.DefaultMaven.execute(DefaultMaven.java:106)
	at org.jvnet.hudson.maven3.launcher.Maven33Launcher.main(Maven33Launcher.java:129)
	at sun.reflect.NativeMethodAccessorImpl.invoke0(Native Method)
	at sun.reflect.NativeMethodAccessorImpl.invoke(NativeMethodAccessorImpl.java:62)
	at sun.reflect.DelegatingMethodAccessorImpl.invoke(DelegatingMethodAccessorImpl.java:43)
	at java.lang.reflect.Method.invoke(Method.java:498)
	at org.codehaus.plexus.classworlds.launcher.Launcher.launchStandard(Launcher.java:330)
	at org.codehaus.plexus.classworlds.launcher.Launcher.launch(Launcher.java:238)
	at jenkins.maven3.agent.Maven33Main.launch(Maven33Main.java:176)
	at sun.reflect.NativeMethodAccessorImpl.invoke0(Native Method)
	at sun.reflect.NativeMethodAccessorImpl.invoke(NativeMethodAccessorImpl.java:62)
	at sun.reflect.DelegatingMethodAccessorImpl.invoke(DelegatingMethodAccessorImpl.java:43)
	at java.lang.reflect.Method.invoke(Method.java:498)
	at hudson.maven.Maven3Builder.call(Maven3Builder.java:139)
	at hudson.maven.Maven3Builder.call(Maven3Builder.java:70)
	at hudson.remoting.UserRequest.perform(UserRequest.java:153)
	at hudson.remoting.UserRequest.perform(UserRequest.java:50)
	at hudson.remoting.Request$2.run(Request.java:336)
	at hudson.remoting.InterceptingExecutorService$1.call(InterceptingExecutorService.java:68)
	at java.util.concurrent.FutureTask.run(FutureTask.java:266)
	at java.util.concurrent.ThreadPoolExecutor.runWorker(ThreadPoolExecutor.java:1149)
	at java.util.concurrent.ThreadPoolExecutor$Worker.run(ThreadPoolExecutor.java:624)
	at java.lang.Thread.run(Thread.java:748)
Caused by: org.apache.maven.plugin.MojoFailureException: I/O operation failed
	at org.eluder.coveralls.maven.plugin.CoverallsReportMojo.execute(CoverallsReportMojo.java:259)
	at org.apache.maven.plugin.DefaultBuildPluginManager.executeMojo(DefaultBuildPluginManager.java:134)
	at org.apache.maven.lifecycle.internal.MojoExecutor.execute(MojoExecutor.java:208)
	... 31 more
Caused by: java.net.SocketTimeoutException: Read timed out
	at java.net.SocketInputStream.socketRead0(Native Method)
	at java.net.SocketInputStream.socketRead(SocketInputStream.java:116)
	at java.net.SocketInputStream.read(SocketInputStream.java:171)
	at java.net.SocketInputStream.read(SocketInputStream.java:141)
	at sun.security.ssl.InputRecord.readFully(InputRecord.java:465)
	at sun.security.ssl.InputRecord.read(InputRecord.java:503)
	at sun.security.ssl.SSLSocketImpl.readRecord(SSLSocketImpl.java:983)
	at sun.security.ssl.SSLSocketImpl.readDataRecord(SSLSocketImpl.java:940)
	at sun.security.ssl.AppInputStream.read(AppInputStream.java:105)
	at org.apache.http.impl.io.SessionInputBufferImpl.streamRead(SessionInputBufferImpl.java:139)
	at org.apache.http.impl.io.SessionInputBufferImpl.fillBuffer(SessionInputBufferImpl.java:155)
	at org.apache.http.impl.io.SessionInputBufferImpl.readLine(SessionInputBufferImpl.java:284)
	at org.apache.http.impl.conn.DefaultHttpResponseParser.parseHead(DefaultHttpResponseParser.java:140)
	at org.apache.http.impl.conn.DefaultHttpResponseParser.parseHead(DefaultHttpResponseParser.java:57)
	at org.apache.http.impl.io.AbstractMessageParser.parse(AbstractMessageParser.java:261)
	at org.apache.http.impl.DefaultBHttpClientConnection.receiveResponseHeader(DefaultBHttpClientConnection.java:165)
	at org.apache.http.impl.conn.CPoolProxy.receiveResponseHeader(CPoolProxy.java:167)
	at org.apache.http.protocol.HttpRequestExecutor.doReceiveResponse(HttpRequestExecutor.java:272)
	at org.apache.http.protocol.HttpRequestExecutor.execute(HttpRequestExecutor.java:124)
	at org.apache.http.impl.execchain.MainClientExec.execute(MainClientExec.java:271)
	at org.apache.http.impl.execchain.ProtocolExec.execute(ProtocolExec.java:184)
	at org.apache.http.impl.execchain.RetryExec.execute(RetryExec.java:88)
	at org.apache.http.impl.execchain.RedirectExec.execute(RedirectExec.java:110)
	at org.apache.http.impl.client.InternalHttpClient.doExecute(InternalHttpClient.java:184)
	at org.apache.http.impl.client.CloseableHttpClient.execute(CloseableHttpClient.java:82)
	at org.apache.http.impl.client.CloseableHttpClient.execute(CloseableHttpClient.java:107)
	at org.apache.http.impl.client.CloseableHttpClient.execute(CloseableHttpClient.java:55)
	at org.eluder.coveralls.maven.plugin.httpclient.CoverallsClient.submit(CoverallsClient.java:84)
	at org.eluder.coveralls.maven.plugin.CoverallsReportMojo.submitData(CoverallsReportMojo.java:400)
	at org.eluder.coveralls.maven.plugin.CoverallsReportMojo.execute(CoverallsReportMojo.java:254)
	... 33 more
2017-08-28T01:22:18.214 [ERROR] 
2017-08-28T01:22:18.214 [ERROR] Re-run Maven using the -X switch to enable full debug logging.
2017-08-28T01:22:18.214 [ERROR] 
2017-08-28T01:22:18.214 [ERROR] For more information about the errors and possible solutions,
please read the following articles:
2017-08-28T01:22:18.214 [ERROR] [Help 1] http://cwiki.apache.org/confluence/display/MAVEN/MojoFailureException
channel stopped

Mime
View raw message