beam-commits mailing list archives

Site index · List index
Message view « Date » · « Thread »
Top « Date » · « Thread »
From Apache Jenkins Server <jenk...@builds.apache.org>
Subject Build failed in Jenkins: beam_PostCommit_Java_MavenInstall #4588
Date Thu, 17 Aug 2017 07:19:12 GMT
See <https://builds.apache.org/job/beam_PostCommit_Java_MavenInstall/4588/display/redirect>

------------------------------------------
[...truncated 3.34 MB...]
test_append_verifier_in_extra_opt (apache_beam.testing.test_pipeline_test.TestPipelineTest)
... ok
test_create_test_pipeline_options (apache_beam.testing.test_pipeline_test.TestPipelineTest)
... ok
test_empty_option_args_parsing (apache_beam.testing.test_pipeline_test.TestPipelineTest) ...
ok
test_get_option (apache_beam.testing.test_pipeline_test.TestPipelineTest) ... ok
test_option_args_parsing (apache_beam.testing.test_pipeline_test.TestPipelineTest) ... ok
test_skip_IT (apache_beam.testing.test_pipeline_test.TestPipelineTest) ... SKIP: IT is skipped
because --test-pipeline-options is not specified
test_basic_execution (apache_beam.testing.test_stream_test.TestStreamTest) ... ok
test_basic_test_stream (apache_beam.testing.test_stream_test.TestStreamTest) ... ok
test_gbk_execution (apache_beam.testing.test_stream_test.TestStreamTest) ... ok
test_test_stream_errors (apache_beam.testing.test_stream_test.TestStreamTest) ... ok
test_delete_files_fails_with_invalid_arg (apache_beam.testing.test_utils_test.TestUtilsTest)
... ok
test_delete_files_fails_with_io_error (apache_beam.testing.test_utils_test.TestUtilsTest)
... ok
test_delete_files_succeeds (apache_beam.testing.test_utils_test.TestUtilsTest) ... ok
test_assert_that_fails (apache_beam.testing.util_test.UtilTest) ... ok
test_assert_that_fails_on_empty_expected (apache_beam.testing.util_test.UtilTest) ... ok
test_assert_that_fails_on_empty_input (apache_beam.testing.util_test.UtilTest) ... ok
test_assert_that_passes (apache_beam.testing.util_test.UtilTest) ... ok

----------------------------------------------------------------------
Ran 1257 tests in 322.754s

OK (skipped=16)
___________________________________ summary ____________________________________
ERROR:   docs: commands failed
  lint: commands succeeded
  py27: commands succeeded
  py27cython: commands succeeded
  py27gcp: commands succeeded
2017-08-17T07:18:14.352 [ERROR] Command execution failed.
org.apache.commons.exec.ExecuteException: Process exited with an error: 1 (Exit value: 1)
	at org.apache.commons.exec.DefaultExecutor.executeInternal(DefaultExecutor.java:404)
	at org.apache.commons.exec.DefaultExecutor.execute(DefaultExecutor.java:166)
	at org.codehaus.mojo.exec.ExecMojo.executeCommandLine(ExecMojo.java:764)
	at org.codehaus.mojo.exec.ExecMojo.executeCommandLine(ExecMojo.java:711)
	at org.codehaus.mojo.exec.ExecMojo.execute(ExecMojo.java:289)
	at org.apache.maven.plugin.DefaultBuildPluginManager.executeMojo(DefaultBuildPluginManager.java:134)
	at org.apache.maven.lifecycle.internal.MojoExecutor.execute(MojoExecutor.java:208)
	at org.apache.maven.lifecycle.internal.MojoExecutor.execute(MojoExecutor.java:153)
	at org.apache.maven.lifecycle.internal.MojoExecutor.execute(MojoExecutor.java:145)
	at org.apache.maven.lifecycle.internal.LifecycleModuleBuilder.buildProject(LifecycleModuleBuilder.java:116)
	at org.apache.maven.lifecycle.internal.LifecycleModuleBuilder.buildProject(LifecycleModuleBuilder.java:80)
	at org.apache.maven.lifecycle.internal.builder.singlethreaded.SingleThreadedBuilder.build(SingleThreadedBuilder.java:51)
	at org.apache.maven.lifecycle.internal.LifecycleStarter.execute(LifecycleStarter.java:128)
	at org.apache.maven.DefaultMaven.doExecute(DefaultMaven.java:307)
	at org.apache.maven.DefaultMaven.doExecute(DefaultMaven.java:193)
	at org.apache.maven.DefaultMaven.execute(DefaultMaven.java:106)
	at org.jvnet.hudson.maven3.launcher.Maven33Launcher.main(Maven33Launcher.java:129)
	at sun.reflect.NativeMethodAccessorImpl.invoke0(Native Method)
	at sun.reflect.NativeMethodAccessorImpl.invoke(NativeMethodAccessorImpl.java:62)
	at sun.reflect.DelegatingMethodAccessorImpl.invoke(DelegatingMethodAccessorImpl.java:43)
	at java.lang.reflect.Method.invoke(Method.java:498)
	at org.codehaus.plexus.classworlds.launcher.Launcher.launchStandard(Launcher.java:330)
	at org.codehaus.plexus.classworlds.launcher.Launcher.launch(Launcher.java:238)
	at jenkins.maven3.agent.Maven33Main.launch(Maven33Main.java:176)
	at sun.reflect.NativeMethodAccessorImpl.invoke0(Native Method)
	at sun.reflect.NativeMethodAccessorImpl.invoke(NativeMethodAccessorImpl.java:62)
	at sun.reflect.DelegatingMethodAccessorImpl.invoke(DelegatingMethodAccessorImpl.java:43)
	at java.lang.reflect.Method.invoke(Method.java:498)
	at hudson.maven.Maven3Builder.call(Maven3Builder.java:139)
	at hudson.maven.Maven3Builder.call(Maven3Builder.java:70)
	at hudson.remoting.UserRequest.perform(UserRequest.java:153)
	at hudson.remoting.UserRequest.perform(UserRequest.java:50)
	at hudson.remoting.Request$2.run(Request.java:336)
	at hudson.remoting.InterceptingExecutorService$1.call(InterceptingExecutorService.java:68)
	at java.util.concurrent.FutureTask.run(FutureTask.java:266)
	at java.util.concurrent.ThreadPoolExecutor.runWorker(ThreadPoolExecutor.java:1149)
	at java.util.concurrent.ThreadPoolExecutor$Worker.run(ThreadPoolExecutor.java:624)
	at java.lang.Thread.run(Thread.java:748)
[JENKINS] Archiving disabled
2017-08-17T07:18:15.289 [INFO]                                                           
             
2017-08-17T07:18:15.289 [INFO] ------------------------------------------------------------------------
2017-08-17T07:18:15.289 [INFO] Skipping Apache Beam :: Parent
2017-08-17T07:18:15.289 [INFO] This project has been banned from the build due to previous
failures.
2017-08-17T07:18:15.289 [INFO] ------------------------------------------------------------------------
[JENKINS] Archiving disabled
[JENKINS] Archiving disabled
[JENKINS] Archiving disabled
[JENKINS] Archiving disabled
[JENKINS] Archiving disabled
[JENKINS] Archiving disabled
[JENKINS] Archiving disabled
[JENKINS] Archiving disabled
[JENKINS] Archiving disabled
[JENKINS] Archiving disabled
[JENKINS] Archiving disabled
[JENKINS] Archiving disabled
[JENKINS] Archiving disabled
[JENKINS] Archiving disabled
[JENKINS] Archiving disabled
[JENKINS] Archiving disabled
[JENKINS] Archiving disabled
[JENKINS] Archiving disabled
[JENKINS] Archiving disabled
[JENKINS] Archiving disabled
[JENKINS] Archiving disabled
[JENKINS] Archiving disabled
[JENKINS] Archiving disabled
[JENKINS] Archiving disabled
[JENKINS] Archiving disabled
[JENKINS] Archiving disabled
[JENKINS] Archiving disabled
[JENKINS] Archiving disabled
[JENKINS] Archiving disabled
[JENKINS] Archiving disabled
[JENKINS] Archiving disabled
[JENKINS] Archiving disabled
[JENKINS] Archiving disabled
[JENKINS] Archiving disabled
[JENKINS] Archiving disabled
[JENKINS] Archiving disabled
[JENKINS] Archiving disabled
[JENKINS] Archiving disabled
[JENKINS] Archiving disabled
[JENKINS] Archiving disabled
[JENKINS] Archiving disabled
[JENKINS] Archiving disabled
[JENKINS] Archiving disabled
[JENKINS] Archiving disabled
[JENKINS] Archiving disabled
[JENKINS] Archiving disabled
[JENKINS] Archiving disabled
[JENKINS] Archiving disabled
[JENKINS] Archiving disabled
[JENKINS] Archiving disabled
[JENKINS] Archiving disabled
[JENKINS] Archiving disabled
[JENKINS] Archiving disabled
[JENKINS] Archiving disabled
[JENKINS] Archiving disabled2017-08-17T07:19:01.084 [INFO] ------------------------------------------------------------------------
2017-08-17T07:19:01.084 [INFO] Reactor Summary:
2017-08-17T07:19:01.084 [INFO] 
2017-08-17T07:19:01.085 [INFO] Apache Beam :: Parent .............................. SUCCESS
[ 43.154 s]
2017-08-17T07:19:01.085 [INFO] Apache Beam :: SDKs :: Java :: Build Tools ......... SUCCESS
[ 15.067 s]
2017-08-17T07:19:01.085 [INFO] Apache Beam :: SDKs ................................ SUCCESS
[  5.294 s]

2017-08-17T07:19:01.085 [INFO] Apache Beam :: SDKs :: Common ...................... SUCCESS
[  2.800 s]
2017-08-17T07:19:01.085 [INFO] Apache Beam :: SDKs :: Common :: Runner API ........ SUCCESS
[ 33.037 s]
2017-08-17T07:19:01.085 [INFO] Apache Beam :: SDKs :: Common :: Fn API ............ SUCCESS
[ 17.345 s]
2017-08-17T07:19:01.085 [INFO] Apache Beam :: SDKs :: Java ........................ SUCCESS
[  3.058 s]
2017-08-17T07:19:01.085 [INFO] Apache Beam :: SDKs :: Java :: Core ................ SUCCESS
[02:27 min]
2017-08-17T07:19:01.085 [INFO] Apache Beam :: Runners ............................. SUCCESS
[  2.851 s]
2017-08-17T07:19:01.085 [INFO] Apache Beam :: Runners :: Core Construction Java ... SUCCESS
[ 52.206 s]
2017-08-17T07:19:01.085 [INFO] Apache Beam :: Runners :: Core Java ................ SUCCESS
[ 50.755 s]
2017-08-17T07:19:01.085 [INFO] Apache Beam :: Runners :: Direct Java .............. SUCCESS
[04:45 min]
2017-08-17T07:19:01.085 [INFO] Apache Beam :: SDKs :: Java :: IO .................. SUCCESS
[  3.180 s]
2017-08-17T07:19:01.085 [INFO] Apache Beam :: SDKs :: Java :: IO :: AMQP .......... SUCCESS
[ 41.194 s]
2017-08-17T07:19:01.085 [INFO] Apache Beam :: SDKs :: Java :: IO :: Common ........ SUCCESS
[  7.301 s]
2017-08-17T07:19:01.085 [INFO] Apache Beam :: SDKs :: Java :: IO :: Cassandra ..... SUCCESS
[ 44.661 s]
2017-08-17T07:19:01.085 [INFO] Apache Beam :: SDKs :: Java :: IO :: Elasticsearch . SUCCESS
[ 43.182 s]
2017-08-17T07:19:01.085 [INFO] Apache Beam :: SDKs :: Java :: Extensions .......... SUCCESS
[  3.144 s]
2017-08-17T07:19:01.085 [INFO] Apache Beam :: SDKs :: Java :: Extensions :: Google Cloud Platform
Core SUCCESS [ 31.723 s]
2017-08-17T07:19:01.085 [INFO] Apache Beam :: SDKs :: Java :: Extensions :: Protobuf SUCCESS
[ 24.659 s]
2017-08-17T07:19:01.085 [INFO] Apache Beam :: SDKs :: Java :: IO :: Google Cloud Platform
SUCCESS [01:41 min]
2017-08-17T07:19:01.085 [INFO] Apache Beam :: SDKs :: Java :: IO :: Hadoop Common . SUCCESS
[ 24.380 s]
2017-08-17T07:19:01.085 [INFO] Apache Beam :: SDKs :: Java :: IO :: Hadoop File System SUCCESS
[ 49.998 s]
2017-08-17T07:19:01.085 [INFO] Apache Beam :: SDKs :: Java :: IO :: Hadoop ........ SUCCESS
[  5.710 s]
2017-08-17T07:19:01.085 [INFO] Apache Beam :: SDKs :: Java :: IO :: Hadoop :: input-format
SUCCESS [ 43.375 s]
2017-08-17T07:19:01.085 [INFO] Apache Beam :: Runners :: Google Cloud Dataflow .... SUCCESS
[07:48 min]
2017-08-17T07:19:01.085 [INFO] Apache Beam :: SDKs :: Java :: IO :: Hadoop :: jdk1.8-tests
SUCCESS [01:38 min]
2017-08-17T07:19:01.085 [INFO] Apache Beam :: SDKs :: Java :: IO :: HBase ......... SUCCESS
[01:07 min]
2017-08-17T07:19:01.086 [INFO] Apache Beam :: SDKs :: Java :: IO :: HCatalog ...... SUCCESS
[01:24 min]
2017-08-17T07:19:01.086 [INFO] Apache Beam :: SDKs :: Java :: IO :: JDBC .......... SUCCESS
[ 47.330 s]
2017-08-17T07:19:01.086 [INFO] Apache Beam :: SDKs :: Java :: IO :: JMS ........... SUCCESS
[ 23.847 s]
2017-08-17T07:19:01.086 [INFO] Apache Beam :: SDKs :: Java :: IO :: Kafka ......... SUCCESS
[ 43.143 s]
2017-08-17T07:19:01.086 [INFO] Apache Beam :: SDKs :: Java :: IO :: Kinesis ....... SUCCESS
[ 29.536 s]
2017-08-17T07:19:01.086 [INFO] Apache Beam :: SDKs :: Java :: IO :: MongoDB ....... SUCCESS
[ 43.674 s]
2017-08-17T07:19:01.086 [INFO] Apache Beam :: SDKs :: Java :: IO :: MQTT .......... SUCCESS
[ 26.146 s]
2017-08-17T07:19:01.086 [INFO] Apache Beam :: SDKs :: Java :: IO :: Solr .......... SUCCESS
[ 52.752 s]
2017-08-17T07:19:01.086 [INFO] Apache Beam :: SDKs :: Java :: IO :: XML ........... SUCCESS
[ 34.039 s]
2017-08-17T07:19:01.086 [INFO] Apache Beam :: SDKs :: Java :: Maven Archetypes .... SUCCESS
[  2.497 s]
2017-08-17T07:19:01.086 [INFO] Apache Beam :: SDKs :: Java :: Maven Archetypes :: Starter
SUCCESS [ 15.906 s]
2017-08-17T07:19:01.086 [INFO] Apache Beam :: Examples ............................ SUCCESS
[  3.175 s]
2017-08-17T07:19:01.086 [INFO] Apache Beam :: Examples :: Java .................... SUCCESS
[07:33 min]
2017-08-17T07:19:01.086 [INFO] Apache Beam :: SDKs :: Java :: Maven Archetypes :: Examples
SUCCESS [ 40.594 s]
2017-08-17T07:19:01.086 [INFO] Apache Beam :: Examples :: Java 8 .................. SUCCESS
[ 47.306 s]
2017-08-17T07:19:01.086 [INFO] Apache Beam :: SDKs :: Java :: Maven Archetypes :: Examples
- Java 8 SUCCESS [ 44.305 s]
2017-08-17T07:19:01.086 [INFO] Apache Beam :: SDKs :: Java :: Extensions :: Jackson SUCCESS
[ 24.155 s]
2017-08-17T07:19:01.086 [INFO] Apache Beam :: SDKs :: Java :: Extensions :: Join library SUCCESS
[ 24.660 s]
2017-08-17T07:19:01.086 [INFO] Apache Beam :: SDKs :: Java :: Extensions :: Sorter  SUCCESS
[ 46.723 s]
2017-08-17T07:19:01.086 [INFO] Apache Beam :: SDKs :: Java :: Harness ............. SUCCESS
[ 43.353 s]
2017-08-17T07:19:01.086 [INFO] Apache Beam :: SDKs :: Java :: Java 8 Tests ........ SUCCESS
[ 22.601 s]
2017-08-17T07:19:01.086 [INFO] Apache Beam :: SDKs :: Python ...................... FAILURE
[27:30 min]
2017-08-17T07:19:01.086 [INFO] Apache Beam :: Runners :: Flink .................... SKIPPED
2017-08-17T07:19:01.086 [INFO] Apache Beam :: Runners :: Spark .................... SKIPPED
2017-08-17T07:19:01.086 [INFO] Apache Beam :: Runners :: Apex ..................... SKIPPED
2017-08-17T07:19:01.086 [INFO] Apache Beam :: Runners :: Gearpump ................. SKIPPED
2017-08-17T07:19:01.086 [INFO] Apache Beam :: SDKs :: Java :: Aggregated Javadoc .. SKIPPED
2017-08-17T07:19:01.086 [INFO] ------------------------------------------------------------------------
2017-08-17T07:19:01.086 [INFO] BUILD FAILURE
2017-08-17T07:19:01.086 [INFO] ------------------------------------------------------------------------
2017-08-17T07:19:01.086 [INFO] Total time: 01:17 h
2017-08-17T07:19:01.086 [INFO] Finished at: 2017-08-17T07:19:01+00:00
2017-08-17T07:19:01.790 [INFO] Final Memory: 278M/1986M
2017-08-17T07:19:01.790 [INFO] ------------------------------------------------------------------------
2017-08-17T07:19:01.797 [ERROR] Failed to execute goal org.codehaus.mojo:exec-maven-plugin:1.5.0:exec
(setuptools-test) on project beam-sdks-python: Command execution failed. Process exited with
an error: 1 (Exit value: 1) -> [Help 1]
org.apache.maven.lifecycle.LifecycleExecutionException: Failed to execute goal org.codehaus.mojo:exec-maven-plugin:1.5.0:exec
(setuptools-test) on project beam-sdks-python: Command execution failed.
	at org.apache.maven.lifecycle.internal.MojoExecutor.execute(MojoExecutor.java:216)
	at org.apache.maven.lifecycle.internal.MojoExecutor.execute(MojoExecutor.java:153)
	at org.apache.maven.lifecycle.internal.MojoExecutor.execute(MojoExecutor.java:145)
	at org.apache.maven.lifecycle.internal.LifecycleModuleBuilder.buildProject(LifecycleModuleBuilder.java:116)
	at org.apache.maven.lifecycle.internal.LifecycleModuleBuilder.buildProject(LifecycleModuleBuilder.java:80)
	at org.apache.maven.lifecycle.internal.builder.singlethreaded.SingleThreadedBuilder.build(SingleThreadedBuilder.java:51)
	at org.apache.maven.lifecycle.internal.LifecycleStarter.execute(LifecycleStarter.java:128)
	at org.apache.maven.DefaultMaven.doExecute(DefaultMaven.java:307)
	at org.apache.maven.DefaultMaven.doExecute(DefaultMaven.java:193)
	at org.apache.maven.DefaultMaven.execute(DefaultMaven.java:106)
	at org.jvnet.hudson.maven3.launcher.Maven33Launcher.main(Maven33Launcher.java:129)
	at sun.reflect.NativeMethodAccessorImpl.invoke0(Native Method)
	at sun.reflect.NativeMethodAccessorImpl.invoke(NativeMethodAccessorImpl.java:62)
	at sun.reflect.DelegatingMethodAccessorImpl.invoke(DelegatingMethodAccessorImpl.java:43)
	at java.lang.reflect.Method.invoke(Method.java:498)
	at org.codehaus.plexus.classworlds.launcher.Launcher.launchStandard(Launcher.java:330)
	at org.codehaus.plexus.classworlds.launcher.Launcher.launch(Launcher.java:238)
	at jenkins.maven3.agent.Maven33Main.launch(Maven33Main.java:176)
	at sun.reflect.NativeMethodAccessorImpl.invoke0(Native Method)
	at sun.reflect.NativeMethodAccessorImpl.invoke(NativeMethodAccessorImpl.java:62)
	at sun.reflect.DelegatingMethodAccessorImpl.invoke(DelegatingMethodAccessorImpl.java:43)
	at java.lang.reflect.Method.invoke(Method.java:498)
	at hudson.maven.Maven3Builder.call(Maven3Builder.java:139)
	at hudson.maven.Maven3Builder.call(Maven3Builder.java:70)
	at hudson.remoting.UserRequest.perform(UserRequest.java:153)
	at hudson.remoting.UserRequest.perform(UserRequest.java:50)
	at hudson.remoting.Request$2.run(Request.java:336)
	at hudson.remoting.InterceptingExecutorService$1.call(InterceptingExecutorService.java:68)
	at java.util.concurrent.FutureTask.run(FutureTask.java:266)
	at java.util.concurrent.ThreadPoolExecutor.runWorker(ThreadPoolExecutor.java:1149)
	at java.util.concurrent.ThreadPoolExecutor$Worker.run(ThreadPoolExecutor.java:624)
	at java.lang.Thread.run(Thread.java:748)
Caused by: org.apache.maven.plugin.MojoExecutionException: Command execution failed.
	at org.codehaus.mojo.exec.ExecMojo.execute(ExecMojo.java:302)
	at org.apache.maven.plugin.DefaultBuildPluginManager.executeMojo(DefaultBuildPluginManager.java:134)
	at org.apache.maven.lifecycle.internal.MojoExecutor.execute(MojoExecutor.java:208)
	... 31 more
Caused by: org.apache.commons.exec.ExecuteException: Process exited with an error: 1 (Exit
value: 1)
	at org.apache.commons.exec.DefaultExecutor.executeInternal(DefaultExecutor.java:404)
	at org.apache.commons.exec.DefaultExecutor.execute(DefaultExecutor.java:166)
	at org.codehaus.mojo.exec.ExecMojo.executeCommandLine(ExecMojo.java:764)
	at org.codehaus.mojo.exec.ExecMojo.executeCommandLine(ExecMojo.java:711)
	at org.codehaus.mojo.exec.ExecMojo.execute(ExecMojo.java:289)
	... 33 more
2017-08-17T07:19:01.798 [ERROR] 
2017-08-17T07:19:01.798 [ERROR] Re-run Maven using the -X switch to enable full debug logging.
2017-08-17T07:19:01.798 [ERROR] 
2017-08-17T07:19:01.798 [ERROR] For more information about the errors and possible solutions,
please read the following articles:
2017-08-17T07:19:01.798 [ERROR] [Help 1] http://cwiki.apache.org/confluence/display/MAVEN/MojoExecutionException
2017-08-17T07:19:01.799 [ERROR] 
2017-08-17T07:19:01.799 [ERROR] After correcting the problems, you can resume the build with
the command
2017-08-17T07:19:01.799 [ERROR]   mvn <goals> -rf :beam-sdks-python
channel stopped

Mime
View raw message