beam-commits mailing list archives

Site index · List index
Message view « Date » · « Thread »
Top « Date » · « Thread »
From Apache Jenkins Server <jenk...@builds.apache.org>
Subject Build failed in Jenkins: beam_PostCommit_Java_MavenInstall #4538
Date Wed, 09 Aug 2017 06:02:25 GMT
See <https://builds.apache.org/job/beam_PostCommit_Java_MavenInstall/4538/display/redirect>

------------------------------------------
[...truncated 49.89 KB...]
2017-08-09T06:01:44.687 [INFO] Downloaded: https://repo.maven.apache.org/maven2/org/apache/maven/plugins/maven-project-info-reports-plugin/2.9/maven-project-info-reports-plugin-2.9.jar
(297 KB at 6041.2 KB/sec)
2017-08-09T06:01:44.693 [INFO] Downloading: https://repo.maven.apache.org/maven2/org/eclipse/m2e/lifecycle-mapping/1.0.0/lifecycle-mapping-1.0.0.pom
2017-08-09T06:01:44.706 [WARNING] The POM for org.eclipse.m2e:lifecycle-mapping:jar:1.0.0
is missing, no dependency information available
2017-08-09T06:01:44.707 [INFO] Downloading: https://repo.maven.apache.org/maven2/org/eclipse/m2e/lifecycle-mapping/1.0.0/lifecycle-mapping-1.0.0.jar
2017-08-09T06:01:44.722 [WARNING] Failed to retrieve plugin descriptor for org.eclipse.m2e:lifecycle-mapping:1.0.0:
Plugin org.eclipse.m2e:lifecycle-mapping:1.0.0 or one of its dependencies could not be resolved:
Could not find artifact org.eclipse.m2e:lifecycle-mapping:jar:1.0.0 in central (https://repo.maven.apache.org/maven2)
2017-08-09T06:01:44.723 [INFO] Downloading: https://repo.maven.apache.org/maven2/org/apache/avro/avro-maven-plugin/1.8.2/avro-maven-plugin-1.8.2.pom
[INFO] I/O exception (java.net.SocketException) caught when processing request to {s}->https://repo.maven.apache.org:443:
Connection reset
[INFO] Retrying request to {s}->https://repo.maven.apache.org:443
2017-08-09T06:01:44.770 [INFO] Downloaded: https://repo.maven.apache.org/maven2/org/apache/avro/avro-maven-plugin/1.8.2/avro-maven-plugin-1.8.2.pom
(4 KB at 72.1 KB/sec)
2017-08-09T06:01:44.771 [INFO] Downloading: https://repo.maven.apache.org/maven2/org/apache/avro/avro-parent/1.8.2/avro-parent-1.8.2.pom
2017-08-09T06:01:44.804 [INFO] Downloaded: https://repo.maven.apache.org/maven2/org/apache/avro/avro-parent/1.8.2/avro-parent-1.8.2.pom
(21 KB at 633.6 KB/sec)
2017-08-09T06:01:44.806 [INFO] Downloading: https://repo.maven.apache.org/maven2/org/apache/avro/avro-toplevel/1.8.2/avro-toplevel-1.8.2.pom
2017-08-09T06:01:44.837 [INFO] Downloaded: https://repo.maven.apache.org/maven2/org/apache/avro/avro-toplevel/1.8.2/avro-toplevel-1.8.2.pom
(16 KB at 493.0 KB/sec)
2017-08-09T06:01:44.839 [INFO] Downloading: https://repo.maven.apache.org/maven2/org/apache/apache/10/apache-10.pom
2017-08-09T06:01:44.867 [INFO] Downloaded: https://repo.maven.apache.org/maven2/org/apache/apache/10/apache-10.pom
(15 KB at 516.1 KB/sec)
2017-08-09T06:01:44.871 [INFO] Downloading: https://repo.maven.apache.org/maven2/org/apache/avro/avro-maven-plugin/1.8.2/avro-maven-plugin-1.8.2.jar
2017-08-09T06:01:44.902 [INFO] Downloaded: https://repo.maven.apache.org/maven2/org/apache/avro/avro-maven-plugin/1.8.2/avro-maven-plugin-1.8.2.jar
(27 KB at 838.6 KB/sec)
2017-08-09T06:01:44.905 [INFO] Downloading: https://repo.maven.apache.org/maven2/org/apache/maven/plugins/maven-release-plugin/2.5.3/maven-release-plugin-2.5.3.pom
2017-08-09T06:01:44.933 [INFO] Downloaded: https://repo.maven.apache.org/maven2/org/apache/maven/plugins/maven-release-plugin/2.5.3/maven-release-plugin-2.5.3.pom
(11 KB at 386.5 KB/sec)
2017-08-09T06:01:44.935 [INFO] Downloading: https://repo.maven.apache.org/maven2/org/apache/maven/release/maven-release/2.5.3/maven-release-2.5.3.pom
2017-08-09T06:01:44.962 [INFO] Downloaded: https://repo.maven.apache.org/maven2/org/apache/maven/release/maven-release/2.5.3/maven-release-2.5.3.pom
(5 KB at 181.6 KB/sec)
2017-08-09T06:01:44.966 [INFO] Downloading: https://repo.maven.apache.org/maven2/org/apache/maven/plugins/maven-release-plugin/2.5.3/maven-release-plugin-2.5.3.jar
2017-08-09T06:01:45.005 [INFO] Downloaded: https://repo.maven.apache.org/maven2/org/apache/maven/plugins/maven-release-plugin/2.5.3/maven-release-plugin-2.5.3.jar
(52 KB at 1327.3 KB/sec)
2017-08-09T06:01:45.013 [INFO] Downloading: https://repo.maven.apache.org/maven2/org/apache/maven/plugins/maven-scm-plugin/1.9.4/maven-scm-plugin-1.9.4.pom
2017-08-09T06:01:45.040 [INFO] Downloaded: https://repo.maven.apache.org/maven2/org/apache/maven/plugins/maven-scm-plugin/1.9.4/maven-scm-plugin-1.9.4.pom
(7 KB at 251.3 KB/sec)
2017-08-09T06:01:45.043 [INFO] Downloading: https://repo.maven.apache.org/maven2/org/apache/maven/scm/maven-scm/1.9.4/maven-scm-1.9.4.pom
2017-08-09T06:01:45.074 [INFO] Downloaded: https://repo.maven.apache.org/maven2/org/apache/maven/scm/maven-scm/1.9.4/maven-scm-1.9.4.pom
(22 KB at 696.5 KB/sec)
2017-08-09T06:01:45.078 [INFO] Downloading: https://repo.maven.apache.org/maven2/org/apache/maven/plugins/maven-scm-plugin/1.9.4/maven-scm-plugin-1.9.4.jar
2017-08-09T06:01:45.118 [INFO] Downloaded: https://repo.maven.apache.org/maven2/org/apache/maven/plugins/maven-scm-plugin/1.9.4/maven-scm-plugin-1.9.4.jar
(62 KB at 1539.9 KB/sec)
2017-08-09T06:01:45.125 [INFO] Downloading: https://repo.maven.apache.org/maven2/org/apache/maven/plugins/maven-scm-publish-plugin/1.1/maven-scm-publish-plugin-1.1.pom
2017-08-09T06:01:45.153 [INFO] Downloaded: https://repo.maven.apache.org/maven2/org/apache/maven/plugins/maven-scm-publish-plugin/1.1/maven-scm-publish-plugin-1.1.pom
(7 KB at 232.5 KB/sec)
2017-08-09T06:01:45.156 [INFO] Downloading: https://repo.maven.apache.org/maven2/org/apache/maven/plugins/maven-scm-publish-plugin/1.1/maven-scm-publish-plugin-1.1.jar
2017-08-09T06:01:45.190 [INFO] Downloaded: https://repo.maven.apache.org/maven2/org/apache/maven/plugins/maven-scm-publish-plugin/1.1/maven-scm-publish-plugin-1.1.jar
(37 KB at 1084.7 KB/sec)
2017-08-09T06:01:45.195 [WARNING] Failed to retrieve plugin descriptor for org.apache.maven.plugins:maven-site-plugin:3.5.1:
Plugin org.apache.maven.plugins:maven-site-plugin:3.5.1 or one of its dependencies could not
be resolved: Failure to transfer org.apache.maven.plugins:maven-site-plugin:jar:3.5.1 from
https://repo.maven.apache.org/maven2 was cached in the local repository, resolution will not
be reattempted until the update interval of central has elapsed or updates are forced. Original
error: Could not transfer artifact org.apache.maven.plugins:maven-site-plugin:jar:3.5.1 from/to
central (https://repo.maven.apache.org/maven2): GET request of: org/apache/maven/plugins/maven-site-plugin/3.5.1/maven-site-plugin-3.5.1.jar
from central failed
2017-08-09T06:01:45.196 [INFO] Downloading: https://repo.maven.apache.org/maven2/org/codehaus/mojo/versions-maven-plugin/2.3/versions-maven-plugin-2.3.pom
2017-08-09T06:01:45.225 [INFO] Downloaded: https://repo.maven.apache.org/maven2/org/codehaus/mojo/versions-maven-plugin/2.3/versions-maven-plugin-2.3.pom
(16 KB at 543.2 KB/sec)
2017-08-09T06:01:45.228 [INFO] Downloading: https://repo.maven.apache.org/maven2/org/codehaus/mojo/mojo-parent/39/mojo-parent-39.pom
2017-08-09T06:01:45.260 [INFO] Downloaded: https://repo.maven.apache.org/maven2/org/codehaus/mojo/mojo-parent/39/mojo-parent-39.pom
(34 KB at 1033.4 KB/sec)
2017-08-09T06:01:45.266 [INFO] Downloading: https://repo.maven.apache.org/maven2/org/codehaus/mojo/versions-maven-plugin/2.3/versions-maven-plugin-2.3.jar
2017-08-09T06:01:45.341 [INFO] Downloaded: https://repo.maven.apache.org/maven2/org/codehaus/mojo/versions-maven-plugin/2.3/versions-maven-plugin-2.3.jar
(257 KB at 3424.0 KB/sec)
2017-08-09T06:01:45.352 [INFO] Downloading: https://repo.maven.apache.org/maven2/org/codehaus/mojo/exec-maven-plugin/1.5.0/exec-maven-plugin-1.5.0.pom
2017-08-09T06:01:45.383 [INFO] Downloaded: https://repo.maven.apache.org/maven2/org/codehaus/mojo/exec-maven-plugin/1.5.0/exec-maven-plugin-1.5.0.pom
(13 KB at 388.2 KB/sec)
2017-08-09T06:01:45.386 [INFO] Downloading: https://repo.maven.apache.org/maven2/org/codehaus/mojo/mojo-parent/38/mojo-parent-38.pom
2017-08-09T06:01:45.418 [INFO] Downloaded: https://repo.maven.apache.org/maven2/org/codehaus/mojo/mojo-parent/38/mojo-parent-38.pom
(33 KB at 1009.4 KB/sec)
2017-08-09T06:01:45.423 [INFO] Downloading: https://repo.maven.apache.org/maven2/org/codehaus/mojo/exec-maven-plugin/1.5.0/exec-maven-plugin-1.5.0.jar
2017-08-09T06:01:45.459 [INFO] Downloaded: https://repo.maven.apache.org/maven2/org/codehaus/mojo/exec-maven-plugin/1.5.0/exec-maven-plugin-1.5.0.jar
(53 KB at 1445.9 KB/sec)
2017-08-09T06:01:45.462 [INFO] Downloading: https://repo.maven.apache.org/maven2/org/jacoco/jacoco-maven-plugin/0.7.8/jacoco-maven-plugin-0.7.8.pom
2017-08-09T06:01:45.489 [INFO] Downloaded: https://repo.maven.apache.org/maven2/org/jacoco/jacoco-maven-plugin/0.7.8/jacoco-maven-plugin-0.7.8.pom
(5 KB at 161.1 KB/sec)
2017-08-09T06:01:45.491 [INFO] Downloading: https://repo.maven.apache.org/maven2/org/jacoco/org.jacoco.build/0.7.8/org.jacoco.build-0.7.8.pom
2017-08-09T06:01:45.523 [INFO] Downloaded: https://repo.maven.apache.org/maven2/org/jacoco/org.jacoco.build/0.7.8/org.jacoco.build-0.7.8.pom
(35 KB at 1086.5 KB/sec)
2017-08-09T06:01:45.527 [INFO] Downloading: https://repo.maven.apache.org/maven2/org/jacoco/jacoco-maven-plugin/0.7.8/jacoco-maven-plugin-0.7.8.jar
2017-08-09T06:01:45.563 [INFO] Downloaded: https://repo.maven.apache.org/maven2/org/jacoco/jacoco-maven-plugin/0.7.8/jacoco-maven-plugin-0.7.8.jar
(52 KB at 1440.9 KB/sec)
2017-08-09T06:01:45.567 [INFO] Downloading: https://repo.maven.apache.org/maven2/org/eluder/coveralls/coveralls-maven-plugin/4.3.0/coveralls-maven-plugin-4.3.0.pom
2017-08-09T06:01:45.595 [INFO] Downloaded: https://repo.maven.apache.org/maven2/org/eluder/coveralls/coveralls-maven-plugin/4.3.0/coveralls-maven-plugin-4.3.0.pom
(11 KB at 362.6 KB/sec)
2017-08-09T06:01:45.597 [INFO] Downloading: https://repo.maven.apache.org/maven2/org/eluder/eluder-parent/8/eluder-parent-8.pom
2017-08-09T06:01:45.626 [INFO] Downloaded: https://repo.maven.apache.org/maven2/org/eluder/eluder-parent/8/eluder-parent-8.pom
(15 KB at 509.4 KB/sec)
2017-08-09T06:01:45.629 [INFO] Downloading: https://repo.maven.apache.org/maven2/org/eluder/coveralls/coveralls-maven-plugin/4.3.0/coveralls-maven-plugin-4.3.0.jar
2017-08-09T06:01:45.669 [INFO] Downloaded: https://repo.maven.apache.org/maven2/org/eluder/coveralls/coveralls-maven-plugin/4.3.0/coveralls-maven-plugin-4.3.0.jar
(88 KB at 2185.5 KB/sec)
2017-08-09T06:01:46.390 [INFO]                                                           
             
2017-08-09T06:01:46.390 [INFO] ------------------------------------------------------------------------
2017-08-09T06:01:46.390 [INFO] Building Apache Beam :: Parent 2.2.0-SNAPSHOT
2017-08-09T06:01:46.390 [INFO] ------------------------------------------------------------------------
[JENKINS] Archiving disabled
2017-08-09T06:01:49.635 [INFO]                                                           
             
2017-08-09T06:01:49.635 [INFO] ------------------------------------------------------------------------
2017-08-09T06:01:49.635 [INFO] Skipping Apache Beam :: Parent
2017-08-09T06:01:49.635 [INFO] This project has been banned from the build due to previous
failures.
2017-08-09T06:01:49.635 [INFO] ------------------------------------------------------------------------
[JENKINS] Archiving disabled
[JENKINS] Archiving disabled
[JENKINS] Archiving disabled
[JENKINS] Archiving disabled
[JENKINS] Archiving disabled
[JENKINS] Archiving disabled
[JENKINS] Archiving disabled
[JENKINS] Archiving disabled
[JENKINS] Archiving disabled
[JENKINS] Archiving disabled
[JENKINS] Archiving disabled
[JENKINS] Archiving disabled
[JENKINS] Archiving disabled
[JENKINS] Archiving disabled
[JENKINS] Archiving disabled
[JENKINS] Archiving disabled
[JENKINS] Archiving disabled
[JENKINS] Archiving disabled
[JENKINS] Archiving disabled
[JENKINS] Archiving disabled
[JENKINS] Archiving disabled
[JENKINS] Archiving disabled
[JENKINS] Archiving disabled
[JENKINS] Archiving disabled
[JENKINS] Archiving disabled
[JENKINS] Archiving disabled
[JENKINS] Archiving disabled
[JENKINS] Archiving disabled
[JENKINS] Archiving disabled
[JENKINS] Archiving disabled
[JENKINS] Archiving disabled
[JENKINS] Archiving disabled
[JENKINS] Archiving disabled
[JENKINS] Archiving disabled
[JENKINS] Archiving disabled
[JENKINS] Archiving disabled
[JENKINS] Archiving disabled
[JENKINS] Archiving disabled
[JENKINS] Archiving disabled
[JENKINS] Archiving disabled
[JENKINS] Archiving disabled
[JENKINS] Archiving disabled
[JENKINS] Archiving disabled
[JENKINS] Archiving disabled
[JENKINS] Archiving disabled
[JENKINS] Archiving disabled
[JENKINS] Archiving disabled
[JENKINS] Archiving disabled
[JENKINS] Archiving disabled
[JENKINS] Archiving disabled
[JENKINS] Archiving disabled
[JENKINS] Archiving disabled
[JENKINS] Archiving disabled
[JENKINS] Archiving disabled
[JENKINS] Archiving disabled
2017-08-09T06:02:09.692 [INFO] ------------------------------------------------------------------------
2017-08-09T06:02:09.692 [INFO] Reactor Summary:
2017-08-09T06:02:09.692 [INFO] 
2017-08-09T06:02:09.692 [INFO] Apache Beam :: Parent .............................. FAILURE
[  0.698 s]
2017-08-09T06:02:09.692 [INFO] Apache Beam :: SDKs :: Java :: Build Tools ......... SKIPPED
2017-08-09T06:02:09.692 [INFO] Apache Beam :: SDKs ................................ SKIPPED
2017-08-09T06:02:09.692 [INFO] Apache Beam :: SDKs :: Common ...................... SKIPPED
2017-08-09T06:02:09.692 [INFO] Apache Beam :: SDKs :: Common :: Runner API ........ SKIPPED
2017-08-09T06:02:09.692 [INFO] Apache Beam :: SDKs :: Common :: Fn API ............ SKIPPED
2017-08-09T06:02:09.692 [INFO] Apache Beam :: SDKs :: Java ........................ SKIPPED
2017-08-09T06:02:09.692 [INFO] Apache Beam :: SDKs :: Java :: Core ................ SKIPPED
2017-08-09T06:02:09.692 [INFO] Apache Beam :: Runners ............................. SKIPPED
2017-08-09T06:02:09.692 [INFO] Apache Beam :: Runners :: Core Construction Java ... SKIPPED
2017-08-09T06:02:09.692 [INFO] Apache Beam :: Runners :: Core Java ................ SKIPPED
2017-08-09T06:02:09.692 [INFO] Apache Beam :: Runners :: Direct Java .............. SKIPPED
2017-08-09T06:02:09.692 [INFO] Apache Beam :: SDKs :: Java :: IO .................. SKIPPED
2017-08-09T06:02:09.692 [INFO] Apache Beam :: SDKs :: Java :: IO :: AMQP .......... SKIPPED
2017-08-09T06:02:09.692 [INFO] Apache Beam :: SDKs :: Java :: IO :: Common ........ SKIPPED
2017-08-09T06:02:09.692 [INFO] Apache Beam :: SDKs :: Java :: IO :: Cassandra ..... SKIPPED
2017-08-09T06:02:09.692 [INFO] Apache Beam :: SDKs :: Java :: IO :: Elasticsearch . SKIPPED
2017-08-09T06:02:09.692 [INFO] Apache Beam :: SDKs :: Java :: Extensions .......... SKIPPED
2017-08-09T06:02:09.692 [INFO] Apache Beam :: SDKs :: Java :: Extensions :: Google Cloud Platform
Core SKIPPED
2017-08-09T06:02:09.692 [INFO] Apache Beam :: SDKs :: Java :: Extensions :: Protobuf SKIPPED
2017-08-09T06:02:09.693 [INFO] Apache Beam :: SDKs :: Java :: IO :: Google Cloud Platform
SKIPPED
2017-08-09T06:02:09.693 [INFO] Apache Beam :: SDKs :: Java :: IO :: Hadoop Common . SKIPPED
2017-08-09T06:02:09.693 [INFO] Apache Beam :: SDKs :: Java :: IO :: Hadoop File System SKIPPED
2017-08-09T06:02:09.693 [INFO] Apache Beam :: SDKs :: Java :: IO :: Hadoop ........ SKIPPED
2017-08-09T06:02:09.693 [INFO] Apache Beam :: SDKs :: Java :: IO :: Hadoop :: input-format
SKIPPED
2017-08-09T06:02:09.693 [INFO] Apache Beam :: Runners :: Google Cloud Dataflow .... SKIPPED
2017-08-09T06:02:09.693 [INFO] Apache Beam :: SDKs :: Java :: IO :: Hadoop :: jdk1.8-tests
SKIPPED
2017-08-09T06:02:09.693 [INFO] Apache Beam :: SDKs :: Java :: IO :: HBase ......... SKIPPED
2017-08-09T06:02:09.693 [INFO] Apache Beam :: SDKs :: Java :: IO :: HCatalog ...... SKIPPED
2017-08-09T06:02:09.693 [INFO] Apache Beam :: SDKs :: Java :: IO :: JDBC .......... SKIPPED
2017-08-09T06:02:09.693 [INFO] Apache Beam :: SDKs :: Java :: IO :: JMS ........... SKIPPED
2017-08-09T06:02:09.693 [INFO] Apache Beam :: SDKs :: Java :: IO :: Kafka ......... SKIPPED
2017-08-09T06:02:09.693 [INFO] Apache Beam :: SDKs :: Java :: IO :: Kinesis ....... SKIPPED
2017-08-09T06:02:09.693 [INFO] Apache Beam :: SDKs :: Java :: IO :: MongoDB ....... SKIPPED
2017-08-09T06:02:09.693 [INFO] Apache Beam :: SDKs :: Java :: IO :: MQTT .......... SKIPPED
2017-08-09T06:02:09.693 [INFO] Apache Beam :: SDKs :: Java :: IO :: Solr .......... SKIPPED
2017-08-09T06:02:09.693 [INFO] Apache Beam :: SDKs :: Java :: IO :: XML ........... SKIPPED
2017-08-09T06:02:09.693 [INFO] Apache Beam :: SDKs :: Java :: Maven Archetypes .... SKIPPED
2017-08-09T06:02:09.693 [INFO] Apache Beam :: SDKs :: Java :: Maven Archetypes :: Starter
SKIPPED
2017-08-09T06:02:09.693 [INFO] Apache Beam :: Examples ............................ SKIPPED
2017-08-09T06:02:09.693 [INFO] Apache Beam :: Examples :: Java .................... SKIPPED
2017-08-09T06:02:09.693 [INFO] Apache Beam :: SDKs :: Java :: Maven Archetypes :: Examples
SKIPPED
2017-08-09T06:02:09.693 [INFO] Apache Beam :: Examples :: Java 8 .................. SKIPPED
2017-08-09T06:02:09.693 [INFO] Apache Beam :: SDKs :: Java :: Maven Archetypes :: Examples
- Java 8 SKIPPED
2017-08-09T06:02:09.693 [INFO] Apache Beam :: SDKs :: Java :: Extensions :: Jackson SKIPPED
2017-08-09T06:02:09.693 [INFO] Apache Beam :: SDKs :: Java :: Extensions :: Join library SKIPPED
2017-08-09T06:02:09.693 [INFO] Apache Beam :: SDKs :: Java :: Extensions :: Sorter  SKIPPED
2017-08-09T06:02:09.693 [INFO] Apache Beam :: SDKs :: Java :: Harness ............. SKIPPED
2017-08-09T06:02:09.693 [INFO] Apache Beam :: SDKs :: Java :: Java 8 Tests ........ SKIPPED
2017-08-09T06:02:09.693 [INFO] Apache Beam :: SDKs :: Python ...................... SKIPPED
2017-08-09T06:02:09.693 [INFO] Apache Beam :: Runners :: Flink .................... SKIPPED
2017-08-09T06:02:09.693 [INFO] Apache Beam :: Runners :: Spark .................... SKIPPED
2017-08-09T06:02:09.693 [INFO] Apache Beam :: Runners :: Apex ..................... SKIPPED
2017-08-09T06:02:09.693 [INFO] Apache Beam :: Runners :: Gearpump ................. SKIPPED
2017-08-09T06:02:09.693 [INFO] Apache Beam :: SDKs :: Java :: Aggregated Javadoc .. SKIPPED
2017-08-09T06:02:09.693 [INFO] ------------------------------------------------------------------------
2017-08-09T06:02:09.693 [INFO] BUILD FAILURE
2017-08-09T06:02:09.693 [INFO] ------------------------------------------------------------------------
2017-08-09T06:02:09.693 [INFO] Total time: 32.682 s
2017-08-09T06:02:09.693 [INFO] Finished at: 2017-08-09T06:02:09+00:00
2017-08-09T06:02:10.043 [INFO] Final Memory: 53M/387M
2017-08-09T06:02:10.043 [INFO] ------------------------------------------------------------------------
2017-08-09T06:02:10.048 [ERROR] Plugin org.apache.maven.plugins:maven-site-plugin:3.5.1 or
one of its dependencies could not be resolved: Failure to transfer org.apache.maven.plugins:maven-site-plugin:jar:3.5.1
from https://repo.maven.apache.org/maven2 was cached in the local repository, resolution will
not be reattempted until the update interval of central has elapsed or updates are forced.
Original error: Could not transfer artifact org.apache.maven.plugins:maven-site-plugin:jar:3.5.1
from/to central (https://repo.maven.apache.org/maven2): GET request of: org/apache/maven/plugins/maven-site-plugin/3.5.1/maven-site-plugin-3.5.1.jar
from central failed -> [Help 1]
org.apache.maven.plugin.PluginResolutionException: Plugin org.apache.maven.plugins:maven-site-plugin:3.5.1
or one of its dependencies could not be resolved: Failure to transfer org.apache.maven.plugins:maven-site-plugin:jar:3.5.1
from https://repo.maven.apache.org/maven2 was cached in the local repository, resolution will
not be reattempted until the update interval of central has elapsed or updates are forced.
Original error: Could not transfer artifact org.apache.maven.plugins:maven-site-plugin:jar:3.5.1
from/to central (https://repo.maven.apache.org/maven2): GET request of: org/apache/maven/plugins/maven-site-plugin/3.5.1/maven-site-plugin-3.5.1.jar
from central failed
	at org.apache.maven.plugin.internal.DefaultPluginDependenciesResolver.resolve(DefaultPluginDependenciesResolver.java:128)
	at org.apache.maven.plugin.internal.DefaultMavenPluginManager.getPluginDescriptor(DefaultMavenPluginManager.java:179)
	at org.apache.maven.plugin.internal.DefaultMavenPluginManager.getMojoDescriptor(DefaultMavenPluginManager.java:298)
	at org.apache.maven.plugin.DefaultBuildPluginManager.getMojoDescriptor(DefaultBuildPluginManager.java:241)
	at org.apache.maven.lifecycle.internal.DefaultLifecycleMappingDelegate.calculateLifecycleMappings(DefaultLifecycleMappingDelegate.java:110)
	at org.apache.maven.lifecycle.internal.DefaultLifecycleExecutionPlanCalculator.calculateLifecycleMappings(DefaultLifecycleExecutionPlanCalculator.java:266)
	at org.apache.maven.lifecycle.internal.DefaultLifecycleExecutionPlanCalculator.calculateMojoExecutions(DefaultLifecycleExecutionPlanCalculator.java:217)
	at org.apache.maven.lifecycle.internal.DefaultLifecycleExecutionPlanCalculator.calculateExecutionPlan(DefaultLifecycleExecutionPlanCalculator.java:127)
	at org.apache.maven.lifecycle.internal.DefaultLifecycleExecutionPlanCalculator.calculateExecutionPlan(DefaultLifecycleExecutionPlanCalculator.java:145)
	at org.apache.maven.lifecycle.internal.builder.BuilderCommon.resolveBuildPlan(BuilderCommon.java:96)
	at org.apache.maven.lifecycle.internal.LifecycleModuleBuilder.buildProject(LifecycleModuleBuilder.java:109)
	at org.apache.maven.lifecycle.internal.LifecycleModuleBuilder.buildProject(LifecycleModuleBuilder.java:80)
	at org.apache.maven.lifecycle.internal.builder.singlethreaded.SingleThreadedBuilder.build(SingleThreadedBuilder.java:51)
	at org.apache.maven.lifecycle.internal.LifecycleStarter.execute(LifecycleStarter.java:128)
	at org.apache.maven.DefaultMaven.doExecute(DefaultMaven.java:307)
	at org.apache.maven.DefaultMaven.doExecute(DefaultMaven.java:193)
	at org.apache.maven.DefaultMaven.execute(DefaultMaven.java:106)
	at org.jvnet.hudson.maven3.launcher.Maven33Launcher.main(Maven33Launcher.java:129)
	at sun.reflect.NativeMethodAccessorImpl.invoke0(Native Method)
	at sun.reflect.NativeMethodAccessorImpl.invoke(NativeMethodAccessorImpl.java:62)
	at sun.reflect.DelegatingMethodAccessorImpl.invoke(DelegatingMethodAccessorImpl.java:43)
	at java.lang.reflect.Method.invoke(Method.java:498)
	at org.codehaus.plexus.classworlds.launcher.Launcher.launchStandard(Launcher.java:330)
	at org.codehaus.plexus.classworlds.launcher.Launcher.launch(Launcher.java:238)
	at jenkins.maven3.agent.Maven33Main.launch(Maven33Main.java:176)
	at sun.reflect.NativeMethodAccessorImpl.invoke0(Native Method)
	at sun.reflect.NativeMethodAccessorImpl.invoke(NativeMethodAccessorImpl.java:62)
	at sun.reflect.DelegatingMethodAccessorImpl.invoke(DelegatingMethodAccessorImpl.java:43)
	at java.lang.reflect.Method.invoke(Method.java:498)
	at hudson.maven.Maven3Builder.call(Maven3Builder.java:139)
	at hudson.maven.Maven3Builder.call(Maven3Builder.java:70)
	at hudson.remoting.UserRequest.perform(UserRequest.java:153)
	at hudson.remoting.UserRequest.perform(UserRequest.java:50)
	at hudson.remoting.Request$2.run(Request.java:336)
	at hudson.remoting.InterceptingExecutorService$1.call(InterceptingExecutorService.java:68)
	at java.util.concurrent.FutureTask.run(FutureTask.java:266)
	at java.util.concurrent.ThreadPoolExecutor.runWorker(ThreadPoolExecutor.java:1149)
	at java.util.concurrent.ThreadPoolExecutor$Worker.run(ThreadPoolExecutor.java:624)
	at java.lang.Thread.run(Thread.java:748)
Caused by: org.eclipse.aether.resolution.ArtifactResolutionException: Failure to transfer
org.apache.maven.plugins:maven-site-plugin:jar:3.5.1 from https://repo.maven.apache.org/maven2
was cached in the local repository, resolution will not be reattempted until the update interval
of central has elapsed or updates are forced. Original error: Could not transfer artifact
org.apache.maven.plugins:maven-site-plugin:jar:3.5.1 from/to central (https://repo.maven.apache.org/maven2):
GET request of: org/apache/maven/plugins/maven-site-plugin/3.5.1/maven-site-plugin-3.5.1.jar
from central failed
	at org.eclipse.aether.internal.impl.DefaultArtifactResolver.resolve(DefaultArtifactResolver.java:444)
	at org.eclipse.aether.internal.impl.DefaultArtifactResolver.resolveArtifacts(DefaultArtifactResolver.java:246)
	at org.eclipse.aether.internal.impl.DefaultArtifactResolver.resolveArtifact(DefaultArtifactResolver.java:223)
	at org.eclipse.aether.internal.impl.DefaultRepositorySystem.resolveArtifact(DefaultRepositorySystem.java:294)
	at org.apache.maven.plugin.internal.DefaultPluginDependenciesResolver.resolve(DefaultPluginDependenciesResolver.java:124)
	... 38 more
Caused by: org.eclipse.aether.transfer.ArtifactTransferException: Failure to transfer org.apache.maven.plugins:maven-site-plugin:jar:3.5.1
from https://repo.maven.apache.org/maven2 was cached in the local repository, resolution will
not be reattempted until the update interval of central has elapsed or updates are forced.
Original error: Could not transfer artifact org.apache.maven.plugins:maven-site-plugin:jar:3.5.1
from/to central (https://repo.maven.apache.org/maven2): GET request of: org/apache/maven/plugins/maven-site-plugin/3.5.1/maven-site-plugin-3.5.1.jar
from central failed
	at org.eclipse.aether.internal.impl.DefaultUpdateCheckManager.newException(DefaultUpdateCheckManager.java:238)
	at org.eclipse.aether.internal.impl.DefaultUpdateCheckManager.checkArtifact(DefaultUpdateCheckManager.java:183)
	at org.eclipse.aether.internal.impl.DefaultArtifactResolver.gatherDownloads(DefaultArtifactResolver.java:585)
	at org.eclipse.aether.internal.impl.DefaultArtifactResolver.performDownloads(DefaultArtifactResolver.java:503)
	at org.eclipse.aether.internal.impl.DefaultArtifactResolver.resolve(DefaultArtifactResolver.java:421)
	... 42 more
2017-08-09T06:02:10.049 [ERROR] 
2017-08-09T06:02:10.049 [ERROR] Re-run Maven using the -X switch to enable full debug logging.
2017-08-09T06:02:10.049 [ERROR] 
2017-08-09T06:02:10.049 [ERROR] For more information about the errors and possible solutions,
please read the following articles:
2017-08-09T06:02:10.049 [ERROR] [Help 1] http://cwiki.apache.org/confluence/display/MAVEN/PluginResolutionException
channel stopped

Mime
View raw message