beam-commits mailing list archives

Site index · List index
Message view « Date » · « Thread »
Top « Date » · « Thread »
From Apache Jenkins Server <jenk...@builds.apache.org>
Subject Build failed in Jenkins: beam_PostCommit_Java_MavenInstall #4555
Date Fri, 11 Aug 2017 06:30:26 GMT
See <https://builds.apache.org/job/beam_PostCommit_Java_MavenInstall/4555/display/redirect?page=changes>

Changes:

[jbonofre] [BEAM-2684] Fix flaky AmqpIOTest by introducing ActiveMQ AMQP broker

------------------------------------------
[...truncated 1.08 MB...]
2017-08-11T06:29:30.738 [INFO] Downloaded: https://repo.maven.apache.org/maven2/com/github/ben-manes/caffeine/caffeine/2.2.6/caffeine-2.2.6.jar
(926 KB at 159.5 KB/sec)
2017-08-11T06:29:30.738 [INFO] Downloading: https://repo.maven.apache.org/maven2/com/datastax/cassandra/cassandra-driver-core/3.1.1/cassandra-driver-core-3.1.1.jar
2017-08-11T06:29:30.860 [INFO] Downloaded: https://repo.maven.apache.org/maven2/io/netty/netty-all/4.0.39.Final/netty-all-4.0.39.Final.jar
(2219 KB at 374.5 KB/sec)
2017-08-11T06:29:30.867 [INFO] Downloaded: https://repo.maven.apache.org/maven2/org/eclipse/jdt/core/compiler/ecj/4.4.2/ecj-4.4.2.jar
(2257 KB at 380.4 KB/sec)
2017-08-11T06:29:30.916 [INFO] Downloaded: https://repo.maven.apache.org/maven2/com/datastax/cassandra/cassandra-driver-core/3.1.1/cassandra-driver-core-3.1.1.jar
(1029 KB at 171.9 KB/sec)
2017-08-11T06:29:31.430 [INFO] Downloaded: https://repo.maven.apache.org/maven2/org/apache/storm/storm-core/1.0.1/storm-core-1.0.1.jar
(19650 KB at 3025.4 KB/sec)
2017-08-11T06:29:31.619 [INFO] Downloaded: https://repo.maven.apache.org/maven2/it/unimi/dsi/fastutil/6.5.7/fastutil-6.5.7.jar
(16508 KB at 2470.1 KB/sec)
2017-08-11T06:29:31.660 [INFO] Downloading: http://conjars.org/repo/org/apache/hive/hive-exec/1.2.1/hive-exec-1.2.1.jar
2017-08-11T06:29:31.661 [INFO] Downloading: http://conjars.org/repo/org/pentaho/pentaho-aggdesigner-algorithm/5.1.5-jhyde/pentaho-aggdesigner-algorithm-5.1.5-jhyde.jar
2017-08-11T06:29:31.661 [INFO] Downloading: http://conjars.org/repo/cascading/cascading-hadoop/2.6.3/cascading-hadoop-2.6.3.jar
2017-08-11T06:29:31.661 [INFO] Downloading: http://conjars.org/repo/com/typesafe/akka/akka-remote_2.10/2.3.11/akka-remote_2.10-2.3.11.jar
2017-08-11T06:29:31.662 [INFO] Downloading: http://conjars.org/repo/cascading/cascading-core/2.6.3/cascading-core-2.6.3.jar
2017-08-11T06:29:31.717 [INFO] Downloading: http://conjars.org/repo/riffle/riffle/0.1-dev/riffle-0.1-dev.jar
2017-08-11T06:29:31.718 [INFO] Downloading: http://conjars.org/repo/thirdparty/jgrapht-jdk1.6/0.8.1/jgrapht-jdk1.6-0.8.1.jar
2017-08-11T06:29:31.831 [INFO] Downloaded: http://conjars.org/repo/riffle/riffle/0.1-dev/riffle-0.1-dev.jar
(12 KB at 65.6 KB/sec)
2017-08-11T06:29:31.831 [INFO] Downloading: http://conjars.org/repo/cascading/cascading-local/2.6.3/cascading-local-2.6.3.jar
2017-08-11T06:29:31.832 [INFO] Downloaded: http://conjars.org/repo/org/pentaho/pentaho-aggdesigner-algorithm/5.1.5-jhyde/pentaho-aggdesigner-algorithm-5.1.5-jhyde.jar
(48 KB at 275.7 KB/sec)
2017-08-11T06:29:32.000 [INFO] Downloaded: http://conjars.org/repo/cascading/cascading-local/2.6.3/cascading-local-2.6.3.jar
(43 KB at 125.2 KB/sec)
2017-08-11T06:29:32.084 [INFO] Downloaded: http://conjars.org/repo/cascading/cascading-hadoop/2.6.3/cascading-hadoop-2.6.3.jar
(246 KB at 581.3 KB/sec)
2017-08-11T06:29:32.107 [INFO] Downloaded: http://conjars.org/repo/thirdparty/jgrapht-jdk1.6/0.8.1/jgrapht-jdk1.6-0.8.1.jar
(230 KB at 515.2 KB/sec)
2017-08-11T06:29:32.356 [INFO] Downloaded: http://conjars.org/repo/cascading/cascading-core/2.6.3/cascading-core-2.6.3.jar
(680 KB at 979.0 KB/sec)
2017-08-11T06:29:32.358 [INFO] Downloading: http://clojars.org/repo/org/apache/hive/hive-exec/1.2.1/hive-exec-1.2.1.jar
2017-08-11T06:29:32.359 [INFO] Downloading: http://clojars.org/repo/com/typesafe/akka/akka-remote_2.10/2.3.11/akka-remote_2.10-2.3.11.jar
2017-08-11T06:29:32.429 [INFO] Downloading: http://www.datanucleus.org/downloads/maven2/org/apache/hive/hive-exec/1.2.1/hive-exec-1.2.1.jar
2017-08-11T06:29:32.700 [INFO] Downloading: https://repository.apache.org/content/repositories/releases/com/typesafe/akka/akka-remote_2.10/2.3.11/akka-remote_2.10-2.3.11.jar
2017-08-11T06:29:32.897 [INFO] Downloading: https://repository.jboss.org/nexus/content/repositories/releases/com/typesafe/akka/akka-remote_2.10/2.3.11/akka-remote_2.10-2.3.11.jar
2017-08-11T06:29:33.297 [INFO] Downloading: https://repo.eclipse.org/content/repositories/paho-releases/com/typesafe/akka/akka-remote_2.10/2.3.11/akka-remote_2.10-2.3.11.jar
2017-08-11T06:29:33.469 [INFO] Downloading: https://repository.cloudera.com/artifactory/cloudera-repos/com/typesafe/akka/akka-remote_2.10/2.3.11/akka-remote_2.10-2.3.11.jar
2017-08-11T06:29:33.665 [INFO] Downloading: https://oss.sonatype.org/content/repositories/orgspark-project-1113/com/typesafe/akka/akka-remote_2.10/2.3.11/akka-remote_2.10-2.3.11.jar
2017-08-11T06:29:33.806 [INFO] Downloading: http://repository.mapr.com/maven/com/typesafe/akka/akka-remote_2.10/2.3.11/akka-remote_2.10-2.3.11.jar
2017-08-11T06:29:33.893 [INFO] Downloading: http://maven.twttr.com/com/typesafe/akka/akka-remote_2.10/2.3.11/akka-remote_2.10-2.3.11.jar
[JENKINS] Archiving disabled
2017-08-11T06:29:34.911 [INFO]                                                           
             
2017-08-11T06:29:34.911 [INFO] ------------------------------------------------------------------------
2017-08-11T06:29:34.911 [INFO] Skipping Apache Beam :: Parent
2017-08-11T06:29:34.912 [INFO] This project has been banned from the build due to previous
failures.
2017-08-11T06:29:34.912 [INFO] ------------------------------------------------------------------------
[JENKINS] Archiving disabled
[JENKINS] Archiving disabled
[JENKINS] Archiving disabled
[JENKINS] Archiving disabled
[JENKINS] Archiving disabled
[JENKINS] Archiving disabled
[JENKINS] Archiving disabled
[JENKINS] Archiving disabled
[JENKINS] Archiving disabled
[JENKINS] Archiving disabled
[JENKINS] Archiving disabled
[JENKINS] Archiving disabled
[JENKINS] Archiving disabled
[JENKINS] Archiving disabled
[JENKINS] Archiving disabled
[JENKINS] Archiving disabled
[JENKINS] Archiving disabled
[JENKINS] Archiving disabled
[JENKINS] Archiving disabled
[JENKINS] Archiving disabled
[JENKINS] Archiving disabled
[JENKINS] Archiving disabled
[JENKINS] Archiving disabled
[JENKINS] Archiving disabled
[JENKINS] Archiving disabled
[JENKINS] Archiving disabled
[JENKINS] Archiving disabled
[JENKINS] Archiving disabled
[JENKINS] Archiving disabled
[JENKINS] Archiving disabled
[JENKINS] Archiving disabled
[JENKINS] Archiving disabled
[JENKINS] Archiving disabled
[JENKINS] Archiving disabled
[JENKINS] Archiving disabled
[JENKINS] Archiving disabled
[JENKINS] Archiving disabled
[JENKINS] Archiving disabled
[JENKINS] Archiving disabled
[JENKINS] Archiving disabled
[JENKINS] Archiving disabled
[JENKINS] Archiving disabled
[JENKINS] Archiving disabled
[JENKINS] Archiving disabled
[JENKINS] Archiving disabled
[JENKINS] Archiving disabled
[JENKINS] Archiving disabled
[JENKINS] Archiving disabled
[JENKINS] Archiving disabled
[JENKINS] Archiving disabled
[JENKINS] Archiving disabled
[JENKINS] Archiving disabled
[JENKINS] Archiving disabled
[JENKINS] Archiving disabled
[JENKINS] Archiving disabled2017-08-11T06:30:06.911 [INFO] ------------------------------------------------------------------------
2017-08-11T06:30:06.911 [INFO] Reactor Summary:
2017-08-11T06:30:06.911 [INFO] 
2017-08-11T06:30:06.911 [INFO] Apache Beam :: Parent .............................. SUCCESS
[ 57.625 s]
2017-08-11T06:30:06.911 [INFO] Apache Beam :: SDKs :: Java :: Build Tools ......... SUCCESS
[ 13.792 s]
2017-08-11T06:30:06.911 [INFO] Apache Beam :: SDKs ................................ SUCCESS
[  5.819 s]
2017-08-11T06:30:06.911 [INFO] Apache Beam :: SDKs :: Common ...................... SUCCESS
[  2.883 s]
2017-08-11T06:30:06.911 [INFO] Apache Beam :: SDKs :: Common :: Runner API ........ SUCCESS
[ 36.687 s]
2017-08-11T06:30:06.911 [INFO] Apache Beam :: SDKs :: Common :: Fn API ............ SUCCESS
[ 17.515 s]
2017-08-11T06:30:06.911 [INFO] Apache Beam :: SDKs :: Java ........................ SUCCESS
[  3.132 s]
2017-08-11T06:30:06.911 [INFO] Apache Beam :: SDKs :: Java :: Core ................ SUCCESS
[02:38 min]
2017-08-11T06:30:06.911 [INFO] Apache Beam :: Runners ............................. SUCCESS
[  2.875 s]
2017-08-11T06:30:06.911 [INFO] Apache Beam :: Runners :: Core Construction Java ... SUCCESS
[ 35.681 s]
2017-08-11T06:30:06.911 [INFO] Apache Beam :: Runners :: Core Java ................ SUCCESS
[ 51.845 s]
2017-08-11T06:30:06.911 [INFO] Apache Beam :: Runners :: Direct Java .............. SUCCESS
[04:57 min]
2017-08-11T06:30:06.911 [INFO] Apache Beam :: SDKs :: Java :: IO .................. SUCCESS
[  2.998 s]
2017-08-11T06:30:06.911 [INFO] Apache Beam :: SDKs :: Java :: IO :: AMQP .......... SUCCESS
[ 44.098 s]
2017-08-11T06:30:06.911 [INFO] Apache Beam :: SDKs :: Java :: IO :: Common ........ SUCCESS
[  7.126 s]
2017-08-11T06:30:06.911 [INFO] Apache Beam :: SDKs :: Java :: IO :: Cassandra ..... SUCCESS
[ 26.246 s]
2017-08-11T06:30:06.911 [INFO] Apache Beam :: SDKs :: Java :: IO :: Elasticsearch . SUCCESS
[ 45.612 s]
2017-08-11T06:30:06.911 [INFO] Apache Beam :: SDKs :: Java :: Extensions .......... SUCCESS
[  2.816 s]
2017-08-11T06:30:06.911 [INFO] Apache Beam :: SDKs :: Java :: Extensions :: Google Cloud Platform
Core SUCCESS [ 32.876 s]
2017-08-11T06:30:06.911 [INFO] Apache Beam :: SDKs :: Java :: Extensions :: Protobuf SUCCESS
[ 23.844 s]
2017-08-11T06:30:06.911 [INFO] Apache Beam :: SDKs :: Java :: IO :: Google Cloud Platform
SUCCESS [01:45 min]
2017-08-11T06:30:06.911 [INFO] Apache Beam :: SDKs :: Java :: IO :: Hadoop Common . SUCCESS
[ 25.426 s]
2017-08-11T06:30:06.911 [INFO] Apache Beam :: SDKs :: Java :: IO :: Hadoop File System SUCCESS
[ 50.737 s]
2017-08-11T06:30:06.911 [INFO] Apache Beam :: SDKs :: Java :: IO :: Hadoop ........ SUCCESS
[  5.433 s]
2017-08-11T06:30:06.911 [INFO] Apache Beam :: SDKs :: Java :: IO :: Hadoop :: input-format
SUCCESS [ 28.851 s]
2017-08-11T06:30:06.911 [INFO] Apache Beam :: Runners :: Google Cloud Dataflow .... SUCCESS
[08:35 min]
2017-08-11T06:30:06.911 [INFO] Apache Beam :: SDKs :: Java :: IO :: Hadoop :: jdk1.8-tests
FAILURE [ 20.934 s]
2017-08-11T06:30:06.911 [INFO] Apache Beam :: SDKs :: Java :: IO :: HBase ......... SKIPPED
2017-08-11T06:30:06.911 [INFO] Apache Beam :: SDKs :: Java :: IO :: HCatalog ...... SKIPPED
2017-08-11T06:30:06.911 [INFO] Apache Beam :: SDKs :: Java :: IO :: JDBC .......... SKIPPED
2017-08-11T06:30:06.911 [INFO] Apache Beam :: SDKs :: Java :: IO :: JMS ........... SKIPPED
2017-08-11T06:30:06.911 [INFO] Apache Beam :: SDKs :: Java :: IO :: Kafka ......... SKIPPED
2017-08-11T06:30:06.911 [INFO] Apache Beam :: SDKs :: Java :: IO :: Kinesis ....... SKIPPED
2017-08-11T06:30:06.911 [INFO] Apache Beam :: SDKs :: Java :: IO :: MongoDB ....... SKIPPED
2017-08-11T06:30:06.911 [INFO] Apache Beam :: SDKs :: Java :: IO :: MQTT .......... SKIPPED
2017-08-11T06:30:06.911 [INFO] Apache Beam :: SDKs :: Java :: IO :: Solr .......... SKIPPED
2017-08-11T06:30:06.911 [INFO] Apache Beam :: SDKs :: Java :: IO :: XML ........... SKIPPED
2017-08-11T06:30:06.911 [INFO] Apache Beam :: SDKs :: Java :: Maven Archetypes .... SKIPPED
2017-08-11T06:30:06.911 [INFO] Apache Beam :: SDKs :: Java :: Maven Archetypes :: Starter
SKIPPED
2017-08-11T06:30:06.911 [INFO] Apache Beam :: Examples ............................ SKIPPED
2017-08-11T06:30:06.911 [INFO] Apache Beam :: Examples :: Java .................... SKIPPED
2017-08-11T06:30:06.911 [INFO] Apache Beam :: SDKs :: Java :: Maven Archetypes :: Examples
SKIPPED
2017-08-11T06:30:06.911 [INFO] Apache Beam :: Examples :: Java 8 .................. SKIPPED
2017-08-11T06:30:06.911 [INFO] Apache Beam :: SDKs :: Java :: Maven Archetypes :: Examples
- Java 8 SKIPPED
2017-08-11T06:30:06.911 [INFO] Apache Beam :: SDKs :: Java :: Extensions :: Jackson SKIPPED
2017-08-11T06:30:06.911 [INFO] Apache Beam :: SDKs :: Java :: Extensions :: Join library SKIPPED
2017-08-11T06:30:06.911 [INFO] Apache Beam :: SDKs :: Java :: Extensions :: Sorter  SKIPPED
2017-08-11T06:30:06.911 [INFO] Apache Beam :: SDKs :: Java :: Harness ............. SKIPPED
2017-08-11T06:30:06.911 [INFO] Apache Beam :: SDKs :: Java :: Java 8 Tests ........ SKIPPED
2017-08-11T06:30:06.911 [INFO] Apache Beam :: SDKs :: Python ...................... SKIPPED
2017-08-11T06:30:06.911 [INFO] Apache Beam :: Runners :: Flink .................... SKIPPED
2017-08-11T06:30:06.911 [INFO] Apache Beam :: Runners :: Spark .................... SKIPPED
2017-08-11T06:30:06.912 [INFO] Apache Beam :: Runners :: Apex ..................... SKIPPED
2017-08-11T06:30:06.912 [INFO] Apache Beam :: Runners :: Gearpump ................. SKIPPED
2017-08-11T06:30:06.912 [INFO] Apache Beam :: SDKs :: Java :: Aggregated Javadoc .. SKIPPED
2017-08-11T06:30:06.912 [INFO] ------------------------------------------------------------------------
2017-08-11T06:30:06.912 [INFO] BUILD FAILURE
2017-08-11T06:30:06.912 [INFO] ------------------------------------------------------------------------
2017-08-11T06:30:06.912 [INFO] Total time: 28:18 min
2017-08-11T06:30:06.912 [INFO] Finished at: 2017-08-11T06:30:06+00:00

2017-08-11T06:30:07.645 [INFO] Final Memory: 191M/1395M
2017-08-11T06:30:07.645 [INFO] ------------------------------------------------------------------------
2017-08-11T06:30:07.652 [ERROR] Failed to execute goal on project beam-sdks-java-io-hadoop-jdk1.8-tests:
Could not resolve dependencies for project org.apache.beam:beam-sdks-java-io-hadoop-jdk1.8-tests:jar:2.2.0-SNAPSHOT:
The following artifacts could not be resolved: org.apache.hive:hive-exec:jar:1.2.1, com.typesafe.akka:akka-remote_2.10:jar:2.3.11:
Could not transfer artifact org.apache.hive:hive-exec:jar:1.2.1 from/to central (https://repo.maven.apache.org/maven2):
GET request of: org/apache/hive/hive-exec/1.2.1/hive-exec-1.2.1.jar from central failed: Connection
reset -> [Help 1]
org.apache.maven.lifecycle.LifecycleExecutionException: Failed to execute goal on project
beam-sdks-java-io-hadoop-jdk1.8-tests: Could not resolve dependencies for project org.apache.beam:beam-sdks-java-io-hadoop-jdk1.8-tests:jar:2.2.0-SNAPSHOT:
The following artifacts could not be resolved: org.apache.hive:hive-exec:jar:1.2.1, com.typesafe.akka:akka-remote_2.10:jar:2.3.11:
Could not transfer artifact org.apache.hive:hive-exec:jar:1.2.1 from/to central (https://repo.maven.apache.org/maven2):
GET request of: org/apache/hive/hive-exec/1.2.1/hive-exec-1.2.1.jar from central failed
	at org.apache.maven.lifecycle.internal.LifecycleDependencyResolver.getDependencies(LifecycleDependencyResolver.java:221)
	at org.apache.maven.lifecycle.internal.LifecycleDependencyResolver.resolveProjectDependencies(LifecycleDependencyResolver.java:127)
	at org.apache.maven.lifecycle.internal.MojoExecutor.ensureDependenciesAreResolved(MojoExecutor.java:257)
	at org.apache.maven.lifecycle.internal.MojoExecutor.execute(MojoExecutor.java:200)
	at org.apache.maven.lifecycle.internal.MojoExecutor.execute(MojoExecutor.java:153)
	at org.apache.maven.lifecycle.internal.MojoExecutor.execute(MojoExecutor.java:145)
	at org.apache.maven.lifecycle.internal.LifecycleModuleBuilder.buildProject(LifecycleModuleBuilder.java:116)
	at org.apache.maven.lifecycle.internal.LifecycleModuleBuilder.buildProject(LifecycleModuleBuilder.java:80)
	at org.apache.maven.lifecycle.internal.builder.singlethreaded.SingleThreadedBuilder.build(SingleThreadedBuilder.java:51)
	at org.apache.maven.lifecycle.internal.LifecycleStarter.execute(LifecycleStarter.java:128)
	at org.apache.maven.DefaultMaven.doExecute(DefaultMaven.java:307)
	at org.apache.maven.DefaultMaven.doExecute(DefaultMaven.java:193)
	at org.apache.maven.DefaultMaven.execute(DefaultMaven.java:106)
	at org.jvnet.hudson.maven3.launcher.Maven33Launcher.main(Maven33Launcher.java:129)
	at sun.reflect.NativeMethodAccessorImpl.invoke0(Native Method)
	at sun.reflect.NativeMethodAccessorImpl.invoke(NativeMethodAccessorImpl.java:62)
	at sun.reflect.DelegatingMethodAccessorImpl.invoke(DelegatingMethodAccessorImpl.java:43)
	at java.lang.reflect.Method.invoke(Method.java:498)
	at org.codehaus.plexus.classworlds.launcher.Launcher.launchStandard(Launcher.java:330)
	at org.codehaus.plexus.classworlds.launcher.Launcher.launch(Launcher.java:238)
	at jenkins.maven3.agent.Maven33Main.launch(Maven33Main.java:176)
	at sun.reflect.NativeMethodAccessorImpl.invoke0(Native Method)
	at sun.reflect.NativeMethodAccessorImpl.invoke(NativeMethodAccessorImpl.java:62)
	at sun.reflect.DelegatingMethodAccessorImpl.invoke(DelegatingMethodAccessorImpl.java:43)
	at java.lang.reflect.Method.invoke(Method.java:498)
	at hudson.maven.Maven3Builder.call(Maven3Builder.java:139)
	at hudson.maven.Maven3Builder.call(Maven3Builder.java:70)
	at hudson.remoting.UserRequest.perform(UserRequest.java:153)
	at hudson.remoting.UserRequest.perform(UserRequest.java:50)
	at hudson.remoting.Request$2.run(Request.java:336)
	at hudson.remoting.InterceptingExecutorService$1.call(InterceptingExecutorService.java:68)
	at java.util.concurrent.FutureTask.run(FutureTask.java:266)
	at java.util.concurrent.ThreadPoolExecutor.runWorker(ThreadPoolExecutor.java:1149)
	at java.util.concurrent.ThreadPoolExecutor$Worker.run(ThreadPoolExecutor.java:624)
	at java.lang.Thread.run(Thread.java:748)
Caused by: org.apache.maven.project.DependencyResolutionException: Could not resolve dependencies
for project org.apache.beam:beam-sdks-java-io-hadoop-jdk1.8-tests:jar:2.2.0-SNAPSHOT: The
following artifacts could not be resolved: org.apache.hive:hive-exec:jar:1.2.1, com.typesafe.akka:akka-remote_2.10:jar:2.3.11:
Could not transfer artifact org.apache.hive:hive-exec:jar:1.2.1 from/to central (https://repo.maven.apache.org/maven2):
GET request of: org/apache/hive/hive-exec/1.2.1/hive-exec-1.2.1.jar from central failed
	at org.apache.maven.project.DefaultProjectDependenciesResolver.resolve(DefaultProjectDependenciesResolver.java:211)
	at org.apache.maven.lifecycle.internal.LifecycleDependencyResolver.getDependencies(LifecycleDependencyResolver.java:195)
	... 34 more
Caused by: org.eclipse.aether.resolution.DependencyResolutionException: The following artifacts
could not be resolved: org.apache.hive:hive-exec:jar:1.2.1, com.typesafe.akka:akka-remote_2.10:jar:2.3.11:
Could not transfer artifact org.apache.hive:hive-exec:jar:1.2.1 from/to central (https://repo.maven.apache.org/maven2):
GET request of: org/apache/hive/hive-exec/1.2.1/hive-exec-1.2.1.jar from central failed
	at org.eclipse.aether.internal.impl.DefaultRepositorySystem.resolveDependencies(DefaultRepositorySystem.java:384)
	at org.apache.maven.project.DefaultProjectDependenciesResolver.resolve(DefaultProjectDependenciesResolver.java:205)
	... 35 more
Caused by: org.eclipse.aether.resolution.ArtifactResolutionException: The following artifacts
could not be resolved: org.apache.hive:hive-exec:jar:1.2.1, com.typesafe.akka:akka-remote_2.10:jar:2.3.11:
Could not transfer artifact org.apache.hive:hive-exec:jar:1.2.1 from/to central (https://repo.maven.apache.org/maven2):
GET request of: org/apache/hive/hive-exec/1.2.1/hive-exec-1.2.1.jar from central failed
	at org.eclipse.aether.internal.impl.DefaultArtifactResolver.resolve(DefaultArtifactResolver.java:444)
	at org.eclipse.aether.internal.impl.DefaultArtifactResolver.resolveArtifacts(DefaultArtifactResolver.java:246)
	at org.eclipse.aether.internal.impl.DefaultRepositorySystem.resolveDependencies(DefaultRepositorySystem.java:367)
	... 36 more
Caused by: org.eclipse.aether.transfer.ArtifactTransferException: Could not transfer artifact
org.apache.hive:hive-exec:jar:1.2.1 from/to central (https://repo.maven.apache.org/maven2):
GET request of: org/apache/hive/hive-exec/1.2.1/hive-exec-1.2.1.jar from central failed
	at org.eclipse.aether.connector.basic.ArtifactTransportListener.transferFailed(ArtifactTransportListener.java:43)
	at org.eclipse.aether.connector.basic.BasicRepositoryConnector$TaskRunner.run(BasicRepositoryConnector.java:355)
	at org.eclipse.aether.util.concurrency.RunnableErrorForwarder$1.run(RunnableErrorForwarder.java:67)
	... 3 more
Caused by: org.apache.maven.wagon.TransferFailedException: GET request of: org/apache/hive/hive-exec/1.2.1/hive-exec-1.2.1.jar
from central failed
	at org.apache.maven.wagon.AbstractWagon.getTransfer(AbstractWagon.java:363)
	at org.apache.maven.wagon.AbstractWagon.getTransfer(AbstractWagon.java:316)
	at org.apache.maven.wagon.AbstractWagon.getTransfer(AbstractWagon.java:285)
	at org.apache.maven.wagon.StreamWagon.getIfNewer(StreamWagon.java:97)
	at org.apache.maven.wagon.StreamWagon.get(StreamWagon.java:61)
	at org.eclipse.aether.transport.wagon.WagonTransporter$GetTaskRunner.run(WagonTransporter.java:560)
	at org.eclipse.aether.transport.wagon.WagonTransporter.execute(WagonTransporter.java:427)
	at org.eclipse.aether.transport.wagon.WagonTransporter.get(WagonTransporter.java:404)
	at org.eclipse.aether.connector.basic.BasicRepositoryConnector$GetTaskRunner.runTask(BasicRepositoryConnector.java:447)
	at org.eclipse.aether.connector.basic.BasicRepositoryConnector$TaskRunner.run(BasicRepositoryConnector.java:350)
	... 4 more
Caused by: java.net.SocketException: Connection reset
	at java.net.SocketInputStream.read(SocketInputStream.java:210)
	at java.net.SocketInputStream.read(SocketInputStream.java:141)
	at sun.security.ssl.InputRecord.readFully(InputRecord.java:465)
	at sun.security.ssl.InputRecord.readV3Record(InputRecord.java:593)
	at sun.security.ssl.InputRecord.read(InputRecord.java:532)
	at sun.security.ssl.SSLSocketImpl.readRecord(SSLSocketImpl.java:983)
	at sun.security.ssl.SSLSocketImpl.readDataRecord(SSLSocketImpl.java:940)
	at sun.security.ssl.AppInputStream.read(AppInputStream.java:105)
	at org.apache.maven.wagon.providers.http.httpclient.impl.io.SessionInputBufferImpl.streamRead(SessionInputBufferImpl.java:136)
	at org.apache.maven.wagon.providers.http.httpclient.impl.io.SessionInputBufferImpl.read(SessionInputBufferImpl.java:195)
	at org.apache.maven.wagon.providers.http.httpclient.impl.io.ContentLengthInputStream.read(ContentLengthInputStream.java:178)
	at org.apache.maven.wagon.providers.http.httpclient.conn.EofSensorInputStream.read(EofSensorInputStream.java:137)
	at org.apache.maven.wagon.AbstractWagon.transfer(AbstractWagon.java:531)
	at org.apache.maven.wagon.AbstractWagon.getTransfer(AbstractWagon.java:353)
	... 13 more
2017-08-11T06:30:07.653 [ERROR] 
2017-08-11T06:30:07.653 [ERROR] Re-run Maven using the -X switch to enable full debug logging.
2017-08-11T06:30:07.653 [ERROR] 
2017-08-11T06:30:07.653 [ERROR] For more information about the errors and possible solutions,
please read the following articles:
2017-08-11T06:30:07.653 [ERROR] [Help 1] http://cwiki.apache.org/confluence/display/MAVEN/DependencyResolutionException
2017-08-11T06:30:07.653 [ERROR] 
2017-08-11T06:30:07.653 [ERROR] After correcting the problems, you can resume the build with
the command
2017-08-11T06:30:07.653 [ERROR]   mvn <goals> -rf :beam-sdks-java-io-hadoop-jdk1.8-tests
channel stopped

Mime
View raw message