beam-commits mailing list archives

Site index · List index
Message view « Date » · « Thread »
Top « Date » · « Thread »
From Apache Jenkins Server <jenk...@builds.apache.org>
Subject Build failed in Jenkins: beam_PerformanceTests_JDBC #187
Date Mon, 07 Aug 2017 23:36:28 GMT
See <https://builds.apache.org/job/beam_PerformanceTests_JDBC/187/display/redirect>

------------------------------------------
[...truncated 45.32 KB...]
[INFO] Excluding com.fasterxml.jackson.core:jackson-core:jar:2.8.9 from the shaded jar.
[INFO] Excluding com.fasterxml.jackson.core:jackson-annotations:jar:2.8.9 from the shaded
jar.
[INFO] Excluding com.fasterxml.jackson.core:jackson-databind:jar:2.8.9 from the shaded jar.
[INFO] Excluding org.slf4j:slf4j-api:jar:1.7.14 from the shaded jar.
[INFO] Excluding com.google.auto.service:auto-service:jar:1.0-rc2 from the shaded jar.
[INFO] Excluding com.google.auto:auto-common:jar:0.3 from the shaded jar.
[INFO] Excluding com.google.api.grpc:grpc-google-common-protos:jar:0.1.9 from the shaded jar.
[INFO] Excluding io.grpc:grpc-protobuf:jar:1.2.0 from the shaded jar.
[INFO] Replacing original artifact with shaded artifact.
[INFO] Replacing <https://builds.apache.org/job/beam_PerformanceTests_JDBC/ws/runners/google-cloud-dataflow-java/target/beam-runners-google-cloud-dataflow-java-2.2.0-SNAPSHOT.jar>
with <https://builds.apache.org/job/beam_PerformanceTests_JDBC/ws/runners/google-cloud-dataflow-java/target/beam-runners-google-cloud-dataflow-java-2.2.0-SNAPSHOT-shaded.jar>
[INFO] Replacing original test artifact with shaded test artifact.
[INFO] Replacing <https://builds.apache.org/job/beam_PerformanceTests_JDBC/ws/runners/google-cloud-dataflow-java/target/beam-runners-google-cloud-dataflow-java-2.2.0-SNAPSHOT-tests.jar>
with <https://builds.apache.org/job/beam_PerformanceTests_JDBC/ws/runners/google-cloud-dataflow-java/target/beam-runners-google-cloud-dataflow-java-2.2.0-SNAPSHOT-shaded-tests.jar>
[INFO] Dependency-reduced POM written at: <https://builds.apache.org/job/beam_PerformanceTests_JDBC/ws/runners/google-cloud-dataflow-java/dependency-reduced-pom.xml>
[INFO] 
[INFO] --- maven-failsafe-plugin:2.20:integration-test (integration-test) @ beam-runners-google-cloud-dataflow-java
---
[INFO] Tests are skipped.
[INFO] 
[INFO] --- maven-dependency-plugin:3.0.1:analyze-only (default) @ beam-runners-google-cloud-dataflow-java
---
[INFO] No dependency problems found
[INFO] 
[INFO] --- maven-failsafe-plugin:2.20:verify (integration-test) @ beam-runners-google-cloud-dataflow-java
---
[INFO] Tests are skipped.
[INFO] 
[INFO] --- maven-install-plugin:2.5.2:install (default-install) @ beam-runners-google-cloud-dataflow-java
---
[INFO] Installing <https://builds.apache.org/job/beam_PerformanceTests_JDBC/ws/runners/google-cloud-dataflow-java/target/beam-runners-google-cloud-dataflow-java-2.2.0-SNAPSHOT.jar>
to /home/jenkins/.m2/repository/org/apache/beam/beam-runners-google-cloud-dataflow-java/2.2.0-SNAPSHOT/beam-runners-google-cloud-dataflow-java-2.2.0-SNAPSHOT.jar
[INFO] Installing <https://builds.apache.org/job/beam_PerformanceTests_JDBC/ws/runners/google-cloud-dataflow-java/dependency-reduced-pom.xml>
to /home/jenkins/.m2/repository/org/apache/beam/beam-runners-google-cloud-dataflow-java/2.2.0-SNAPSHOT/beam-runners-google-cloud-dataflow-java-2.2.0-SNAPSHOT.pom
[INFO] Installing <https://builds.apache.org/job/beam_PerformanceTests_JDBC/ws/runners/google-cloud-dataflow-java/target/beam-runners-google-cloud-dataflow-java-2.2.0-SNAPSHOT-tests.jar>
to /home/jenkins/.m2/repository/org/apache/beam/beam-runners-google-cloud-dataflow-java/2.2.0-SNAPSHOT/beam-runners-google-cloud-dataflow-java-2.2.0-SNAPSHOT-tests.jar
[INFO] Installing <https://builds.apache.org/job/beam_PerformanceTests_JDBC/ws/runners/google-cloud-dataflow-java/target/beam-runners-google-cloud-dataflow-java-2.2.0-SNAPSHOT-tests.jar>
to /home/jenkins/.m2/repository/org/apache/beam/beam-runners-google-cloud-dataflow-java/2.2.0-SNAPSHOT/beam-runners-google-cloud-dataflow-java-2.2.0-SNAPSHOT-tests.jar
[INFO] ------------------------------------------------------------------------
[INFO] BUILD SUCCESS
[INFO] ------------------------------------------------------------------------
[INFO] Total time: 57.575 s
[INFO] Finished at: 2017-08-07T23:36:01Z
[INFO] Final Memory: 93M/1390M
[INFO] ------------------------------------------------------------------------
[beam_PerformanceTests_JDBC] $ /bin/bash -xe /tmp/jenkins203653995006226720.sh
+ /home/jenkins/tools/maven/latest/bin/mvn -B -e verify -pl sdks/java/io/jdbc -Dio-it-suite
-DpkbLocation=<https://builds.apache.org/job/beam_PerformanceTests_JDBC/ws/PerfKitBenchmarker/pkb.py>
-DmvnBinary=/home/jenkins/tools/maven/latest/bin/mvn '-DintegrationTestPipelineOptions=[ "--project=apache-beam-testing",
"--tempRoot=gs://temp-storage-for-end-to-end-tests" ]'
[INFO] Error stacktraces are turned on.
[INFO] Scanning for projects...
[INFO] ------------------------------------------------------------------------
[INFO] Detecting the operating system and CPU architecture
[INFO] ------------------------------------------------------------------------
[INFO] os.detected.name: linux
[INFO] os.detected.arch: x86_64
[INFO] os.detected.version: 4.4
[INFO] os.detected.version.major: 4
[INFO] os.detected.version.minor: 4
[INFO] os.detected.release: ubuntu
[INFO] os.detected.release.version: 14.04
[INFO] os.detected.release.like.ubuntu: true
[INFO] os.detected.release.like.debian: true
[INFO] os.detected.classifier: linux-x86_64
[INFO] 
[INFO] ------------------------------------------------------------------------
[INFO] Building Apache Beam :: SDKs :: Java :: IO :: JDBC 2.2.0-SNAPSHOT
[INFO] ------------------------------------------------------------------------
[INFO] Downloading: http://repository.apache.org/snapshots/org/apache/beam/beam-runners-direct-java/2.2.0-SNAPSHOT/maven-metadata.xml
[INFO] Downloaded: http://repository.apache.org/snapshots/org/apache/beam/beam-runners-direct-java/2.2.0-SNAPSHOT/maven-metadata.xml
(1.7 kB at 3.6 kB/s)
[INFO] Downloading: http://repository.apache.org/snapshots/org/apache/beam/beam-runners-direct-java/2.2.0-SNAPSHOT/beam-runners-direct-java-2.2.0-20170807.071408-24.pom
[INFO] Downloaded: http://repository.apache.org/snapshots/org/apache/beam/beam-runners-direct-java/2.2.0-SNAPSHOT/beam-runners-direct-java-2.2.0-20170807.071408-24.pom
(10 kB at 63 kB/s)
[INFO] Downloading: http://repository.apache.org/snapshots/org/apache/beam/beam-sdks-java-io-common/2.2.0-SNAPSHOT/maven-metadata.xml
[INFO] Downloaded: http://repository.apache.org/snapshots/org/apache/beam/beam-sdks-java-io-common/2.2.0-SNAPSHOT/maven-metadata.xml
(1.4 kB at 8.0 kB/s)
[INFO] Downloading: http://repository.apache.org/snapshots/org/apache/beam/beam-sdks-java-io-common/2.2.0-SNAPSHOT/beam-sdks-java-io-common-2.2.0-20170807.071515-22.pom
[INFO] Downloaded: http://repository.apache.org/snapshots/org/apache/beam/beam-sdks-java-io-common/2.2.0-SNAPSHOT/beam-sdks-java-io-common-2.2.0-20170807.071515-22.pom
(1.4 kB at 8.0 kB/s)
[INFO] Downloading: http://repository.apache.org/snapshots/org/apache/beam/beam-runners-direct-java/2.2.0-SNAPSHOT/beam-runners-direct-java-2.2.0-20170807.071408-24.jar
[INFO] Downloading: http://repository.apache.org/snapshots/org/apache/beam/beam-sdks-java-io-common/2.2.0-SNAPSHOT/beam-sdks-java-io-common-2.2.0-20170807.071515-22-tests.jar
[INFO] Downloading: http://repository.apache.org/snapshots/org/apache/beam/beam-sdks-java-io-common/2.2.0-SNAPSHOT/beam-sdks-java-io-common-2.2.0-20170807.071515-22.jar
[INFO] Downloaded: http://repository.apache.org/snapshots/org/apache/beam/beam-sdks-java-io-common/2.2.0-SNAPSHOT/beam-sdks-java-io-common-2.2.0-20170807.071515-22-tests.jar
(17 kB at 81 kB/s)
[INFO] Downloaded: http://repository.apache.org/snapshots/org/apache/beam/beam-sdks-java-io-common/2.2.0-SNAPSHOT/beam-sdks-java-io-common-2.2.0-20170807.071515-22.jar
(2.7 MB at 6.2 MB/s)
[INFO] Downloaded: http://repository.apache.org/snapshots/org/apache/beam/beam-runners-direct-java/2.2.0-SNAPSHOT/beam-runners-direct-java-2.2.0-20170807.071408-24.jar
(12 MB at 17 MB/s)
[INFO] 
[INFO] --- maven-enforcer-plugin:3.0.0-M1:enforce (enforce) @ beam-sdks-java-io-jdbc ---
[INFO] 
[INFO] --- maven-enforcer-plugin:3.0.0-M1:enforce (enforce-banned-dependencies) @ beam-sdks-java-io-jdbc
---
[INFO] 
[INFO] --- groovy-maven-plugin:2.0:execute (find-supported-python-for-compile) @ beam-sdks-java-io-jdbc
---
[INFO] Using python interpreter binary 'python2.7' with pip 'pip2'
[INFO] 
[INFO] --- maven-remote-resources-plugin:1.5:process (process-resource-bundles) @ beam-sdks-java-io-jdbc
---
[INFO] 
[INFO] --- maven-resources-plugin:3.0.2:resources (default-resources) @ beam-sdks-java-io-jdbc
---
[INFO] Using 'UTF-8' encoding to copy filtered resources.
[INFO] skip non existing resourceDirectory <https://builds.apache.org/job/beam_PerformanceTests_JDBC/ws/sdks/java/io/jdbc/src/main/resources>
[INFO] Copying 3 resources
[INFO] 
[INFO] --- maven-compiler-plugin:3.6.2:compile (default-compile) @ beam-sdks-java-io-jdbc
---
[INFO] Changes detected - recompiling the module!
[INFO] Compiling 2 source files to <https://builds.apache.org/job/beam_PerformanceTests_JDBC/ws/sdks/java/io/jdbc/target/classes>
[WARNING] bootstrap class path not set in conjunction with -source 1.7
[INFO] 
[INFO] --- maven-resources-plugin:3.0.2:testResources (default-testResources) @ beam-sdks-java-io-jdbc
---
[INFO] Using 'UTF-8' encoding to copy filtered resources.
[INFO] skip non existing resourceDirectory <https://builds.apache.org/job/beam_PerformanceTests_JDBC/ws/sdks/java/io/jdbc/src/test/resources>
[INFO] Copying 3 resources
[INFO] 
[INFO] --- maven-compiler-plugin:3.6.2:testCompile (default-testCompile) @ beam-sdks-java-io-jdbc
---
[INFO] Changes detected - recompiling the module!
[INFO] Compiling 3 source files to <https://builds.apache.org/job/beam_PerformanceTests_JDBC/ws/sdks/java/io/jdbc/target/test-classes>
[INFO] 
[INFO] --- maven-checkstyle-plugin:2.17:check (default) @ beam-sdks-java-io-jdbc ---
[INFO] Starting audit...
Audit done.
[INFO] 
[INFO] --- maven-surefire-plugin:2.20:test (default-test) @ beam-sdks-java-io-jdbc ---
[INFO] Tests are skipped.
[INFO] 
[INFO] --- build-helper-maven-plugin:3.0.0:regex-properties (render-artifact-id) @ beam-sdks-java-io-jdbc
---
[INFO] 
[INFO] --- maven-jar-plugin:3.0.2:jar (default-jar) @ beam-sdks-java-io-jdbc ---
[INFO] Building jar: <https://builds.apache.org/job/beam_PerformanceTests_JDBC/ws/sdks/java/io/jdbc/target/beam-sdks-java-io-jdbc-2.2.0-SNAPSHOT.jar>
[INFO] 
[INFO] --- maven-site-plugin:3.5.1:attach-descriptor (attach-descriptor) @ beam-sdks-java-io-jdbc
---
[INFO] 
[INFO] --- maven-jar-plugin:3.0.2:test-jar (default-test-jar) @ beam-sdks-java-io-jdbc ---
[INFO] Building jar: <https://builds.apache.org/job/beam_PerformanceTests_JDBC/ws/sdks/java/io/jdbc/target/beam-sdks-java-io-jdbc-2.2.0-SNAPSHOT-tests.jar>
[INFO] 
[INFO] --- maven-shade-plugin:3.0.0:shade (bundle-and-repackage) @ beam-sdks-java-io-jdbc
---
[INFO] Excluding org.apache.beam:beam-sdks-java-core:jar:2.2.0-SNAPSHOT from the shaded jar.
[INFO] Excluding com.fasterxml.jackson.core:jackson-core:jar:2.8.9 from the shaded jar.
[INFO] Excluding com.fasterxml.jackson.core:jackson-annotations:jar:2.8.9 from the shaded
jar.
[INFO] Excluding com.fasterxml.jackson.core:jackson-databind:jar:2.8.9 from the shaded jar.
[INFO] Excluding org.apache.avro:avro:jar:1.8.2 from the shaded jar.
[INFO] Excluding org.codehaus.jackson:jackson-core-asl:jar:1.9.13 from the shaded jar.
[INFO] Excluding org.codehaus.jackson:jackson-mapper-asl:jar:1.9.13 from the shaded jar.
[INFO] Excluding com.thoughtworks.paranamer:paranamer:jar:2.7 from the shaded jar.
[INFO] Excluding org.apache.commons:commons-compress:jar:1.14 from the shaded jar.
[INFO] Excluding org.tukaani:xz:jar:1.5 from the shaded jar.
[INFO] Excluding org.xerial.snappy:snappy-java:jar:1.1.4-M3 from the shaded jar.
[INFO] Excluding joda-time:joda-time:jar:2.4 from the shaded jar.
[INFO] Including com.google.guava:guava:jar:20.0 in the shaded jar.
[INFO] Excluding com.google.code.findbugs:jsr305:jar:3.0.1 from the shaded jar.
[INFO] Excluding org.apache.commons:commons-dbcp2:jar:2.1.1 from the shaded jar.
[INFO] Excluding org.apache.commons:commons-pool2:jar:2.4.2 from the shaded jar.
[INFO] Excluding commons-logging:commons-logging:jar:1.2 from the shaded jar.
[INFO] Replacing original artifact with shaded artifact.
[INFO] Replacing <https://builds.apache.org/job/beam_PerformanceTests_JDBC/ws/sdks/java/io/jdbc/target/beam-sdks-java-io-jdbc-2.2.0-SNAPSHOT.jar>
with <https://builds.apache.org/job/beam_PerformanceTests_JDBC/ws/sdks/java/io/jdbc/target/beam-sdks-java-io-jdbc-2.2.0-SNAPSHOT-shaded.jar>
[INFO] Replacing original test artifact with shaded test artifact.
[INFO] Replacing <https://builds.apache.org/job/beam_PerformanceTests_JDBC/ws/sdks/java/io/jdbc/target/beam-sdks-java-io-jdbc-2.2.0-SNAPSHOT-tests.jar>
with <https://builds.apache.org/job/beam_PerformanceTests_JDBC/ws/sdks/java/io/jdbc/target/beam-sdks-java-io-jdbc-2.2.0-SNAPSHOT-shaded-tests.jar>
[INFO] Dependency-reduced POM written at: <https://builds.apache.org/job/beam_PerformanceTests_JDBC/ws/sdks/java/io/jdbc/dependency-reduced-pom.xml>
[INFO] 
[INFO] --- maven-dependency-plugin:3.0.1:analyze-only (default) @ beam-sdks-java-io-jdbc ---
[INFO] No dependency problems found
[INFO] 
[INFO] --- exec-maven-plugin:1.6.0:exec (default) @ beam-sdks-java-io-jdbc ---
WARNING:root:File resource loader root perfkitbenchmarker/data/ycsb is not a directory.
2017-08-07 23:36:27,317 42a5ae84 MainThread INFO     Verbose logging to: /tmp/perfkitbenchmarker/runs/42a5ae84/pkb.log
2017-08-07 23:36:27,318 42a5ae84 MainThread INFO     PerfKitBenchmarker version: v1.12.0-94-g8c7b5a4
2017-08-07 23:36:27,318 42a5ae84 MainThread INFO     Flag values:
--beam_prebuilt
--beam_location=<https://builds.apache.org/job/beam_PerformanceTests_JDBC/ws/>
--beam_it_profile=io-it
--benchmarks=beam_integration_benchmark
2017-08-07 23:36:27,606 42a5ae84 MainThread WARNING  The key "flags" was not in the default
config, but was in user overrides. This may indicate a typo.
2017-08-07 23:36:27,666 42a5ae84 MainThread ERROR    Prerequisite check failed for beam_integration_benchmark
Traceback (most recent call last):
  File "<https://builds.apache.org/job/beam_PerformanceTests_JDBC/ws/PerfKitBenchmarker/perfkitbenchmarker/pkb.py",>
line 374, in _CreateBenchmarkSpecs
    check_prereqs(config)
  File "<https://builds.apache.org/job/beam_PerformanceTests_JDBC/ws/PerfKitBenchmarker/perfkitbenchmarker/linux_benchmarks/beam_integration_benchmark.py",>
line 90, in CheckPrerequisites
    'No options provided. To run with default class (WordCountIT), must'
InvalidValue: No options provided. To run with default class (WordCountIT), must provide --beam_it_options=--tempRoot=<temp
dir, e.g. gs://my-dir/temp>.
Traceback (most recent call last):
  File "<https://builds.apache.org/job/beam_PerformanceTests_JDBC/ws/PerfKitBenchmarker/pkb.py",>
line 21, in <module>
    sys.exit(Main())
  File "<https://builds.apache.org/job/beam_PerformanceTests_JDBC/ws/PerfKitBenchmarker/perfkitbenchmarker/pkb.py",>
line 824, in Main
    return RunBenchmarks()
  File "<https://builds.apache.org/job/beam_PerformanceTests_JDBC/ws/PerfKitBenchmarker/perfkitbenchmarker/pkb.py",>
line 736, in RunBenchmarks
    benchmark_specs = _CreateBenchmarkSpecs()
  File "<https://builds.apache.org/job/beam_PerformanceTests_JDBC/ws/PerfKitBenchmarker/perfkitbenchmarker/pkb.py",>
line 374, in _CreateBenchmarkSpecs
    check_prereqs(config)
  File "<https://builds.apache.org/job/beam_PerformanceTests_JDBC/ws/PerfKitBenchmarker/perfkitbenchmarker/linux_benchmarks/beam_integration_benchmark.py",>
line 90, in CheckPrerequisites
    'No options provided. To run with default class (WordCountIT), must'
perfkitbenchmarker.errors.InvalidValue: No options provided. To run with default class (WordCountIT),
must provide --beam_it_options=--tempRoot=<temp dir, e.g. gs://my-dir/temp>.
[ERROR] Command execution failed.
org.apache.commons.exec.ExecuteException: Process exited with an error: 1 (Exit value: 1)
	at org.apache.commons.exec.DefaultExecutor.executeInternal(DefaultExecutor.java:404)
	at org.apache.commons.exec.DefaultExecutor.execute(DefaultExecutor.java:166)
	at org.codehaus.mojo.exec.ExecMojo.executeCommandLine(ExecMojo.java:804)
	at org.codehaus.mojo.exec.ExecMojo.executeCommandLine(ExecMojo.java:751)
	at org.codehaus.mojo.exec.ExecMojo.execute(ExecMojo.java:313)
	at org.apache.maven.plugin.DefaultBuildPluginManager.executeMojo(DefaultBuildPluginManager.java:134)
	at org.apache.maven.lifecycle.internal.MojoExecutor.execute(MojoExecutor.java:208)
	at org.apache.maven.lifecycle.internal.MojoExecutor.execute(MojoExecutor.java:154)
	at org.apache.maven.lifecycle.internal.MojoExecutor.execute(MojoExecutor.java:146)
	at org.apache.maven.lifecycle.internal.LifecycleModuleBuilder.buildProject(LifecycleModuleBuilder.java:117)
	at org.apache.maven.lifecycle.internal.LifecycleModuleBuilder.buildProject(LifecycleModuleBuilder.java:81)
	at org.apache.maven.lifecycle.internal.builder.singlethreaded.SingleThreadedBuilder.build(SingleThreadedBuilder.java:51)
	at org.apache.maven.lifecycle.internal.LifecycleStarter.execute(LifecycleStarter.java:128)
	at org.apache.maven.DefaultMaven.doExecute(DefaultMaven.java:309)
	at org.apache.maven.DefaultMaven.doExecute(DefaultMaven.java:194)
	at org.apache.maven.DefaultMaven.execute(DefaultMaven.java:107)
	at org.apache.maven.cli.MavenCli.execute(MavenCli.java:993)
	at org.apache.maven.cli.MavenCli.doMain(MavenCli.java:345)
	at org.apache.maven.cli.MavenCli.main(MavenCli.java:191)
	at sun.reflect.NativeMethodAccessorImpl.invoke0(Native Method)
	at sun.reflect.NativeMethodAccessorImpl.invoke(NativeMethodAccessorImpl.java:62)
	at sun.reflect.DelegatingMethodAccessorImpl.invoke(DelegatingMethodAccessorImpl.java:43)
	at java.lang.reflect.Method.invoke(Method.java:498)
	at org.codehaus.plexus.classworlds.launcher.Launcher.launchEnhanced(Launcher.java:289)
	at org.codehaus.plexus.classworlds.launcher.Launcher.launch(Launcher.java:229)
	at org.codehaus.plexus.classworlds.launcher.Launcher.mainWithExitCode(Launcher.java:415)
	at org.codehaus.plexus.classworlds.launcher.Launcher.main(Launcher.java:356)
[INFO] ------------------------------------------------------------------------
[INFO] BUILD FAILURE
[INFO] ------------------------------------------------------------------------
[INFO] Total time: 23.540 s
[INFO] Finished at: 2017-08-07T23:36:27Z
[INFO] Final Memory: 75M/998M
[INFO] ------------------------------------------------------------------------
[ERROR] Failed to execute goal org.codehaus.mojo:exec-maven-plugin:1.6.0:exec (default) on
project beam-sdks-java-io-jdbc: Command execution failed. Process exited with an error: 1
(Exit value: 1) -> [Help 1]
org.apache.maven.lifecycle.LifecycleExecutionException: Failed to execute goal org.codehaus.mojo:exec-maven-plugin:1.6.0:exec
(default) on project beam-sdks-java-io-jdbc: Command execution failed.
	at org.apache.maven.lifecycle.internal.MojoExecutor.execute(MojoExecutor.java:213)
	at org.apache.maven.lifecycle.internal.MojoExecutor.execute(MojoExecutor.java:154)
	at org.apache.maven.lifecycle.internal.MojoExecutor.execute(MojoExecutor.java:146)
	at org.apache.maven.lifecycle.internal.LifecycleModuleBuilder.buildProject(LifecycleModuleBuilder.java:117)
	at org.apache.maven.lifecycle.internal.LifecycleModuleBuilder.buildProject(LifecycleModuleBuilder.java:81)
	at org.apache.maven.lifecycle.internal.builder.singlethreaded.SingleThreadedBuilder.build(SingleThreadedBuilder.java:51)
	at org.apache.maven.lifecycle.internal.LifecycleStarter.execute(LifecycleStarter.java:128)
	at org.apache.maven.DefaultMaven.doExecute(DefaultMaven.java:309)
	at org.apache.maven.DefaultMaven.doExecute(DefaultMaven.java:194)
	at org.apache.maven.DefaultMaven.execute(DefaultMaven.java:107)
	at org.apache.maven.cli.MavenCli.execute(MavenCli.java:993)
	at org.apache.maven.cli.MavenCli.doMain(MavenCli.java:345)
	at org.apache.maven.cli.MavenCli.main(MavenCli.java:191)
	at sun.reflect.NativeMethodAccessorImpl.invoke0(Native Method)
	at sun.reflect.NativeMethodAccessorImpl.invoke(NativeMethodAccessorImpl.java:62)
	at sun.reflect.DelegatingMethodAccessorImpl.invoke(DelegatingMethodAccessorImpl.java:43)
	at java.lang.reflect.Method.invoke(Method.java:498)
	at org.codehaus.plexus.classworlds.launcher.Launcher.launchEnhanced(Launcher.java:289)
	at org.codehaus.plexus.classworlds.launcher.Launcher.launch(Launcher.java:229)
	at org.codehaus.plexus.classworlds.launcher.Launcher.mainWithExitCode(Launcher.java:415)
	at org.codehaus.plexus.classworlds.launcher.Launcher.main(Launcher.java:356)
Caused by: org.apache.maven.plugin.MojoExecutionException: Command execution failed.
	at org.codehaus.mojo.exec.ExecMojo.execute(ExecMojo.java:326)
	at org.apache.maven.plugin.DefaultBuildPluginManager.executeMojo(DefaultBuildPluginManager.java:134)
	at org.apache.maven.lifecycle.internal.MojoExecutor.execute(MojoExecutor.java:208)
	... 20 more
Caused by: org.apache.commons.exec.ExecuteException: Process exited with an error: 1 (Exit
value: 1)
	at org.apache.commons.exec.DefaultExecutor.executeInternal(DefaultExecutor.java:404)
	at org.apache.commons.exec.DefaultExecutor.execute(DefaultExecutor.java:166)
	at org.codehaus.mojo.exec.ExecMojo.executeCommandLine(ExecMojo.java:804)
	at org.codehaus.mojo.exec.ExecMojo.executeCommandLine(ExecMojo.java:751)
	at org.codehaus.mojo.exec.ExecMojo.execute(ExecMojo.java:313)
	... 22 more
[ERROR] 
[ERROR] Re-run Maven using the -X switch to enable full debug logging.
[ERROR] 
[ERROR] For more information about the errors and possible solutions, please read the following
articles:
[ERROR] [Help 1] http://cwiki.apache.org/confluence/display/MAVEN/MojoExecutionException
Build step 'Execute shell' marked build as failure

Mime
View raw message