beam-commits mailing list archives

Site index · List index
Message view « Date » · « Thread »
Top « Date » · « Thread »
From Apache Jenkins Server <jenk...@builds.apache.org>
Subject Build failed in Jenkins: beam_PostCommit_Java_MavenInstall #4655
Date Sun, 27 Aug 2017 05:05:03 GMT
See <https://builds.apache.org/job/beam_PostCommit_Java_MavenInstall/4655/display/redirect?page=changes>

Changes:

[altay] Implement cancel and wait_until_finish(duration) for DataflowRunner

------------------------------------------
[...truncated 3.79 MB...]
2017-08-27T05:02:59.643 [INFO] Downloaded: https://repo.maven.apache.org/maven2/org/sonatype/sisu/inject/guice-parent/2.9.2/guice-parent-2.9.2.pom
(12 KB at 427.0 KB/sec)
2017-08-27T05:02:59.646 [INFO] Downloading: https://repo.maven.apache.org/maven2/org/slf4j/jcl-over-slf4j/1.7.21/jcl-over-slf4j-1.7.21.pom
2017-08-27T05:02:59.672 [INFO] Downloaded: https://repo.maven.apache.org/maven2/org/slf4j/jcl-over-slf4j/1.7.21/jcl-over-slf4j-1.7.21.pom
(963 B at 36.2 KB/sec)
2017-08-27T05:02:59.677 [INFO] Downloading: https://repo.maven.apache.org/maven2/org/apache/httpcomponents/httpmime/4.5.2/httpmime-4.5.2.jar
2017-08-27T05:02:59.677 [INFO] Downloading: https://repo.maven.apache.org/maven2/com/fasterxml/jackson/core/jackson-core/2.8.3/jackson-core-2.8.3.jar
2017-08-27T05:02:59.678 [INFO] Downloading: https://repo.maven.apache.org/maven2/com/fasterxml/jackson/core/jackson-databind/2.8.3/jackson-databind-2.8.3.jar
2017-08-27T05:02:59.678 [INFO] Downloading: https://repo.maven.apache.org/maven2/com/fasterxml/jackson/core/jackson-annotations/2.8.3/jackson-annotations-2.8.3.jar
2017-08-27T05:02:59.678 [INFO] Downloading: https://repo.maven.apache.org/maven2/org/eclipse/jgit/org.eclipse.jgit/4.5.0.201609210915-r/org.eclipse.jgit-4.5.0.201609210915-r.jar
2017-08-27T05:02:59.711 [INFO] Downloaded: https://repo.maven.apache.org/maven2/com/fasterxml/jackson/core/jackson-annotations/2.8.3/jackson-annotations-2.8.3.jar
(55 KB at 1598.4 KB/sec)
2017-08-27T05:02:59.711 [INFO] Downloading: https://repo.maven.apache.org/maven2/com/jcraft/jsch/0.1.53/jsch-0.1.53.jar
2017-08-27T05:02:59.712 [INFO] Downloaded: https://repo.maven.apache.org/maven2/org/apache/httpcomponents/httpmime/4.5.2/httpmime-4.5.2.jar
(41 KB at 1113.0 KB/sec)
2017-08-27T05:02:59.712 [INFO] Downloading: https://repo.maven.apache.org/maven2/com/googlecode/javaewah/JavaEWAH/0.7.9/JavaEWAH-0.7.9.jar
2017-08-27T05:02:59.744 [INFO] Downloaded: https://repo.maven.apache.org/maven2/com/fasterxml/jackson/core/jackson-core/2.8.3/jackson-core-2.8.3.jar
(275 KB at 4096.9 KB/sec)
2017-08-27T05:02:59.744 [INFO] Downloading: https://repo.maven.apache.org/maven2/org/codehaus/plexus/plexus-utils/2.0.7/plexus-utils-2.0.7.jar
2017-08-27T05:02:59.760 [INFO] Downloaded: https://repo.maven.apache.org/maven2/com/googlecode/javaewah/JavaEWAH/0.7.9/JavaEWAH-0.7.9.jar
(123 KB at 1490.4 KB/sec)
2017-08-27T05:02:59.760 [INFO] Downloading: https://repo.maven.apache.org/maven2/org/sonatype/sisu/sisu-inject-plexus/1.4.3.2/sisu-inject-plexus-1.4.3.2.jar
2017-08-27T05:02:59.778 [INFO] Downloaded: https://repo.maven.apache.org/maven2/com/jcraft/jsch/0.1.53/jsch-0.1.53.jar
(274 KB at 2736.4 KB/sec)
2017-08-27T05:02:59.778 [INFO] Downloading: https://repo.maven.apache.org/maven2/org/sonatype/sisu/sisu-inject-bean/1.4.3.2/sisu-inject-bean-1.4.3.2.jar
2017-08-27T05:02:59.800 [INFO] Downloaded: https://repo.maven.apache.org/maven2/org/codehaus/plexus/plexus-utils/2.0.7/plexus-utils-2.0.7.jar
(219 KB at 1792.6 KB/sec)
2017-08-27T05:02:59.800 [INFO] Downloading: https://repo.maven.apache.org/maven2/org/sonatype/sisu/sisu-guice/2.9.2/sisu-guice-2.9.2-no_aop.jar
2017-08-27T05:02:59.823 [INFO] Downloaded: https://repo.maven.apache.org/maven2/org/sonatype/sisu/sisu-inject-plexus/1.4.3.2/sisu-inject-plexus-1.4.3.2.jar
(201 KB at 1379.8 KB/sec)
2017-08-27T05:02:59.824 [INFO] Downloading: https://repo.maven.apache.org/maven2/org/slf4j/slf4j-api/1.7.21/slf4j-api-1.7.21.jar
2017-08-27T05:02:59.825 [INFO] Downloaded: https://repo.maven.apache.org/maven2/org/sonatype/sisu/sisu-inject-bean/1.4.3.2/sisu-inject-bean-1.4.3.2.jar
(157 KB at 1065.8 KB/sec)
2017-08-27T05:02:59.825 [INFO] Downloading: https://repo.maven.apache.org/maven2/org/slf4j/jcl-over-slf4j/1.7.21/jcl-over-slf4j-1.7.21.jar
2017-08-27T05:02:59.829 [INFO] Downloaded: https://repo.maven.apache.org/maven2/com/fasterxml/jackson/core/jackson-databind/2.8.3/jackson-databind-2.8.3.jar
(1205 KB at 7926.2 KB/sec)
2017-08-27T05:02:59.852 [INFO] Downloaded: https://repo.maven.apache.org/maven2/org/slf4j/jcl-over-slf4j/1.7.21/jcl-over-slf4j-1.7.21.jar
(17 KB at 92.2 KB/sec)
2017-08-27T05:02:59.859 [INFO] Downloaded: https://repo.maven.apache.org/maven2/org/slf4j/slf4j-api/1.7.21/slf4j-api-1.7.21.jar
(41 KB at 221.6 KB/sec)
2017-08-27T05:02:59.892 [INFO] Downloaded: https://repo.maven.apache.org/maven2/org/sonatype/sisu/sisu-guice/2.9.2/sisu-guice-2.9.2-no_aop.jar
(469 KB at 2189.6 KB/sec)
2017-08-27T05:02:59.948 [INFO] Downloaded: https://repo.maven.apache.org/maven2/org/eclipse/jgit/org.eclipse.jgit/4.5.0.201609210915-r/org.eclipse.jgit-4.5.0.201609210915-r.jar
(2324 KB at 8605.0 KB/sec)
2017-08-27T05:03:00.463 [INFO] Starting Coveralls job for jenkins (4655 / https://builds.apache.org/job/beam_PostCommit_Java_MavenInstall/4655/)
2017-08-27T05:03:00.464 [INFO] Using repository token <secret>
2017-08-27T05:03:00.464 [INFO] Git commit d50c964 in master
2017-08-27T05:03:00.464 [INFO] Writing Coveralls data to <https://builds.apache.org/job/beam_PostCommit_Java_MavenInstall/ws/target/coveralls.json...>
2017-08-27T05:03:00.511 [INFO] Processing coverage report from <https://builds.apache.org/job/beam_PostCommit_Java_MavenInstall/ws/sdks/java/core/target/site/jacoco/jacoco.xml>
2017-08-27T05:03:00.861 [INFO] Processing coverage report from <https://builds.apache.org/job/beam_PostCommit_Java_MavenInstall/ws/sdks/java/extensions/google-cloud-platform-core/target/site/jacoco/jacoco.xml>
2017-08-27T05:03:00.905 [INFO] Processing coverage report from <https://builds.apache.org/job/beam_PostCommit_Java_MavenInstall/ws/sdks/java/extensions/protobuf/target/site/jacoco/jacoco.xml>
2017-08-27T05:03:00.929 [INFO] Processing coverage report from <https://builds.apache.org/job/beam_PostCommit_Java_MavenInstall/ws/sdks/java/java8tests/target/site/jacoco/jacoco.xml>
2017-08-27T05:03:00.929 [INFO] Processing coverage report from <https://builds.apache.org/job/beam_PostCommit_Java_MavenInstall/ws/runners/core-java/target/site/jacoco/jacoco.xml>
2017-08-27T05:03:01.170 [INFO] Processing coverage report from <https://builds.apache.org/job/beam_PostCommit_Java_MavenInstall/ws/runners/direct-java/target/site/jacoco/jacoco.xml>
2017-08-27T05:03:01.334 [INFO] Processing coverage report from <https://builds.apache.org/job/beam_PostCommit_Java_MavenInstall/ws/runners/google-cloud-dataflow-java/target/site/jacoco/jacoco.xml>
2017-08-27T05:03:01.452 [INFO] Processing coverage report from <https://builds.apache.org/job/beam_PostCommit_Java_MavenInstall/ws/examples/java/target/site/jacoco/jacoco.xml>
2017-08-27T05:03:01.522 [INFO] Processing coverage report from <https://builds.apache.org/job/beam_PostCommit_Java_MavenInstall/ws/examples/java8/target/site/jacoco/jacoco.xml>
2017-08-27T05:03:01.572 [INFO] Successfully wrote Coveralls data in 1108ms
2017-08-27T05:03:01.573 [INFO] Gathered code coverage metrics for 526 source files with 119425
lines of code:
2017-08-27T05:03:01.573 [INFO] - 30318 relevant lines
2017-08-27T05:03:01.573 [INFO] - 21214 covered lines
2017-08-27T05:03:01.573 [INFO] - 9104 missed lines
2017-08-27T05:03:01.573 [INFO] Submitting Coveralls data to API
2017-08-27T05:04:01.748 [ERROR] Submission failed in 60175ms while handling I/O operations
[JENKINS] Archiving disabled
[JENKINS] Archiving disabled
[JENKINS] Archiving disabled
[JENKINS] Archiving disabled
[JENKINS] Archiving disabled
[JENKINS] Archiving disabled
[JENKINS] Archiving disabled
[JENKINS] Archiving disabled
[JENKINS] Archiving disabled
[JENKINS] Archiving disabled
[JENKINS] Archiving disabled
[JENKINS] Archiving disabled
[JENKINS] Archiving disabled
[JENKINS] Archiving disabled
[JENKINS] Archiving disabled
[JENKINS] Archiving disabled
[JENKINS] Archiving disabled
[JENKINS] Archiving disabled
[JENKINS] Archiving disabled
[JENKINS] Archiving disabled
[JENKINS] Archiving disabled
[JENKINS] Archiving disabled
[JENKINS] Archiving disabled
[JENKINS] Archiving disabled
[JENKINS] Archiving disabled
[JENKINS] Archiving disabled
[JENKINS] Archiving disabled
[JENKINS] Archiving disabled
[JENKINS] Archiving disabled
[JENKINS] Archiving disabled
[JENKINS] Archiving disabled
[JENKINS] Archiving disabled
[JENKINS] Archiving disabled
[JENKINS] Archiving disabled
[JENKINS] Archiving disabled
[JENKINS] Archiving disabled
[JENKINS] Archiving disabled
[JENKINS] Archiving disabled
[JENKINS] Archiving disabled
[JENKINS] Archiving disabled
[JENKINS] Archiving disabled
[JENKINS] Archiving disabled
[JENKINS] Archiving disabled
[JENKINS] Archiving disabled
[JENKINS] Archiving disabled
[JENKINS] Archiving disabled
[JENKINS] Archiving disabled
[JENKINS] Archiving disabled
[JENKINS] Archiving disabled
[JENKINS] Archiving disabled
[JENKINS] Archiving disabled
[JENKINS] Archiving disabled
[JENKINS] Archiving disabled
[JENKINS] Archiving disabled
[JENKINS] Archiving disabled
[JENKINS] Archiving disabled
[JENKINS] Archiving disabled
2017-08-27T05:04:53.710 [INFO] ------------------------------------------------------------------------
2017-08-27T05:04:53.710 [INFO] Reactor Summary:
2017-08-27T05:04:53.710 [INFO] 
2017-08-27T05:04:53.710 [INFO] Apache Beam :: Parent .............................. FAILURE
[01:03 min]
2017-08-27T05:04:53.710 [INFO] Apache Beam :: SDKs :: Java :: Build Tools ......... SUCCESS
[ 10.223 s]
2017-08-27T05:04:53.710 [INFO] Apache Beam :: SDKs ................................ SUCCESS
[  5.715 s]
2017-08-27T05:04:53.710 [INFO] Apache Beam :: SDKs :: Common ...................... SUCCESS
[  3.417 s]
2017-08-27T05:04:53.710 [INFO] Apache Beam :: SDKs :: Common :: Runner API ........ SUCCESS
[ 26.840 s]
2017-08-27T05:04:53.710 [INFO] Apache Beam :: SDKs :: Common :: Fn API ............ SUCCESS
[ 17.747 s]
2017-08-27T05:04:53.710 [INFO] Apache Beam :: SDKs :: Java ........................ SUCCESS
[  3.164 s]
2017-08-27T05:04:53.710 [INFO] Apache Beam :: SDKs :: Java :: Core ................ SUCCESS
[03:12 min]
2017-08-27T05:04:53.710 [INFO] Apache Beam :: Runners ............................. SUCCESS
[  2.956 s]
2017-08-27T05:04:53.710 [INFO] Apache Beam :: Runners :: Core Construction Java ... SUCCESS
[ 40.998 s]
2017-08-27T05:04:53.710 [INFO] Apache Beam :: Runners :: Core Java ................ SUCCESS
[ 54.919 s]
2017-08-27T05:04:53.710 [INFO] Apache Beam :: Runners :: Direct Java .............. SUCCESS
[05:07 min]
2017-08-27T05:04:53.710 [INFO] Apache Beam :: SDKs :: Java :: IO .................. SUCCESS
[  3.115 s]
2017-08-27T05:04:53.710 [INFO] Apache Beam :: SDKs :: Java :: IO :: AMQP .......... SUCCESS
[ 48.208 s]
2017-08-27T05:04:53.710 [INFO] Apache Beam :: SDKs :: Java :: IO :: Common ........ SUCCESS
[  8.060 s]
2017-08-27T05:04:53.710 [INFO] Apache Beam :: SDKs :: Java :: IO :: Cassandra ..... SUCCESS
[ 45.060 s]
2017-08-27T05:04:53.710 [INFO] Apache Beam :: SDKs :: Java :: IO :: Elasticsearch . SUCCESS
[ 44.003 s]
2017-08-27T05:04:53.710 [INFO] Apache Beam :: SDKs :: Java :: Extensions .......... SUCCESS
[  3.064 s]
2017-08-27T05:04:53.710 [INFO] Apache Beam :: SDKs :: Java :: Extensions :: Google Cloud Platform
Core SUCCESS [ 32.847 s]
2017-08-27T05:04:53.710 [INFO] Apache Beam :: SDKs :: Java :: Extensions :: Protobuf SUCCESS
[ 38.045 s]
2017-08-27T05:04:53.710 [INFO] Apache Beam :: SDKs :: Java :: IO :: Google Cloud Platform
SUCCESS [01:38 min]
2017-08-27T05:04:53.710 [INFO] Apache Beam :: SDKs :: Java :: IO :: Hadoop Common . SUCCESS
[ 24.687 s]
2017-08-27T05:04:53.710 [INFO] Apache Beam :: SDKs :: Java :: IO :: Hadoop File System SUCCESS
[ 50.793 s]
2017-08-27T05:04:53.710 [INFO] Apache Beam :: SDKs :: Java :: IO :: Hadoop ........ SUCCESS
[  5.628 s]
2017-08-27T05:04:53.710 [INFO] Apache Beam :: SDKs :: Java :: IO :: Hadoop :: input-format
SUCCESS [ 27.776 s]
2017-08-27T05:04:53.710 [INFO] Apache Beam :: Runners :: Google Cloud Dataflow .... SUCCESS
[08:42 min]
2017-08-27T05:04:53.710 [INFO] Apache Beam :: SDKs :: Java :: IO :: Hadoop :: jdk1.8-tests
SUCCESS [01:43 min]
2017-08-27T05:04:53.710 [INFO] Apache Beam :: SDKs :: Java :: IO :: HBase ......... SUCCESS
[01:38 min]
2017-08-27T05:04:53.710 [INFO] Apache Beam :: SDKs :: Java :: IO :: HCatalog ...... SUCCESS
[01:14 min]
2017-08-27T05:04:53.711 [INFO] Apache Beam :: SDKs :: Java :: IO :: JDBC .......... SUCCESS
[ 45.999 s]
2017-08-27T05:04:53.711 [INFO] Apache Beam :: SDKs :: Java :: IO :: JMS ........... SUCCESS
[ 26.572 s]
2017-08-27T05:04:53.711 [INFO] Apache Beam :: SDKs :: Java :: IO :: Kafka ......... SUCCESS
[ 49.098 s]
2017-08-27T05:04:53.711 [INFO] Apache Beam :: SDKs :: Java :: IO :: Kinesis ....... SUCCESS
[ 29.364 s]
2017-08-27T05:04:53.711 [INFO] Apache Beam :: SDKs :: Java :: IO :: MongoDB ....... SUCCESS
[ 44.472 s]
2017-08-27T05:04:53.711 [INFO] Apache Beam :: SDKs :: Java :: IO :: MQTT .......... SUCCESS
[ 27.853 s]
2017-08-27T05:04:53.711 [INFO] Apache Beam :: SDKs :: Java :: IO :: Solr .......... SUCCESS
[ 46.629 s]
2017-08-27T05:04:53.711 [INFO] Apache Beam :: SDKs :: Java :: IO :: XML ........... SUCCESS
[ 35.067 s]
2017-08-27T05:04:53.711 [INFO] Apache Beam :: SDKs :: Java :: Maven Archetypes .... SUCCESS
[  2.880 s]
2017-08-27T05:04:53.711 [INFO] Apache Beam :: SDKs :: Java :: Maven Archetypes :: Starter
SUCCESS [ 15.282 s]
2017-08-27T05:04:53.711 [INFO] Apache Beam :: Examples ............................ SUCCESS
[  2.893 s]
2017-08-27T05:04:53.711 [INFO] Apache Beam :: Examples :: Java .................... SUCCESS
[07:55 min]
2017-08-27T05:04:53.711 [INFO] Apache Beam :: SDKs :: Java :: Maven Archetypes :: Examples
SUCCESS [ 48.538 s]
2017-08-27T05:04:53.711 [INFO] Apache Beam :: Examples :: Java 8 .................. SUCCESS
[ 33.086 s]
2017-08-27T05:04:53.711 [INFO] Apache Beam :: SDKs :: Java :: Maven Archetypes :: Examples
- Java 8 SUCCESS [ 50.472 s]
2017-08-27T05:04:53.711 [INFO] Apache Beam :: SDKs :: Java :: Extensions :: Jackson SUCCESS
[ 23.300 s]
2017-08-27T05:04:53.711 [INFO] Apache Beam :: SDKs :: Java :: Extensions :: Join library SUCCESS
[ 26.855 s]
2017-08-27T05:04:53.711 [INFO] Apache Beam :: SDKs :: Java :: Extensions :: Sorter  SUCCESS
[ 48.166 s]
2017-08-27T05:04:53.711 [INFO] Apache Beam :: SDKs :: Java :: Nexmark ............. SUCCESS
[02:39 min]
2017-08-27T05:04:53.711 [INFO] Apache Beam :: SDKs :: Java :: Harness ............. SUCCESS
[ 46.479 s]
2017-08-27T05:04:53.711 [INFO] Apache Beam :: SDKs :: Java :: Java 8 Tests ........ SUCCESS
[ 24.601 s]
2017-08-27T05:04:53.711 [INFO] Apache Beam :: SDKs :: Python ...................... SUCCESS
[32:09 min]
2017-08-27T05:04:53.711 [INFO] Apache Beam :: Runners :: Flink .................... SUCCESS
[ 56.672 s]
2017-08-27T05:04:53.711 [INFO] Apache Beam :: Runners :: Spark .................... SUCCESS
[02:58 min]
2017-08-27T05:04:53.711 [INFO] Apache Beam :: Runners :: Apex ..................... SUCCESS
[01:23 min]
2017-08-27T05:04:53.711 [INFO] Apache Beam :: Runners :: Gearpump ................. SUCCESS
[ 46.875 s]
2017-08-27T05:04:53.711 [INFO] Apache Beam :: SDKs :: Java :: Aggregated Javadoc .. SUCCESS
[ 28.737 s]
2017-08-27T05:04:53.711 [INFO] ------------------------------------------------------------------------
2017-08-27T05:04:53.711 [INFO] BUILD FAILURE
2017-08-27T05:04:53.711 [INFO] ------------------------------------------------------------------------
2017-08-27T05:04:53.711 [INFO] Total time: 01:35 h
2017-08-27T05:04:53.711 [INFO] Finished at: 2017-08-27T05:04:53+00:00
2017-08-27T05:04:54.397 [INFO] Final Memory: 309M/1879M
2017-08-27T05:04:54.397 [INFO] ------------------------------------------------------------------------
2017-08-27T05:04:54.403 [ERROR] Failed to execute goal org.eluder.coveralls:coveralls-maven-plugin:4.3.0:report
(default-cli) on project beam-parent: I/O operation failed: Read timed out -> [Help 1]
org.apache.maven.lifecycle.LifecycleExecutionException: Failed to execute goal org.eluder.coveralls:coveralls-maven-plugin:4.3.0:report
(default-cli) on project beam-parent: I/O operation failed
	at org.apache.maven.lifecycle.internal.MojoExecutor.execute(MojoExecutor.java:212)
	at org.apache.maven.lifecycle.internal.MojoExecutor.execute(MojoExecutor.java:153)
	at org.apache.maven.lifecycle.internal.MojoExecutor.execute(MojoExecutor.java:145)
	at org.apache.maven.lifecycle.internal.LifecycleModuleBuilder.buildProject(LifecycleModuleBuilder.java:116)
	at org.apache.maven.lifecycle.internal.LifecycleModuleBuilder.buildProject(LifecycleModuleBuilder.java:80)
	at org.apache.maven.lifecycle.internal.builder.singlethreaded.SingleThreadedBuilder.build(SingleThreadedBuilder.java:51)
	at org.apache.maven.lifecycle.internal.LifecycleStarter.execute(LifecycleStarter.java:128)
	at org.apache.maven.DefaultMaven.doExecute(DefaultMaven.java:307)
	at org.apache.maven.DefaultMaven.doExecute(DefaultMaven.java:193)
	at org.apache.maven.DefaultMaven.execute(DefaultMaven.java:106)
	at org.jvnet.hudson.maven3.launcher.Maven33Launcher.main(Maven33Launcher.java:129)
	at sun.reflect.NativeMethodAccessorImpl.invoke0(Native Method)
	at sun.reflect.NativeMethodAccessorImpl.invoke(NativeMethodAccessorImpl.java:62)
	at sun.reflect.DelegatingMethodAccessorImpl.invoke(DelegatingMethodAccessorImpl.java:43)
	at java.lang.reflect.Method.invoke(Method.java:498)
	at org.codehaus.plexus.classworlds.launcher.Launcher.launchStandard(Launcher.java:330)
	at org.codehaus.plexus.classworlds.launcher.Launcher.launch(Launcher.java:238)
	at jenkins.maven3.agent.Maven33Main.launch(Maven33Main.java:176)
	at sun.reflect.NativeMethodAccessorImpl.invoke0(Native Method)
	at sun.reflect.NativeMethodAccessorImpl.invoke(NativeMethodAccessorImpl.java:62)
	at sun.reflect.DelegatingMethodAccessorImpl.invoke(DelegatingMethodAccessorImpl.java:43)
	at java.lang.reflect.Method.invoke(Method.java:498)
	at hudson.maven.Maven3Builder.call(Maven3Builder.java:139)
	at hudson.maven.Maven3Builder.call(Maven3Builder.java:70)
	at hudson.remoting.UserRequest.perform(UserRequest.java:153)
	at hudson.remoting.UserRequest.perform(UserRequest.java:50)
	at hudson.remoting.Request$2.run(Request.java:336)
	at hudson.remoting.InterceptingExecutorService$1.call(InterceptingExecutorService.java:68)
	at java.util.concurrent.FutureTask.run(FutureTask.java:266)
	at java.util.concurrent.ThreadPoolExecutor.runWorker(ThreadPoolExecutor.java:1149)
	at java.util.concurrent.ThreadPoolExecutor$Worker.run(ThreadPoolExecutor.java:624)
	at java.lang.Thread.run(Thread.java:748)
Caused by: org.apache.maven.plugin.MojoFailureException: I/O operation failed
	at org.eluder.coveralls.maven.plugin.CoverallsReportMojo.execute(CoverallsReportMojo.java:259)
	at org.apache.maven.plugin.DefaultBuildPluginManager.executeMojo(DefaultBuildPluginManager.java:134)
	at org.apache.maven.lifecycle.internal.MojoExecutor.execute(MojoExecutor.java:208)
	... 31 more
Caused by: java.net.SocketTimeoutException: Read timed out
	at java.net.SocketInputStream.socketRead0(Native Method)
	at java.net.SocketInputStream.socketRead(SocketInputStream.java:116)
	at java.net.SocketInputStream.read(SocketInputStream.java:171)
	at java.net.SocketInputStream.read(SocketInputStream.java:141)
	at sun.security.ssl.InputRecord.readFully(InputRecord.java:465)
	at sun.security.ssl.InputRecord.read(InputRecord.java:503)
	at sun.security.ssl.SSLSocketImpl.readRecord(SSLSocketImpl.java:983)
	at sun.security.ssl.SSLSocketImpl.readDataRecord(SSLSocketImpl.java:940)
	at sun.security.ssl.AppInputStream.read(AppInputStream.java:105)
	at org.apache.http.impl.io.SessionInputBufferImpl.streamRead(SessionInputBufferImpl.java:139)
	at org.apache.http.impl.io.SessionInputBufferImpl.fillBuffer(SessionInputBufferImpl.java:155)
	at org.apache.http.impl.io.SessionInputBufferImpl.readLine(SessionInputBufferImpl.java:284)
	at org.apache.http.impl.conn.DefaultHttpResponseParser.parseHead(DefaultHttpResponseParser.java:140)
	at org.apache.http.impl.conn.DefaultHttpResponseParser.parseHead(DefaultHttpResponseParser.java:57)
	at org.apache.http.impl.io.AbstractMessageParser.parse(AbstractMessageParser.java:261)
	at org.apache.http.impl.DefaultBHttpClientConnection.receiveResponseHeader(DefaultBHttpClientConnection.java:165)
	at org.apache.http.impl.conn.CPoolProxy.receiveResponseHeader(CPoolProxy.java:167)
	at org.apache.http.protocol.HttpRequestExecutor.doReceiveResponse(HttpRequestExecutor.java:272)
	at org.apache.http.protocol.HttpRequestExecutor.execute(HttpRequestExecutor.java:124)
	at org.apache.http.impl.execchain.MainClientExec.execute(MainClientExec.java:271)
	at org.apache.http.impl.execchain.ProtocolExec.execute(ProtocolExec.java:184)
	at org.apache.http.impl.execchain.RetryExec.execute(RetryExec.java:88)
	at org.apache.http.impl.execchain.RedirectExec.execute(RedirectExec.java:110)
	at org.apache.http.impl.client.InternalHttpClient.doExecute(InternalHttpClient.java:184)
	at org.apache.http.impl.client.CloseableHttpClient.execute(CloseableHttpClient.java:82)
	at org.apache.http.impl.client.CloseableHttpClient.execute(CloseableHttpClient.java:107)
	at org.apache.http.impl.client.CloseableHttpClient.execute(CloseableHttpClient.java:55)
	at org.eluder.coveralls.maven.plugin.httpclient.CoverallsClient.submit(CoverallsClient.java:84)
	at org.eluder.coveralls.maven.plugin.CoverallsReportMojo.submitData(CoverallsReportMojo.java:400)
	at org.eluder.coveralls.maven.plugin.CoverallsReportMojo.execute(CoverallsReportMojo.java:254)
	... 33 more
2017-08-27T05:04:54.404 [ERROR] 
2017-08-27T05:04:54.404 [ERROR] Re-run Maven using the -X switch to enable full debug logging.
2017-08-27T05:04:54.404 [ERROR] 
2017-08-27T05:04:54.404 [ERROR] For more information about the errors and possible solutions,
please read the following articles:
2017-08-27T05:04:54.404 [ERROR] [Help 1] http://cwiki.apache.org/confluence/display/MAVEN/MojoFailureException
channel stopped

Mime
View raw message