beam-commits mailing list archives

Site index · List index
Message view « Date » · « Thread »
Top « Date » · « Thread »
From Apache Jenkins Server <jenk...@builds.apache.org>
Subject Build failed in Jenkins: beam_PostCommit_Java_ValidatesRunner_Apex #1961
Date Tue, 11 Jul 2017 12:17:50 GMT
See <https://builds.apache.org/job/beam_PostCommit_Java_ValidatesRunner_Apex/1961/display/redirect>

------------------------------------------
[...truncated 270.43 KB...]
2017-07-11T12:14:50.242 [INFO] Copying 2 resources
2017-07-11T12:14:50.244 [INFO] Copying 3 resources
2017-07-11T12:14:50.333 [INFO] 
2017-07-11T12:14:50.333 [INFO] --- maven-compiler-plugin:3.6.1:compile (default-compile) @
beam-sdks-common-runner-api ---
2017-07-11T12:14:50.357 [INFO] Changes detected - recompiling the module!
2017-07-11T12:14:50.358 [INFO] Compiling 2 source files to <https://builds.apache.org/job/beam_PostCommit_Java_ValidatesRunner_Apex/ws/sdks/common/runner-api/target/classes>
2017-07-11T12:14:55.038 [WARNING] bootstrap class path not set in conjunction with -source
1.7
2017-07-11T12:14:55.088 [INFO] 
2017-07-11T12:14:55.088 [INFO] --- maven-resources-plugin:3.0.2:testResources (default-testResources)
@ beam-sdks-common-runner-api ---
2017-07-11T12:14:55.090 [INFO] Using 'UTF-8' encoding to copy filtered resources.
2017-07-11T12:14:55.090 [INFO] skip non existing resourceDirectory <https://builds.apache.org/job/beam_PostCommit_Java_ValidatesRunner_Apex/ws/sdks/common/runner-api/src/test/resources>
2017-07-11T12:14:55.091 [INFO] Copying 3 resources
2017-07-11T12:14:55.179 [INFO] 
2017-07-11T12:14:55.179 [INFO] --- maven-compiler-plugin:3.6.1:testCompile (default-testCompile)
@ beam-sdks-common-runner-api ---
2017-07-11T12:14:55.183 [INFO] No sources to compile
2017-07-11T12:14:55.235 [INFO] 
2017-07-11T12:14:55.235 [INFO] --- maven-checkstyle-plugin:2.17:check (default) @ beam-sdks-common-runner-api
---
2017-07-11T12:14:55.287 [INFO] 
2017-07-11T12:14:55.287 [INFO] >>> findbugs-maven-plugin:3.0.4:check (default) >
:findbugs @ beam-sdks-common-runner-api >>>
2017-07-11T12:14:55.290 [INFO] 
2017-07-11T12:14:55.290 [INFO] --- findbugs-maven-plugin:3.0.4:findbugs (findbugs) @ beam-sdks-common-runner-api
---
2017-07-11T12:14:55.294 [INFO] Downloading: https://repo.maven.apache.org/maven2/com/google/code/findbugs/findbugs/3.0.1/findbugs-3.0.1.pom
2017-07-11T12:14:55.322 [INFO] Downloaded: https://repo.maven.apache.org/maven2/com/google/code/findbugs/findbugs/3.0.1/findbugs-3.0.1.pom
(11 KB at 375.5 KB/sec)
2017-07-11T12:14:55.325 [INFO] Downloading: https://repo.maven.apache.org/maven2/net/jcip/jcip-annotations/1.0/jcip-annotations-1.0.pom
2017-07-11T12:14:55.351 [INFO] Downloaded: https://repo.maven.apache.org/maven2/net/jcip/jcip-annotations/1.0/jcip-annotations-1.0.pom
(491 B at 18.4 KB/sec)
2017-07-11T12:14:55.353 [INFO] Downloading: https://repo.maven.apache.org/maven2/com/google/code/findbugs/bcel-findbugs/6.0/bcel-findbugs-6.0.pom
2017-07-11T12:14:55.378 [INFO] Downloaded: https://repo.maven.apache.org/maven2/com/google/code/findbugs/bcel-findbugs/6.0/bcel-findbugs-6.0.pom
(4 KB at 150.4 KB/sec)
2017-07-11T12:14:55.380 [INFO] Downloading: https://repo.maven.apache.org/maven2/com/google/code/findbugs/jFormatString/2.0.1/jFormatString-2.0.1.pom
2017-07-11T12:14:55.407 [INFO] Downloaded: https://repo.maven.apache.org/maven2/com/google/code/findbugs/jFormatString/2.0.1/jFormatString-2.0.1.pom
(950 B at 34.4 KB/sec)
2017-07-11T12:14:55.409 [INFO] Downloading: https://repo.maven.apache.org/maven2/dom4j/dom4j/1.6.1/dom4j-1.6.1.pom
2017-07-11T12:14:55.436 [INFO] Downloaded: https://repo.maven.apache.org/maven2/dom4j/dom4j/1.6.1/dom4j-1.6.1.pom
(7 KB at 244.7 KB/sec)
2017-07-11T12:14:55.439 [INFO] Downloading: https://repo.maven.apache.org/maven2/org/ow2/asm/asm-debug-all/5.0.2/asm-debug-all-5.0.2.pom
2017-07-11T12:14:55.465 [INFO] Downloaded: https://repo.maven.apache.org/maven2/org/ow2/asm/asm-debug-all/5.0.2/asm-debug-all-5.0.2.pom
(2 KB at 74.5 KB/sec)
2017-07-11T12:14:55.468 [INFO] Downloading: https://repo.maven.apache.org/maven2/org/ow2/asm/asm-commons/5.0.2/asm-commons-5.0.2.pom
2017-07-11T12:14:55.493 [INFO] Downloaded: https://repo.maven.apache.org/maven2/org/ow2/asm/asm-commons/5.0.2/asm-commons-5.0.2.pom
(3 KB at 81.8 KB/sec)
2017-07-11T12:14:55.520 [INFO] Downloading: https://repo.maven.apache.org/maven2/org/ow2/asm/asm-tree/5.0.2/asm-tree-5.0.2.pom
2017-07-11T12:14:55.548 [INFO] Downloaded: https://repo.maven.apache.org/maven2/org/ow2/asm/asm-tree/5.0.2/asm-tree-5.0.2.pom
(3 KB at 72.6 KB/sec)
2017-07-11T12:14:55.551 [INFO] Downloading: https://repo.maven.apache.org/maven2/jaxen/jaxen/1.1.6/jaxen-1.1.6.pom
2017-07-11T12:14:55.578 [INFO] Downloaded: https://repo.maven.apache.org/maven2/jaxen/jaxen/1.1.6/jaxen-1.1.6.pom
(14 KB at 492.0 KB/sec)
2017-07-11T12:14:55.582 [INFO] Downloading: https://repo.maven.apache.org/maven2/org/apache/ant/ant/1.9.4/ant-1.9.4.pom
2017-07-11T12:14:55.608 [INFO] Downloaded: https://repo.maven.apache.org/maven2/org/apache/ant/ant/1.9.4/ant-1.9.4.pom
(10 KB at 361.5 KB/sec)
2017-07-11T12:14:55.610 [INFO] Downloading: https://repo.maven.apache.org/maven2/org/apache/ant/ant-parent/1.9.4/ant-parent-1.9.4.pom
2017-07-11T12:14:55.636 [INFO] Downloaded: https://repo.maven.apache.org/maven2/org/apache/ant/ant-parent/1.9.4/ant-parent-1.9.4.pom
(6 KB at 210.4 KB/sec)
2017-07-11T12:14:55.638 [INFO] Downloading: https://repo.maven.apache.org/maven2/org/apache/ant/ant-launcher/1.9.4/ant-launcher-1.9.4.pom
2017-07-11T12:14:55.667 [INFO] Downloaded: https://repo.maven.apache.org/maven2/org/apache/ant/ant-launcher/1.9.4/ant-launcher-1.9.4.pom
(3 KB at 78.6 KB/sec)
2017-07-11T12:14:55.669 [INFO] Downloading: https://repo.maven.apache.org/maven2/org/codehaus/groovy/groovy/2.4.7/groovy-2.4.7.pom
2017-07-11T12:14:55.695 [INFO] Downloaded: https://repo.maven.apache.org/maven2/org/codehaus/groovy/groovy/2.4.7/groovy-2.4.7.pom
(17 KB at 634.9 KB/sec)
2017-07-11T12:14:55.697 [INFO] Downloading: https://repo.maven.apache.org/maven2/org/codehaus/groovy/groovy-ant/2.4.7/groovy-ant-2.4.7.pom
2017-07-11T12:14:55.724 [INFO] Downloaded: https://repo.maven.apache.org/maven2/org/codehaus/groovy/groovy-ant/2.4.7/groovy-ant-2.4.7.pom
(17 KB at 597.7 KB/sec)
2017-07-11T12:14:55.726 [INFO] Downloading: https://repo.maven.apache.org/maven2/org/apache/ant/ant-antlr/1.9.4/ant-antlr-1.9.4.pom
2017-07-11T12:14:55.751 [INFO] Downloaded: https://repo.maven.apache.org/maven2/org/apache/ant/ant-antlr/1.9.4/ant-antlr-1.9.4.pom
(4 KB at 120.2 KB/sec)
2017-07-11T12:14:55.753 [INFO] Downloading: https://repo.maven.apache.org/maven2/org/codehaus/groovy/groovy-groovydoc/2.4.7/groovy-groovydoc-2.4.7.pom
2017-07-11T12:14:55.781 [INFO] Downloaded: https://repo.maven.apache.org/maven2/org/codehaus/groovy/groovy-groovydoc/2.4.7/groovy-groovydoc-2.4.7.pom
(16 KB at 546.7 KB/sec)
2017-07-11T12:14:55.783 [INFO] Downloading: https://repo.maven.apache.org/maven2/org/codehaus/groovy/groovy-templates/2.4.7/groovy-templates-2.4.7.pom
2017-07-11T12:14:55.810 [INFO] Downloaded: https://repo.maven.apache.org/maven2/org/codehaus/groovy/groovy-templates/2.4.7/groovy-templates-2.4.7.pom
(16 KB at 566.8 KB/sec)
2017-07-11T12:14:55.813 [INFO] Downloading: https://repo.maven.apache.org/maven2/org/codehaus/groovy/groovy-xml/2.4.7/groovy-xml-2.4.7.pom
2017-07-11T12:14:55.839 [INFO] Downloaded: https://repo.maven.apache.org/maven2/org/codehaus/groovy/groovy-xml/2.4.7/groovy-xml-2.4.7.pom
(16 KB at 581.5 KB/sec)
2017-07-11T12:14:55.841 [INFO] Downloading: https://repo.maven.apache.org/maven2/org/apache/ant/ant-junit/1.9.4/ant-junit-1.9.4.pom
2017-07-11T12:14:55.867 [INFO] Downloaded: https://repo.maven.apache.org/maven2/org/apache/ant/ant-junit/1.9.4/ant-junit-1.9.4.pom
(4 KB at 152.2 KB/sec)
2017-07-11T12:14:55.870 [INFO] Downloading: https://repo.maven.apache.org/maven2/org/apache/maven/reporting/maven-reporting-impl/2.1/maven-reporting-impl-2.1.pom
2017-07-11T12:14:55.897 [INFO] Downloaded: https://repo.maven.apache.org/maven2/org/apache/maven/reporting/maven-reporting-impl/2.1/maven-reporting-impl-2.1.pom
(5 KB at 163.6 KB/sec)
2017-07-11T12:14:55.899 [INFO] Downloading: https://repo.maven.apache.org/maven2/org/apache/maven/maven-project/2.0.10/maven-project-2.0.10.pom
2017-07-11T12:14:55.925 [INFO] Downloaded: https://repo.maven.apache.org/maven2/org/apache/maven/maven-project/2.0.10/maven-project-2.0.10.pom
(3 KB at 106.9 KB/sec)
2017-07-11T12:14:55.927 [INFO] Downloading: https://repo.maven.apache.org/maven2/org/apache/maven/maven/2.0.10/maven-2.0.10.pom
2017-07-11T12:14:55.954 [INFO] Downloaded: https://repo.maven.apache.org/maven2/org/apache/maven/maven/2.0.10/maven-2.0.10.pom
(24 KB at 878.3 KB/sec)
2017-07-11T12:14:55.958 [INFO] Downloading: https://repo.maven.apache.org/maven2/org/apache/maven/maven-settings/2.0.10/maven-settings-2.0.10.pom
2017-07-11T12:14:55.986 [INFO] Downloaded: https://repo.maven.apache.org/maven2/org/apache/maven/maven-settings/2.0.10/maven-settings-2.0.10.pom
(3 KB at 78.1 KB/sec)
2017-07-11T12:14:55.989 [INFO] Downloading: https://repo.maven.apache.org/maven2/org/apache/maven/maven-model/2.0.10/maven-model-2.0.10.pom
2017-07-11T12:14:56.015 [INFO] Downloaded: https://repo.maven.apache.org/maven2/org/apache/maven/maven-model/2.0.10/maven-model-2.0.10.pom
(4 KB at 125.3 KB/sec)
2017-07-11T12:14:56.018 [INFO] Downloading: https://repo.maven.apache.org/maven2/org/codehaus/plexus/plexus-interpolation/1.1/plexus-interpolation-1.1.pom
2017-07-11T12:14:56.043 [INFO] Downloaded: https://repo.maven.apache.org/maven2/org/codehaus/plexus/plexus-interpolation/1.1/plexus-interpolation-1.1.pom
(2 KB at 56.1 KB/sec)
2017-07-11T12:14:56.045 [INFO] Downloading: https://repo.maven.apache.org/maven2/org/apache/maven/maven-profile/2.0.10/maven-profile-2.0.10.pom
2017-07-11T12:14:56.071 [INFO] Downloaded: https://repo.maven.apache.org/maven2/org/apache/maven/maven-profile/2.0.10/maven-profile-2.0.10.pom
(3 KB at 78.7 KB/sec)
2017-07-11T12:14:56.073 [INFO] Downloading: https://repo.maven.apache.org/maven2/org/apache/maven/maven-artifact-manager/2.0.10/maven-artifact-manager-2.0.10.pom
2017-07-11T12:14:56.099 [INFO] Downloaded: https://repo.maven.apache.org/maven2/org/apache/maven/maven-artifact-manager/2.0.10/maven-artifact-manager-2.0.10.pom
(3 KB at 101.4 KB/sec)
2017-07-11T12:14:56.101 [INFO] Downloading: https://repo.maven.apache.org/maven2/org/apache/maven/maven-repository-metadata/2.0.10/maven-repository-metadata-2.0.10.pom
2017-07-11T12:14:56.137 [INFO] Downloaded: https://repo.maven.apache.org/maven2/org/apache/maven/maven-repository-metadata/2.0.10/maven-repository-metadata-2.0.10.pom
(3 KB at 62.8 KB/sec)
2017-07-11T12:14:56.140 [INFO] Downloading: https://repo.maven.apache.org/maven2/org/apache/maven/maven-artifact/2.0.10/maven-artifact-2.0.10.pom
2017-07-11T12:14:56.184 [INFO] Downloaded: https://repo.maven.apache.org/maven2/org/apache/maven/maven-artifact/2.0.10/maven-artifact-2.0.10.pom
(2 KB at 36.0 KB/sec)
2017-07-11T12:14:56.187 [INFO] Downloading: https://repo.maven.apache.org/maven2/org/apache/maven/maven-plugin-registry/2.0.10/maven-plugin-registry-2.0.10.pom
2017-07-11T12:14:56.213 [INFO] Downloaded: https://repo.maven.apache.org/maven2/org/apache/maven/maven-plugin-registry/2.0.10/maven-plugin-registry-2.0.10.pom
(2 KB at 75.7 KB/sec)
2017-07-11T12:14:56.218 [INFO] Downloading: https://repo.maven.apache.org/maven2/org/apache/maven/doxia/doxia-sink-api/1.1.2/doxia-sink-api-1.1.2.pom
2017-07-11T12:14:56.245 [INFO] Downloaded: https://repo.maven.apache.org/maven2/org/apache/maven/doxia/doxia-sink-api/1.1.2/doxia-sink-api-1.1.2.pom
(2 KB at 57.0 KB/sec)
2017-07-11T12:14:56.247 [INFO] Downloading: https://repo.maven.apache.org/maven2/org/apache/maven/doxia/doxia/1.1.2/doxia-1.1.2.pom
2017-07-11T12:14:56.275 [INFO] Downloaded: https://repo.maven.apache.org/maven2/org/apache/maven/doxia/doxia/1.1.2/doxia-1.1.2.pom
(18 KB at 633.2 KB/sec)
2017-07-11T12:14:56.278 [INFO] Downloading: https://repo.maven.apache.org/maven2/org/apache/maven/doxia/doxia-logging-api/1.1.2/doxia-logging-api-1.1.2.pom
2017-07-11T12:14:56.303 [INFO] Downloaded: https://repo.maven.apache.org/maven2/org/apache/maven/doxia/doxia-logging-api/1.1.2/doxia-logging-api-1.1.2.pom
(2 KB at 61.7 KB/sec)
2017-07-11T12:14:56.307 [INFO] Downloading: https://repo.maven.apache.org/maven2/org/apache/maven/doxia/doxia-core/1.1.2/doxia-core-1.1.2.pom
2017-07-11T12:14:56.332 [INFO] Downloaded: https://repo.maven.apache.org/maven2/org/apache/maven/doxia/doxia-core/1.1.2/doxia-core-1.1.2.pom
(4 KB at 145.3 KB/sec)
2017-07-11T12:14:56.336 [INFO] Downloading: https://repo.maven.apache.org/maven2/org/codehaus/plexus/plexus-utils/1.5.12/plexus-utils-1.5.12.pom
2017-07-11T12:14:56.363 [INFO] Downloaded: https://repo.maven.apache.org/maven2/org/codehaus/plexus/plexus-utils/1.5.12/plexus-utils-1.5.12.pom
(6 KB at 203.8 KB/sec)
2017-07-11T12:14:56.366 [INFO] Downloading: https://repo.maven.apache.org/maven2/xerces/xercesImpl/2.8.1/xercesImpl-2.8.1.pom
2017-07-11T12:14:56.391 [INFO] Downloaded: https://repo.maven.apache.org/maven2/xerces/xercesImpl/2.8.1/xercesImpl-2.8.1.pom
(3 KB at 86.2 KB/sec)
2017-07-11T12:14:56.394 [INFO] Downloading: https://repo.maven.apache.org/maven2/xml-apis/xml-apis/1.3.03/xml-apis-1.3.03.pom
2017-07-11T12:14:56.419 [INFO] Downloaded: https://repo.maven.apache.org/maven2/xml-apis/xml-apis/1.3.03/xml-apis-1.3.03.pom
(738 B at 28.8 KB/sec)
2017-07-11T12:14:56.421 [INFO] Downloading: https://repo.maven.apache.org/maven2/org/apache/apache/1/apache-1.pom
2017-07-11T12:14:56.448 [INFO] Downloaded: https://repo.maven.apache.org/maven2/org/apache/apache/1/apache-1.pom
(4 KB at 123.3 KB/sec)
2017-07-11T12:14:56.450 [INFO] Downloading: https://repo.maven.apache.org/maven2/commons-httpclient/commons-httpclient/3.1/commons-httpclient-3.1.pom
2017-07-11T12:14:56.477 [INFO] Downloaded: https://repo.maven.apache.org/maven2/commons-httpclient/commons-httpclient/3.1/commons-httpclient-3.1.pom
(8 KB at 280.8 KB/sec)
2017-07-11T12:14:56.480 [INFO] Downloading: https://repo.maven.apache.org/maven2/commons-codec/commons-codec/1.2/commons-codec-1.2.pom
2017-07-11T12:14:56.506 [INFO] Downloaded: https://repo.maven.apache.org/maven2/commons-codec/commons-codec/1.2/commons-codec-1.2.pom
(4 KB at 143.7 KB/sec)
2017-07-11T12:14:56.515 [INFO] Downloading: https://repo.maven.apache.org/maven2/org/apache/maven/doxia/doxia-site-renderer/1.1.2/doxia-site-renderer-1.1.2.pom
2017-07-11T12:14:56.541 [INFO] Downloaded: https://repo.maven.apache.org/maven2/org/apache/maven/doxia/doxia-site-renderer/1.1.2/doxia-site-renderer-1.1.2.pom
(6 KB at 229.9 KB/sec)
2017-07-11T12:14:56.555 [INFO] Downloading: https://repo.maven.apache.org/maven2/org/apache/maven/doxia/doxia-sitetools/1.1.2/doxia-sitetools-1.1.2.pom
2017-07-11T12:14:56.582 [INFO] Downloaded: https://repo.maven.apache.org/maven2/org/apache/maven/doxia/doxia-sitetools/1.1.2/doxia-sitetools-1.1.2.pom
(15 KB at 552.8 KB/sec)
2017-07-11T12:14:56.587 [INFO] Downloading: https://repo.maven.apache.org/maven2/org/apache/maven/doxia/doxia-decoration-model/1.1.2/doxia-decoration-model-1.1.2.pom
2017-07-11T12:14:56.614 [INFO] Downloaded: https://repo.maven.apache.org/maven2/org/apache/maven/doxia/doxia-decoration-model/1.1.2/doxia-decoration-model-1.1.2.pom
(3 KB at 107.6 KB/sec)
2017-07-11T12:14:56.618 [INFO] Downloading: https://repo.maven.apache.org/maven2/org/apache/maven/doxia/doxia-module-xhtml/1.1.2/doxia-module-xhtml-1.1.2.pom
2017-07-11T12:14:56.643 [INFO] Downloaded: https://repo.maven.apache.org/maven2/org/apache/maven/doxia/doxia-module-xhtml/1.1.2/doxia-module-xhtml-1.1.2.pom
(2 KB at 62.6 KB/sec)
2017-07-11T12:14:56.645 [INFO] Downloading: https://repo.maven.apache.org/maven2/org/apache/maven/doxia/doxia-modules/1.1.2/doxia-modules-1.1.2.pom
2017-07-11T12:14:56.672 [INFO] Downloaded: https://repo.maven.apache.org/maven2/org/apache/maven/doxia/doxia-modules/1.1.2/doxia-modules-1.1.2.pom
(3 KB at 88.1 KB/sec)
2017-07-11T12:14:56.675 [INFO] Downloading: https://repo.maven.apache.org/maven2/org/apache/maven/doxia/doxia-module-fml/1.1.2/doxia-module-fml-1.1.2.pom
2017-07-11T12:14:56.701 [INFO] Downloaded: https://repo.maven.apache.org/maven2/org/apache/maven/doxia/doxia-module-fml/1.1.2/doxia-module-fml-1.1.2.pom
(6 KB at 206.4 KB/sec)
2017-07-11T12:14:56.706 [INFO] Downloading: https://repo.maven.apache.org/maven2/commons-validator/commons-validator/1.2.0/commons-validator-1.2.0.pom
2017-07-11T12:14:56.733 [INFO] Downloaded: https://repo.maven.apache.org/maven2/commons-validator/commons-validator/1.2.0/commons-validator-1.2.0.pom
(9 KB at 328.6 KB/sec)
2017-07-11T12:14:56.736 [INFO] Downloading: https://repo.maven.apache.org/maven2/xml-apis/xml-apis/2.0.2/xml-apis-2.0.2.pom
2017-07-11T12:14:56.761 [INFO] Downloaded: https://repo.maven.apache.org/maven2/xml-apis/xml-apis/2.0.2/xml-apis-2.0.2.pom
(346 B at 13.5 KB/sec)
2017-07-11T12:14:56.768 [INFO] Downloading: https://repo.maven.apache.org/maven2/org/apache/maven/maven-plugin-api/2.0/maven-plugin-api-2.0.pom
2017-07-11T12:14:56.794 [INFO] Downloaded: https://repo.maven.apache.org/maven2/org/apache/maven/maven-plugin-api/2.0/maven-plugin-api-2.0.pom
(601 B at 22.6 KB/sec)
2017-07-11T12:14:56.796 [INFO] Downloading: https://repo.maven.apache.org/maven2/org/apache/maven/maven/2.0/maven-2.0.pom
2017-07-11T12:14:56.823 [INFO] Downloaded: https://repo.maven.apache.org/maven2/org/apache/maven/maven/2.0/maven-2.0.pom
(9 KB at 317.1 KB/sec)
2017-07-11T12:14:56.827 [INFO] Downloading: https://repo.maven.apache.org/maven2/org/apache/maven/shared/maven-doxia-tools/1.2.1/maven-doxia-tools-1.2.1.pom
2017-07-11T12:14:56.853 [INFO] Downloaded: https://repo.maven.apache.org/maven2/org/apache/maven/shared/maven-doxia-tools/1.2.1/maven-doxia-tools-1.2.1.pom
(7 KB at 237.0 KB/sec)
2017-07-11T12:14:56.858 [INFO] Downloading: https://repo.maven.apache.org/maven2/org/apache/maven/doxia/doxia-logging-api/1.1.3/doxia-logging-api-1.1.3.pom
2017-07-11T12:14:56.884 [INFO] Downloaded: https://repo.maven.apache.org/maven2/org/apache/maven/doxia/doxia-logging-api/1.1.3/doxia-logging-api-1.1.3.pom
(2 KB at 59.3 KB/sec)
2017-07-11T12:14:56.886 [INFO] Downloading: https://repo.maven.apache.org/maven2/org/apache/maven/doxia/doxia/1.1.3/doxia-1.1.3.pom
2017-07-11T12:14:56.913 [INFO] Downloaded: https://repo.maven.apache.org/maven2/org/apache/maven/doxia/doxia/1.1.3/doxia-1.1.3.pom
(19 KB at 673.0 KB/sec)
2017-07-11T12:14:56.917 [INFO] Downloading: https://repo.maven.apache.org/maven2/org/apache/maven/doxia/doxia-decoration-model/1.1.3/doxia-decoration-model-1.1.3.pom
2017-07-11T12:14:56.943 [INFO] Downloaded: https://repo.maven.apache.org/maven2/org/apache/maven/doxia/doxia-decoration-model/1.1.3/doxia-decoration-model-1.1.3.pom
(3 KB at 111.7 KB/sec)
2017-07-11T12:14:56.945 [INFO] Downloading: https://repo.maven.apache.org/maven2/org/apache/maven/doxia/doxia-sitetools/1.1.3/doxia-sitetools-1.1.3.pom
2017-07-11T12:14:56.972 [INFO] Downloaded: https://repo.maven.apache.org/maven2/org/apache/maven/doxia/doxia-sitetools/1.1.3/doxia-sitetools-1.1.3.pom
(16 KB at 569.4 KB/sec)
2017-07-11T12:14:56.988 [INFO] Downloading: https://repo.maven.apache.org/maven2/com/google/code/findbugs/findbugs/3.0.1/findbugs-3.0.1.jar
2017-07-11T12:14:56.989 [INFO] Downloading: https://repo.maven.apache.org/maven2/net/jcip/jcip-annotations/1.0/jcip-annotations-1.0.jar
2017-07-11T12:14:56.989 [INFO] Downloading: https://repo.maven.apache.org/maven2/com/google/code/findbugs/bcel-findbugs/6.0/bcel-findbugs-6.0.jar
2017-07-11T12:14:56.992 [INFO] Downloading: https://repo.maven.apache.org/maven2/com/google/code/findbugs/jFormatString/2.0.1/jFormatString-2.0.1.jar
2017-07-11T12:14:56.993 [INFO] Downloading: https://repo.maven.apache.org/maven2/dom4j/dom4j/1.6.1/dom4j-1.6.1.jar
2017-07-11T12:14:57.019 [INFO] Downloaded: https://repo.maven.apache.org/maven2/net/jcip/jcip-annotations/1.0/jcip-annotations-1.0.jar
(3 KB at 71.0 KB/sec)
2017-07-11T12:14:57.019 [INFO] Downloading: https://repo.maven.apache.org/maven2/xml-apis/xml-apis/1.0.b2/xml-apis-1.0.b2.jar
2017-07-11T12:14:57.022 [INFO] Downloaded: https://repo.maven.apache.org/maven2/com/google/code/findbugs/jFormatString/2.0.1/jFormatString-2.0.1.jar
(27 KB at 783.3 KB/sec)
2017-07-11T12:14:57.022 [INFO] Downloading: https://repo.maven.apache.org/maven2/org/ow2/asm/asm-debug-all/5.0.2/asm-debug-all-5.0.2.jar
2017-07-11T12:14:57.063 [INFO] Downloaded: https://repo.maven.apache.org/maven2/xml-apis/xml-apis/1.0.b2/xml-apis-1.0.b2.jar
(107 KB at 1503.6 KB/sec)
2017-07-11T12:14:57.063 [INFO] Downloading: https://repo.maven.apache.org/maven2/org/ow2/asm/asm-commons/5.0.2/asm-commons-5.0.2.jar
2017-07-11T12:14:57.082 [INFO] Downloaded: https://repo.maven.apache.org/maven2/com/google/code/findbugs/bcel-findbugs/6.0/bcel-findbugs-6.0.jar
(599 KB at 6362.0 KB/sec)
2017-07-11T12:14:57.082 [INFO] Downloading: https://repo.maven.apache.org/maven2/org/ow2/asm/asm-tree/5.0.2/asm-tree-5.0.2.jar
2017-07-11T12:14:57.094 [INFO] Downloaded: https://repo.maven.apache.org/maven2/org/ow2/asm/asm-commons/5.0.2/asm-commons-5.0.2.jar
(41 KB at 399.4 KB/sec)
2017-07-11T12:14:57.094 [INFO] Downloading: https://repo.maven.apache.org/maven2/jaxen/jaxen/1.1.6/jaxen-1.1.6.jar
2017-07-11T12:14:57.096 [INFO] Downloaded: https://repo.maven.apache.org/maven2/org/ow2/asm/asm-debug-all/5.0.2/asm-debug-all-5.0.2.jar
(372 KB at 3571.1 KB/sec)
2017-07-11T12:14:57.096 [INFO] Downloading: https://repo.maven.apache.org/maven2/org/apache/ant/ant/1.9.4/ant-1.9.4.jar
2017-07-11T12:14:57.104 [INFO] Downloaded: https://repo.maven.apache.org/maven2/dom4j/dom4j/1.6.1/dom4j-1.6.1.jar
(307 KB at 2689.0 KB/sec)
2017-07-11T12:14:57.105 [INFO] Downloading: https://repo.maven.apache.org/maven2/org/apache/ant/ant-launcher/1.9.4/ant-launcher-1.9.4.jar
2017-07-11T12:14:57.113 [INFO] Downloaded: https://repo.maven.apache.org/maven2/org/ow2/asm/asm-tree/5.0.2/asm-tree-5.0.2.jar
(29 KB at 234.4 KB/sec)
2017-07-11T12:14:57.113 [INFO] Downloading: https://repo.maven.apache.org/maven2/org/codehaus/groovy/groovy/2.4.7/groovy-2.4.7.jar
2017-07-11T12:14:57.143 [INFO] Downloaded: https://repo.maven.apache.org/maven2/org/apache/ant/ant-launcher/1.9.4/ant-launcher-1.9.4.jar
(18 KB at 118.9 KB/sec)
2017-07-11T12:14:57.143 [INFO] Downloading: https://repo.maven.apache.org/maven2/org/codehaus/groovy/groovy-ant/2.4.7/groovy-ant-2.4.7.jar
2017-07-11T12:14:57.177 [INFO] Downloaded: https://repo.maven.apache.org/maven2/jaxen/jaxen/1.1.6/jaxen-1.1.6.jar
(227 KB at 1224.0 KB/sec)
2017-07-11T12:14:57.177 [INFO] Downloading: https://repo.maven.apache.org/maven2/org/apache/ant/ant-antlr/1.9.4/ant-antlr-1.9.4.jar
2017-07-11T12:14:57.178 [INFO] Downloaded: https://repo.maven.apache.org/maven2/org/codehaus/groovy/groovy-ant/2.4.7/groovy-ant-2.4.7.jar
(69 KB at 365.8 KB/sec)
2017-07-11T12:14:57.178 [INFO] Downloading: https://repo.maven.apache.org/maven2/org/codehaus/groovy/groovy-groovydoc/2.4.7/groovy-groovydoc-2.4.7.jar
2017-07-11T12:14:57.212 [INFO] Downloaded: https://repo.maven.apache.org/maven2/org/apache/ant/ant-antlr/1.9.4/ant-antlr-1.9.4.jar
(12 KB at 51.5 KB/sec)
2017-07-11T12:14:57.212 [INFO] Downloading: https://repo.maven.apache.org/maven2/org/codehaus/groovy/groovy-templates/2.4.7/groovy-templates-2.4.7.jar
[INFO] I/O exception (java.net.SocketException) caught when processing request to {s}->https://repo.maven.apache.org:443:
Connection reset
[INFO] Retrying request to {s}->https://repo.maven.apache.org:443
2017-07-11T12:14:57.227 [INFO] Downloaded: https://repo.maven.apache.org/maven2/org/codehaus/groovy/groovy-groovydoc/2.4.7/groovy-groovydoc-2.4.7.jar
(133 KB at 561.8 KB/sec)
2017-07-11T12:14:57.227 [INFO] Downloading: https://repo.maven.apache.org/maven2/org/apache/ant/ant-junit/1.9.4/ant-junit-1.9.4.jar
2017-07-11T12:14:57.283 [INFO] Downloaded: https://repo.maven.apache.org/maven2/org/apache/ant/ant-junit/1.9.4/ant-junit-1.9.4.jar
(116 KB at 395.3 KB/sec)
2017-07-11T12:14:57.283 [INFO] Downloading: https://repo.maven.apache.org/maven2/org/codehaus/groovy/groovy-xml/2.4.7/groovy-xml-2.4.7.jar
2017-07-11T12:14:57.314 [INFO] Downloading: https://repo.maven.apache.org/maven2/org/apache/maven/reporting/maven-reporting-impl/2.1/maven-reporting-impl-2.1.jar
2017-07-11T12:14:57.339 [INFO] Downloaded: https://repo.maven.apache.org/maven2/org/codehaus/groovy/groovy-templates/2.4.7/groovy-templates-2.4.7.jar
(96 KB at 275.4 KB/sec)
2017-07-11T12:14:57.339 [INFO] Downloading: https://repo.maven.apache.org/maven2/org/apache/maven/maven-project/2.0.10/maven-project-2.0.10.jar
2017-07-11T12:14:57.353 [INFO] Downloaded: https://repo.maven.apache.org/maven2/org/codehaus/groovy/groovy-xml/2.4.7/groovy-xml-2.4.7.jar
(211 KB at 582.9 KB/sec)
2017-07-11T12:14:57.353 [INFO] Downloading: https://repo.maven.apache.org/maven2/org/apache/maven/maven-settings/2.0.10/maven-settings-2.0.10.jar
2017-07-11T12:14:57.373 [INFO] Downloaded: https://repo.maven.apache.org/maven2/org/apache/maven/reporting/maven-reporting-impl/2.1/maven-reporting-impl-2.1.jar
(17 KB at 42.5 KB/sec)
2017-07-11T12:14:57.373 [INFO] Downloading: https://repo.maven.apache.org/maven2/org/apache/maven/maven-profile/2.0.10/maven-profile-2.0.10.jar
2017-07-11T12:14:57.396 [INFO] Downloaded: https://repo.maven.apache.org/maven2/org/apache/maven/maven-settings/2.0.10/maven-settings-2.0.10.jar
(50 KB at 123.3 KB/sec)
2017-07-11T12:14:57.396 [INFO] Downloading: https://repo.maven.apache.org/maven2/org/apache/maven/maven-plugin-registry/2.0.10/maven-plugin-registry-2.0.10.jar
2017-07-11T12:14:57.399 [INFO] Downloaded: https://repo.maven.apache.org/maven2/org/apache/maven/maven-project/2.0.10/maven-project-2.0.10.jar
(121 KB at 295.6 KB/sec)
2017-07-11T12:14:57.399 [INFO] Downloading: https://repo.maven.apache.org/maven2/org/codehaus/plexus/plexus-interpolation/1.1/plexus-interpolation-1.1.jar
2017-07-11T12:14:57.414 [INFO] Downloaded: https://repo.maven.apache.org/maven2/org/apache/maven/maven-profile/2.0.10/maven-profile-2.0.10.jar
(37 KB at 85.4 KB/sec)
2017-07-11T12:14:57.415 [INFO] Downloading: https://repo.maven.apache.org/maven2/commons-validator/commons-validator/1.2.0/commons-validator-1.2.0.jar
2017-07-11T12:14:57.429 [INFO] Downloaded: https://repo.maven.apache.org/maven2/org/apache/maven/maven-plugin-registry/2.0.10/maven-plugin-registry-2.0.10.jar
(30 KB at 67.9 KB/sec)
2017-07-11T12:14:57.429 [INFO] Downloading: https://repo.maven.apache.org/maven2/org/apache/maven/maven-plugin-api/2.0/maven-plugin-api-2.0.jar
2017-07-11T12:14:57.438 [INFO] Downloaded: https://repo.maven.apache.org/maven2/org/codehaus/plexus/plexus-interpolation/1.1/plexus-interpolation-1.1.jar
(35 KB at 77.9 KB/sec)
2017-07-11T12:14:57.438 [INFO] Downloading: https://repo.maven.apache.org/maven2/org/apache/maven/doxia/doxia-core/1.4/doxia-core-1.4.jar
2017-07-11T12:14:57.457 [INFO] Downloaded: https://repo.maven.apache.org/maven2/commons-validator/commons-validator/1.2.0/commons-validator-1.2.0.jar
(89 KB at 191.3 KB/sec)
2017-07-11T12:14:57.457 [INFO] Downloading: https://repo.maven.apache.org/maven2/org/apache/maven/shared/maven-doxia-tools/1.2.1/maven-doxia-tools-1.2.1.jar
2017-07-11T12:14:57.459 [INFO] Downloaded: https://repo.maven.apache.org/maven2/org/apache/maven/maven-plugin-api/2.0/maven-plugin-api-2.0.jar
(10 KB at 21.2 KB/sec)
2017-07-11T12:14:57.459 [INFO] Downloading: https://repo.maven.apache.org/maven2/org/apache/maven/maven-artifact-manager/2.0.6/maven-artifact-manager-2.0.6.jar
2017-07-11T12:14:57.460 [INFO] Downloaded: https://repo.maven.apache.org/maven2/org/apache/ant/ant/1.9.4/ant-1.9.4.jar
(1972 KB at 4213.6 KB/sec)
2017-07-11T12:14:57.460 [INFO] Downloading: https://repo.maven.apache.org/maven2/org/apache/maven/maven-repository-metadata/2.0.6/maven-repository-metadata-2.0.6.jar
2017-07-11T12:14:57.489 [INFO] Downloaded: https://repo.maven.apache.org/maven2/org/apache/maven/shared/maven-doxia-tools/1.2.1/maven-doxia-tools-1.2.1.jar
(43 KB at 84.8 KB/sec)
2017-07-11T12:14:57.489 [INFO] Downloading: https://repo.maven.apache.org/maven2/org/apache/maven/maven-model/2.0.6/maven-model-2.0.6.jar
2017-07-11T12:14:57.491 [INFO] Downloaded: https://repo.maven.apache.org/maven2/org/apache/maven/maven-artifact-manager/2.0.6/maven-artifact-manager-2.0.6.jar
(56 KB at 110.6 KB/sec)
2017-07-11T12:14:57.491 [INFO] Downloading: https://repo.maven.apache.org/maven2/org/codehaus/plexus/plexus-utils/1.5.6/plexus-utils-1.5.6.jar
2017-07-11T12:14:57.494 [INFO] Downloaded: https://repo.maven.apache.org/maven2/org/apache/maven/maven-repository-metadata/2.0.6/maven-repository-metadata-2.0.6.jar
(24 KB at 47.6 KB/sec)
2017-07-11T12:14:57.500 [INFO] Downloaded: https://repo.maven.apache.org/maven2/org/apache/maven/doxia/doxia-core/1.4/doxia-core-1.4.jar
(162 KB at 317.0 KB/sec)
2017-07-11T12:14:57.537 [INFO] Downloaded: https://repo.maven.apache.org/maven2/org/apache/maven/maven-model/2.0.6/maven-model-2.0.6.jar
(85 KB at 154.8 KB/sec)
2017-07-11T12:14:57.549 [INFO] Downloaded: https://repo.maven.apache.org/maven2/com/google/code/findbugs/findbugs/3.0.1/findbugs-3.0.1.jar
(3711 KB at 6602.5 KB/sec)
2017-07-11T12:14:57.556 [INFO] Downloaded: https://repo.maven.apache.org/maven2/org/codehaus/plexus/plexus-utils/1.5.6/plexus-utils-1.5.6.jar
(245 KB at 434.6 KB/sec)
[WARNING] Failed to getClass for org.codehaus.mojo.findbugs.FindBugsMojo
[WARNING] Failed to getClass for org.codehaus.mojo.findbugs.FindbugsViolationCheckMojo
[WARNING] Failed to getClass for org.codehaus.mojo.findbugs.FindbugsViolationCheckMojo
[JENKINS] Archiving disabled
[JENKINS] Archiving disabled
[JENKINS] Archiving disabled
[JENKINS] Archiving disabled
[JENKINS] Archiving disabled
[JENKINS] Archiving disabled
[JENKINS] Archiving disabled
[JENKINS] Archiving disabled
[JENKINS] Archiving disabled
[JENKINS] Archiving disabled
[JENKINS] Archiving disabled
[JENKINS] Archiving disabled
[JENKINS] Archiving disabled
2017-07-11T12:15:07.489 [INFO] ------------------------------------------------------------------------
2017-07-11T12:15:07.489 [INFO] Reactor Summary:
2017-07-11T12:15:07.489 [INFO] 
2017-07-11T12:15:07.489 [INFO] Apache Beam :: Parent .............................. SUCCESS
[ 42.990 s]
2017-07-11T12:15:07.489 [INFO] Apache Beam :: SDKs :: Java :: Build Tools ......... SUCCESS
[ 16.465 s]
2017-07-11T12:15:07.489 [INFO] Apache Beam :: SDKs ................................ SUCCESS
[ 10.239 s]
2017-07-11T12:15:07.489 [INFO] Apache Beam :: SDKs :: Common ...................... SUCCESS
[  6.037 s]
2017-07-11T12:15:07.489 [INFO] Apache Beam :: SDKs :: Common :: Runner API ........ FAILURE
[ 14.654 s]
2017-07-11T12:15:07.489 [INFO] Apache Beam :: SDKs :: Common :: Fn API ............ SKIPPED
2017-07-11T12:15:07.489 [INFO] Apache Beam :: SDKs :: Java ........................ SKIPPED
2017-07-11T12:15:07.489 [INFO] Apache Beam :: SDKs :: Java :: Core ................ SKIPPED
2017-07-11T12:15:07.489 [INFO] Apache Beam :: Runners ............................. SKIPPED
2017-07-11T12:15:07.489 [INFO] Apache Beam :: Runners :: Core Construction Java ... SKIPPED
2017-07-11T12:15:07.489 [INFO] Apache Beam :: Runners :: Core Java ................ SKIPPED
2017-07-11T12:15:07.489 [INFO] Apache Beam :: Runners :: Apex ..................... SKIPPED
2017-07-11T12:15:07.489 [INFO] ------------------------------------------------------------------------
2017-07-11T12:15:07.489 [INFO] BUILD FAILURE
2017-07-11T12:15:07.489 [INFO] ------------------------------------------------------------------------
2017-07-11T12:15:07.489 [INFO] Total time: 12:01 min
2017-07-11T12:15:07.490 [INFO] Finished at: 2017-07-11T12:15:07+00:00
2017-07-11T12:15:08.272 [INFO] Final Memory: 77M/1230M
2017-07-11T12:15:08.272 [INFO] ------------------------------------------------------------------------
2017-07-11T12:15:08.273 [WARNING] The requested profile "validates-runner-tests" could not
be activated because it does not exist.
Waiting for Jenkins to finish collecting data
2017-07-11T12:17:31.737 [ERROR] Failed to execute goal org.codehaus.mojo:findbugs-maven-plugin:3.0.4:findbugs
(findbugs) on project beam-sdks-common-runner-api: Execution findbugs of goal org.codehaus.mojo:findbugs-maven-plugin:3.0.4:findbugs
failed: Plugin org.codehaus.mojo:findbugs-maven-plugin:3.0.4 or one of its dependencies could
not be resolved: Could not transfer artifact org.codehaus.groovy:groovy:jar:2.4.7 from/to
central (https://repo.maven.apache.org/maven2): GET request of: org/codehaus/groovy/groovy/2.4.7/groovy-2.4.7.jar
from central failed: Connection reset -> [Help 1]
2017-07-11T12:17:31.738 [ERROR] 
2017-07-11T12:17:31.738 [ERROR] To see the full stack trace of the errors, re-run Maven with
the -e switch.
2017-07-11T12:17:31.738 [ERROR] Re-run Maven using the -X switch to enable full debug logging.
2017-07-11T12:17:31.738 [ERROR] 
2017-07-11T12:17:31.738 [ERROR] For more information about the errors and possible solutions,
please read the following articles:
2017-07-11T12:17:31.738 [ERROR] [Help 1] http://cwiki.apache.org/confluence/display/MAVEN/PluginResolutionException
2017-07-11T12:17:31.739 [ERROR] 
2017-07-11T12:17:31.739 [ERROR] After correcting the problems, you can resume the build with
the command
2017-07-11T12:17:31.739 [ERROR]   mvn <goals> -rf :beam-sdks-common-runner-api
channel stopped

Mime
View raw message