beam-commits mailing list archives

Site index · List index
Message view « Date » · « Thread »
Top « Date » · « Thread »
From Apache Jenkins Server <jenk...@builds.apache.org>
Subject Build failed in Jenkins: beam_PostCommit_Java_ValidatesRunner_Apex #1974
Date Thu, 13 Jul 2017 06:03:21 GMT
See <https://builds.apache.org/job/beam_PostCommit_Java_ValidatesRunner_Apex/1974/display/redirect>

------------------------------------------
[...truncated 238.71 KB...]
2017-07-13T06:02:59.396 [INFO] Downloaded: https://repo.maven.apache.org/maven2/commons-cli/commons-cli/1.3.1/commons-cli-1.3.1.pom
(11 KB at 338.3 KB/sec)
2017-07-13T06:02:59.409 [INFO] Downloading: https://repo.maven.apache.org/maven2/org/apache/maven/doxia/doxia-integration-tools/1.6/doxia-integration-tools-1.6.pom
2017-07-13T06:02:59.436 [INFO] Downloaded: https://repo.maven.apache.org/maven2/org/apache/maven/doxia/doxia-integration-tools/1.6/doxia-integration-tools-1.6.pom
(7 KB at 242.6 KB/sec)
2017-07-13T06:02:59.439 [INFO] Downloading: https://repo.maven.apache.org/maven2/org/apache/maven/doxia/doxia-tools/3/doxia-tools-3.pom
2017-07-13T06:02:59.468 [INFO] Downloaded: https://repo.maven.apache.org/maven2/org/apache/maven/doxia/doxia-tools/3/doxia-tools-3.pom
(10 KB at 346.3 KB/sec)
2017-07-13T06:02:59.472 [INFO] Downloading: https://repo.maven.apache.org/maven2/org/apache/maven/doxia/doxia-logging-api/1.6/doxia-logging-api-1.6.pom
2017-07-13T06:02:59.499 [INFO] Downloaded: https://repo.maven.apache.org/maven2/org/apache/maven/doxia/doxia-logging-api/1.6/doxia-logging-api-1.6.pom
(2 KB at 57.7 KB/sec)
2017-07-13T06:02:59.501 [INFO] Downloading: https://repo.maven.apache.org/maven2/org/apache/maven/doxia/doxia/1.6/doxia-1.6.pom
2017-07-13T06:02:59.533 [INFO] Downloaded: https://repo.maven.apache.org/maven2/org/apache/maven/doxia/doxia/1.6/doxia-1.6.pom
(19 KB at 579.3 KB/sec)
2017-07-13T06:02:59.537 [INFO] Downloading: https://repo.maven.apache.org/maven2/org/apache/maven/doxia/doxia-decoration-model/1.6/doxia-decoration-model-1.6.pom
2017-07-13T06:02:59.570 [INFO] Downloaded: https://repo.maven.apache.org/maven2/org/apache/maven/doxia/doxia-decoration-model/1.6/doxia-decoration-model-1.6.pom
(3 KB at 88.6 KB/sec)
2017-07-13T06:02:59.572 [INFO] Downloading: https://repo.maven.apache.org/maven2/org/apache/maven/doxia/doxia-sitetools/1.6/doxia-sitetools-1.6.pom
2017-07-13T06:02:59.602 [INFO] Downloaded: https://repo.maven.apache.org/maven2/org/apache/maven/doxia/doxia-sitetools/1.6/doxia-sitetools-1.6.pom
(18 KB at 582.3 KB/sec)
2017-07-13T06:02:59.607 [INFO] Downloading: https://repo.maven.apache.org/maven2/org/codehaus/plexus/plexus-interpolation/1.21/plexus-interpolation-1.21.pom
2017-07-13T06:02:59.634 [INFO] Downloaded: https://repo.maven.apache.org/maven2/org/codehaus/plexus/plexus-interpolation/1.21/plexus-interpolation-1.21.pom
(2 KB at 55.7 KB/sec)
2017-07-13T06:02:59.637 [INFO] Downloading: https://repo.maven.apache.org/maven2/org/codehaus/plexus/plexus-velocity/1.1.8/plexus-velocity-1.1.8.pom
2017-07-13T06:02:59.663 [INFO] Downloaded: https://repo.maven.apache.org/maven2/org/codehaus/plexus/plexus-velocity/1.1.8/plexus-velocity-1.1.8.pom
(2 KB at 72.2 KB/sec)
2017-07-13T06:02:59.665 [INFO] Downloading: https://repo.maven.apache.org/maven2/org/codehaus/plexus/plexus-components/1.1.15/plexus-components-1.1.15.pom
2017-07-13T06:02:59.691 [INFO] Downloaded: https://repo.maven.apache.org/maven2/org/codehaus/plexus/plexus-components/1.1.15/plexus-components-1.1.15.pom
(3 KB at 107.0 KB/sec)
2017-07-13T06:02:59.705 [INFO] Downloading: https://repo.maven.apache.org/maven2/com/puppycrawl/tools/checkstyle/6.19/checkstyle-6.19.jar
2017-07-13T06:02:59.706 [INFO] Downloading: https://repo.maven.apache.org/maven2/org/antlr/antlr4-runtime/4.5.3/antlr4-runtime-4.5.3.jar
2017-07-13T06:02:59.707 [INFO] Downloading: https://repo.maven.apache.org/maven2/commons-beanutils/commons-beanutils/1.9.2/commons-beanutils-1.9.2.jar
2017-07-13T06:02:59.708 [INFO] Downloading: https://repo.maven.apache.org/maven2/antlr/antlr/2.7.7/antlr-2.7.7.jar
2017-07-13T06:02:59.709 [INFO] Downloading: https://repo.maven.apache.org/maven2/commons-cli/commons-cli/1.3.1/commons-cli-1.3.1.jar
2017-07-13T06:02:59.754 [INFO] Downloaded: https://repo.maven.apache.org/maven2/commons-cli/commons-cli/1.3.1/commons-cli-1.3.1.jar
(52 KB at 1101.0 KB/sec)
2017-07-13T06:02:59.754 [INFO] Downloading: https://repo.maven.apache.org/maven2/org/apache/maven/doxia/doxia-integration-tools/1.6/doxia-integration-tools-1.6.jar
2017-07-13T06:02:59.785 [INFO] Downloaded: https://repo.maven.apache.org/maven2/org/apache/maven/doxia/doxia-integration-tools/1.6/doxia-integration-tools-1.6.jar
(44 KB at 566.0 KB/sec)
2017-07-13T06:02:59.786 [INFO] Downloading: https://repo.maven.apache.org/maven2/org/codehaus/plexus/plexus-interpolation/1.21/plexus-interpolation-1.21.jar
2017-07-13T06:02:59.825 [INFO] Downloaded: https://repo.maven.apache.org/maven2/commons-beanutils/commons-beanutils/1.9.2/commons-beanutils-1.9.2.jar
(229 KB at 1919.1 KB/sec)
2017-07-13T06:02:59.825 [INFO] Downloading: https://repo.maven.apache.org/maven2/org/codehaus/plexus/plexus-velocity/1.1.8/plexus-velocity-1.1.8.jar
2017-07-13T06:02:59.826 [INFO] Downloaded: https://repo.maven.apache.org/maven2/org/antlr/antlr4-runtime/4.5.3/antlr4-runtime-4.5.3.jar
(296 KB at 2459.7 KB/sec)
2017-07-13T06:02:59.826 [INFO] Downloading: https://repo.maven.apache.org/maven2/commons-lang/commons-lang/2.1/commons-lang-2.1.jar
2017-07-13T06:02:59.827 [INFO] Downloaded: https://repo.maven.apache.org/maven2/org/codehaus/plexus/plexus-interpolation/1.21/plexus-interpolation-1.21.jar
(61 KB at 512.6 KB/sec)
2017-07-13T06:02:59.851 [INFO] Downloaded: https://repo.maven.apache.org/maven2/org/codehaus/plexus/plexus-velocity/1.1.8/plexus-velocity-1.1.8.jar
(8 KB at 53.8 KB/sec)
2017-07-13T06:02:59.852 [INFO] Downloaded: https://repo.maven.apache.org/maven2/antlr/antlr/2.7.7/antlr-2.7.7.jar
(435 KB at 2958.2 KB/sec)
2017-07-13T06:02:59.881 [INFO] Downloaded: https://repo.maven.apache.org/maven2/commons-lang/commons-lang/2.1/commons-lang-2.1.jar
(203 KB at 1172.6 KB/sec)
2017-07-13T06:02:59.910 [INFO] Downloaded: https://repo.maven.apache.org/maven2/com/puppycrawl/tools/checkstyle/6.19/checkstyle-6.19.jar
(1141 KB at 5561.9 KB/sec)
2017-07-13T06:03:01.698 [INFO] Starting audit...
Audit done.
2017-07-13T06:03:02.212 [INFO] 
2017-07-13T06:03:02.212 [INFO] --- maven-surefire-plugin:2.20:test (default-test) @ beam-sdks-java-build-tools
---
2017-07-13T06:03:02.215 [INFO] Downloading: https://repo.maven.apache.org/maven2/org/apache/maven/surefire/surefire-junit47/2.20/surefire-junit47-2.20.pom
2017-07-13T06:03:02.243 [INFO] Downloaded: https://repo.maven.apache.org/maven2/org/apache/maven/surefire/surefire-junit47/2.20/surefire-junit47-2.20.pom
(7 KB at 217.4 KB/sec)
2017-07-13T06:03:02.245 [INFO] Downloading: https://repo.maven.apache.org/maven2/org/apache/maven/surefire/surefire-providers/2.20/surefire-providers-2.20.pom
2017-07-13T06:03:02.295 [INFO] Downloaded: https://repo.maven.apache.org/maven2/org/apache/maven/surefire/surefire-providers/2.20/surefire-providers-2.20.pom
(3 KB at 50.3 KB/sec)
2017-07-13T06:03:02.299 [INFO] Downloading: https://repo.maven.apache.org/maven2/org/apache/maven/surefire/common-junit48/2.20/common-junit48-2.20.pom
2017-07-13T06:03:02.334 [INFO] Downloaded: https://repo.maven.apache.org/maven2/org/apache/maven/surefire/common-junit48/2.20/common-junit48-2.20.pom
(4 KB at 90.3 KB/sec)
2017-07-13T06:03:02.340 [INFO] Downloading: https://repo.maven.apache.org/maven2/org/apache/maven/surefire/common-junit4/2.20/common-junit4-2.20.pom
2017-07-13T06:03:02.365 [INFO] Downloaded: https://repo.maven.apache.org/maven2/org/apache/maven/surefire/common-junit4/2.20/common-junit4-2.20.pom
(3 KB at 83.3 KB/sec)
2017-07-13T06:03:02.368 [INFO] Downloading: https://repo.maven.apache.org/maven2/org/apache/maven/surefire/common-junit3/2.20/common-junit3-2.20.pom
2017-07-13T06:03:02.393 [INFO] Downloaded: https://repo.maven.apache.org/maven2/org/apache/maven/surefire/common-junit3/2.20/common-junit3-2.20.pom
(2 KB at 61.6 KB/sec)
2017-07-13T06:03:02.396 [INFO] Downloading: https://repo.maven.apache.org/maven2/org/apache/maven/surefire/surefire-api/2.20/surefire-api-2.20.pom
2017-07-13T06:03:02.436 [INFO] Downloaded: https://repo.maven.apache.org/maven2/org/apache/maven/surefire/surefire-api/2.20/surefire-api-2.20.pom
(4 KB at 90.6 KB/sec)
2017-07-13T06:03:02.439 [INFO] Downloading: https://repo.maven.apache.org/maven2/org/apache/maven/surefire/surefire-logger-api/2.20/surefire-logger-api-2.20.pom
2017-07-13T06:03:02.464 [INFO] Downloaded: https://repo.maven.apache.org/maven2/org/apache/maven/surefire/surefire-logger-api/2.20/surefire-logger-api-2.20.pom
(2 KB at 76.5 KB/sec)
2017-07-13T06:03:02.467 [INFO] Downloading: https://repo.maven.apache.org/maven2/org/apache/maven/surefire/common-java5/2.20/common-java5-2.20.pom
2017-07-13T06:03:02.497 [INFO] Downloaded: https://repo.maven.apache.org/maven2/org/apache/maven/surefire/common-java5/2.20/common-java5-2.20.pom
(3 KB at 90.1 KB/sec)
2017-07-13T06:03:02.502 [INFO] Downloading: https://repo.maven.apache.org/maven2/org/apache/maven/shared/maven-shared-utils/0.9/maven-shared-utils-0.9.pom
2017-07-13T06:03:02.528 [INFO] Downloaded: https://repo.maven.apache.org/maven2/org/apache/maven/shared/maven-shared-utils/0.9/maven-shared-utils-0.9.pom
(7 KB at 225.2 KB/sec)
2017-07-13T06:03:02.531 [INFO] Downloading: https://repo.maven.apache.org/maven2/org/apache/maven/surefire/surefire-grouper/2.20/surefire-grouper-2.20.pom
2017-07-13T06:03:02.559 [INFO] Downloaded: https://repo.maven.apache.org/maven2/org/apache/maven/surefire/surefire-grouper/2.20/surefire-grouper-2.20.pom
(3 KB at 91.8 KB/sec)
2017-07-13T06:03:02.562 [INFO] Downloading: https://repo.maven.apache.org/maven2/org/apache/maven/surefire/maven-surefire-common/2.20/maven-surefire-common-2.20.pom
2017-07-13T06:03:02.589 [INFO] Downloaded: https://repo.maven.apache.org/maven2/org/apache/maven/surefire/maven-surefire-common/2.20/maven-surefire-common-2.20.pom
(10 KB at 338.8 KB/sec)
2017-07-13T06:03:02.592 [INFO] Downloading: https://repo.maven.apache.org/maven2/org/apache/maven/plugin-tools/maven-plugin-annotations/3.3/maven-plugin-annotations-3.3.pom
2017-07-13T06:03:02.617 [INFO] Downloaded: https://repo.maven.apache.org/maven2/org/apache/maven/plugin-tools/maven-plugin-annotations/3.3/maven-plugin-annotations-3.3.pom
(2 KB at 63.6 KB/sec)
2017-07-13T06:03:02.618 [INFO] Downloading: https://repo.maven.apache.org/maven2/org/apache/maven/plugin-tools/maven-plugin-tools/3.3/maven-plugin-tools-3.3.pom
2017-07-13T06:03:02.644 [INFO] Downloaded: https://repo.maven.apache.org/maven2/org/apache/maven/plugin-tools/maven-plugin-tools/3.3/maven-plugin-tools-3.3.pom
(13 KB at 475.1 KB/sec)
2017-07-13T06:03:02.647 [INFO] Downloading: https://repo.maven.apache.org/maven2/org/apache/maven/surefire/surefire-booter/2.20/surefire-booter-2.20.pom
2017-07-13T06:03:02.672 [INFO] Downloaded: https://repo.maven.apache.org/maven2/org/apache/maven/surefire/surefire-booter/2.20/surefire-booter-2.20.pom
(4 KB at 124.5 KB/sec)
2017-07-13T06:03:02.676 [INFO] Downloading: https://repo.maven.apache.org/maven2/junit/junit/4.12/junit-4.12.pom
2017-07-13T06:03:02.710 [INFO] Downloaded: https://repo.maven.apache.org/maven2/junit/junit/4.12/junit-4.12.pom
(24 KB at 680.1 KB/sec)
2017-07-13T06:03:02.716 [INFO] Downloading: https://repo.maven.apache.org/maven2/org/apache/maven/maven-toolchain/2.2.1/maven-toolchain-2.2.1.pom
2017-07-13T06:03:02.742 [INFO] Downloaded: https://repo.maven.apache.org/maven2/org/apache/maven/maven-toolchain/2.2.1/maven-toolchain-2.2.1.pom
(4 KB at 125.6 KB/sec)
2017-07-13T06:03:02.745 [INFO] Downloading: https://repo.maven.apache.org/maven2/org/apache/commons/commons-lang3/3.1/commons-lang3-3.1.pom
2017-07-13T06:03:02.771 [INFO] Downloaded: https://repo.maven.apache.org/maven2/org/apache/commons/commons-lang3/3.1/commons-lang3-3.1.pom
(17 KB at 627.7 KB/sec)
2017-07-13T06:03:02.781 [INFO] Downloading: https://repo.maven.apache.org/maven2/org/apache/maven/surefire/surefire-junit47/2.20/surefire-junit47-2.20.jar
2017-07-13T06:03:02.784 [INFO] Downloading: https://repo.maven.apache.org/maven2/org/apache/maven/surefire/common-junit4/2.20/common-junit4-2.20.jar
2017-07-13T06:03:02.784 [INFO] Downloading: https://repo.maven.apache.org/maven2/org/apache/maven/surefire/common-junit48/2.20/common-junit48-2.20.jar
2017-07-13T06:03:02.785 [INFO] Downloading: https://repo.maven.apache.org/maven2/org/apache/maven/surefire/common-java5/2.20/common-java5-2.20.jar
2017-07-13T06:03:02.785 [INFO] Downloading: https://repo.maven.apache.org/maven2/org/apache/maven/surefire/common-junit3/2.20/common-junit3-2.20.jar
2017-07-13T06:03:02.816 [INFO] Downloaded: https://repo.maven.apache.org/maven2/org/apache/maven/surefire/common-junit4/2.20/common-junit4-2.20.jar
(26 KB at 760.0 KB/sec)
2017-07-13T06:03:02.816 [INFO] Downloading: https://repo.maven.apache.org/maven2/org/apache/maven/shared/maven-shared-utils/0.9/maven-shared-utils-0.9.jar
2017-07-13T06:03:02.820 [INFO] Downloaded: https://repo.maven.apache.org/maven2/org/apache/maven/surefire/common-junit48/2.20/common-junit48-2.20.jar
(23 KB at 585.0 KB/sec)
2017-07-13T06:03:02.820 [INFO] Downloading: https://repo.maven.apache.org/maven2/org/apache/maven/surefire/surefire-grouper/2.20/surefire-grouper-2.20.jar
2017-07-13T06:03:02.821 [INFO] Downloaded: https://repo.maven.apache.org/maven2/org/apache/maven/surefire/common-java5/2.20/common-java5-2.20.jar
(49 KB at 1321.7 KB/sec)
2017-07-13T06:03:02.821 [INFO] Downloading: https://repo.maven.apache.org/maven2/org/apache/maven/surefire/maven-surefire-common/2.20/maven-surefire-common-2.20.jar
2017-07-13T06:03:02.832 [INFO] Downloaded: https://repo.maven.apache.org/maven2/org/apache/maven/surefire/common-junit3/2.20/common-junit3-2.20.jar
(12 KB at 232.6 KB/sec)
2017-07-13T06:03:02.832 [INFO] Downloading: https://repo.maven.apache.org/maven2/org/apache/maven/surefire/surefire-booter/2.20/surefire-booter-2.20.jar
2017-07-13T06:03:02.835 [INFO] Downloaded: https://repo.maven.apache.org/maven2/org/apache/maven/surefire/surefire-junit47/2.20/surefire-junit47-2.20.jar
(160 KB at 2898.6 KB/sec)
2017-07-13T06:03:02.835 [INFO] Downloading: https://repo.maven.apache.org/maven2/junit/junit/4.12/junit-4.12.jar
2017-07-13T06:03:02.855 [INFO] Downloaded: https://repo.maven.apache.org/maven2/org/apache/maven/surefire/surefire-grouper/2.20/surefire-grouper-2.20.jar
(40 KB at 549.5 KB/sec)
2017-07-13T06:03:02.855 [INFO] Downloading: https://repo.maven.apache.org/maven2/org/apache/commons/commons-lang3/3.1/commons-lang3-3.1.jar
2017-07-13T06:03:02.872 [INFO] Downloaded: https://repo.maven.apache.org/maven2/org/apache/maven/surefire/surefire-booter/2.20/surefire-booter-2.20.jar
(49 KB at 556.3 KB/sec)
2017-07-13T06:03:02.873 [INFO] Downloading: https://repo.maven.apache.org/maven2/org/apache/maven/surefire/surefire-api/2.20/surefire-api-2.20.jar
2017-07-13T06:03:02.879 [INFO] Downloaded: https://repo.maven.apache.org/maven2/org/apache/maven/shared/maven-shared-utils/0.9/maven-shared-utils-0.9.jar
(168 KB at 1764.7 KB/sec)
2017-07-13T06:03:02.880 [INFO] Downloading: https://repo.maven.apache.org/maven2/org/apache/maven/surefire/surefire-logger-api/2.20/surefire-logger-api-2.20.jar
2017-07-13T06:03:02.883 [INFO] Downloaded: https://repo.maven.apache.org/maven2/org/apache/maven/surefire/maven-surefire-common/2.20/maven-surefire-common-2.20.jar
(324 KB at 3269.1 KB/sec)
2017-07-13T06:03:02.883 [INFO] Downloading: https://repo.maven.apache.org/maven2/org/apache/maven/maven-toolchain/2.2.1/maven-toolchain-2.2.1.jar
2017-07-13T06:03:02.901 [INFO] Downloaded: https://repo.maven.apache.org/maven2/junit/junit/4.12/junit-4.12.jar
(308 KB at 2651.3 KB/sec)
2017-07-13T06:03:02.901 [INFO] Downloading: https://repo.maven.apache.org/maven2/org/apache/maven/plugin-tools/maven-plugin-annotations/3.3/maven-plugin-annotations-3.3.jar
2017-07-13T06:03:02.912 [INFO] Downloaded: https://repo.maven.apache.org/maven2/org/apache/maven/surefire/surefire-logger-api/2.20/surefire-logger-api-2.20.jar
(13 KB at 98.9 KB/sec)
2017-07-13T06:03:02.914 [INFO] Downloaded: https://repo.maven.apache.org/maven2/org/apache/maven/maven-toolchain/2.2.1/maven-toolchain-2.2.1.jar
(37 KB at 284.8 KB/sec)
2017-07-13T06:03:02.917 [INFO] Downloaded: https://repo.maven.apache.org/maven2/org/apache/maven/surefire/surefire-api/2.20/surefire-api-2.20.jar
(179 KB at 1348.9 KB/sec)
2017-07-13T06:03:02.926 [INFO] Downloaded: https://repo.maven.apache.org/maven2/org/apache/commons/commons-lang3/3.1/commons-lang3-3.1.jar
(309 KB at 2202.9 KB/sec)
2017-07-13T06:03:02.926 [INFO] Downloaded: https://repo.maven.apache.org/maven2/org/apache/maven/plugin-tools/maven-plugin-annotations/3.3/maven-plugin-annotations-3.3.jar
(14 KB at 97.2 KB/sec)
[JENKINS] Recording test results
2017-07-13T06:03:03.304 [INFO] 
2017-07-13T06:03:03.304 [INFO] --- build-helper-maven-plugin:3.0.0:regex-properties (render-artifact-id)
@ beam-sdks-java-build-tools ---
2017-07-13T06:03:03.439 [INFO] 
2017-07-13T06:03:03.439 [INFO] --- maven-jar-plugin:3.0.2:jar (default-jar) @ beam-sdks-java-build-tools
---
2017-07-13T06:03:03.486 [INFO] Building jar: <https://builds.apache.org/job/beam_PostCommit_Java_ValidatesRunner_Apex/ws/sdks/java/build-tools/target/beam-sdks-java-build-tools-2.2.0-SNAPSHOT.jar>
2017-07-13T06:03:03.599 [INFO] 
2017-07-13T06:03:03.599 [INFO] --- maven-site-plugin:3.5.1:attach-descriptor (attach-descriptor)
@ beam-sdks-java-build-tools ---
2017-07-13T06:03:03.701 [INFO] 
2017-07-13T06:03:03.701 [INFO] --- maven-jar-plugin:3.0.2:test-jar (default-test-jar) @ beam-sdks-java-build-tools
---
2017-07-13T06:03:03.707 [INFO] Building jar: <https://builds.apache.org/job/beam_PostCommit_Java_ValidatesRunner_Apex/ws/sdks/java/build-tools/target/beam-sdks-java-build-tools-2.2.0-SNAPSHOT-tests.jar>
2017-07-13T06:03:03.775 [INFO] 
2017-07-13T06:03:03.776 [INFO] --- maven-shade-plugin:3.0.0:shade (bundle-and-repackage) @
beam-sdks-java-build-tools ---
2017-07-13T06:03:03.829 [INFO] Replacing original artifact with shaded artifact.
2017-07-13T06:03:03.829 [INFO] Replacing <https://builds.apache.org/job/beam_PostCommit_Java_ValidatesRunner_Apex/ws/sdks/java/build-tools/target/beam-sdks-java-build-tools-2.2.0-SNAPSHOT.jar>
with <https://builds.apache.org/job/beam_PostCommit_Java_ValidatesRunner_Apex/ws/sdks/java/build-tools/target/beam-sdks-java-build-tools-2.2.0-SNAPSHOT-shaded.jar>
2017-07-13T06:03:03.829 [INFO] Replacing original test artifact with shaded test artifact.
2017-07-13T06:03:03.829 [INFO] Replacing <https://builds.apache.org/job/beam_PostCommit_Java_ValidatesRunner_Apex/ws/sdks/java/build-tools/target/beam-sdks-java-build-tools-2.2.0-SNAPSHOT-tests.jar>
with <https://builds.apache.org/job/beam_PostCommit_Java_ValidatesRunner_Apex/ws/sdks/java/build-tools/target/beam-sdks-java-build-tools-2.2.0-SNAPSHOT-shaded-tests.jar>
2017-07-13T06:03:03.879 [INFO] 
2017-07-13T06:03:03.879 [INFO] --- maven-dependency-plugin:3.0.1:analyze-only (default) @
beam-sdks-java-build-tools ---
2017-07-13T06:03:03.915 [INFO] No dependency problems found
[JENKINS] Archiving disabled
2017-07-13T06:03:05.989 [INFO]                                                           
             
2017-07-13T06:03:05.989 [INFO] ------------------------------------------------------------------------
2017-07-13T06:03:05.989 [INFO] Building Apache Beam :: SDKs 2.2.0-SNAPSHOT
2017-07-13T06:03:05.989 [INFO] ------------------------------------------------------------------------
2017-07-13T06:03:05.992 [INFO] 
2017-07-13T06:03:05.992 [INFO] --- maven-clean-plugin:3.0.0:clean (default-clean) @ beam-sdks-parent
---
2017-07-13T06:03:05.994 [INFO] Deleting <https://builds.apache.org/job/beam_PostCommit_Java_ValidatesRunner_Apex/ws/sdks>
(includes = [**/*.pyc, **/*.egg-info/, **/sdks/python/LICENSE, **/sdks/python/NOTICE, **/sdks/python/README.md],
excludes = [])
2017-07-13T06:03:06.240 [INFO] 
2017-07-13T06:03:06.240 [INFO] --- maven-enforcer-plugin:1.4.1:enforce (enforce) @ beam-sdks-parent
---
2017-07-13T06:03:07.182 [INFO] 
2017-07-13T06:03:07.182 [INFO] --- maven-enforcer-plugin:1.4.1:enforce (enforce-banned-dependencies)
@ beam-sdks-parent ---
2017-07-13T06:03:07.269 [INFO] 
2017-07-13T06:03:07.269 [INFO] --- maven-remote-resources-plugin:1.5:process (process-resource-bundles)
@ beam-sdks-parent ---
2017-07-13T06:03:08.478 [INFO] 
2017-07-13T06:03:08.478 [INFO] --- maven-checkstyle-plugin:2.17:check (default) @ beam-sdks-parent
---
2017-07-13T06:03:09.298 [INFO] Starting audit...
Audit done.
2017-07-13T06:03:09.939 [INFO] 
2017-07-13T06:03:09.939 [INFO] --- build-helper-maven-plugin:3.0.0:regex-properties (render-artifact-id)
@ beam-sdks-parent ---
2017-07-13T06:03:10.003 [INFO] 
2017-07-13T06:03:10.003 [INFO] --- maven-site-plugin:3.5.1:attach-descriptor (attach-descriptor)
@ beam-sdks-parent ---
2017-07-13T06:03:10.101 [INFO] 
2017-07-13T06:03:10.101 [INFO] --- maven-jar-plugin:3.0.2:jar (default-jar) @ beam-sdks-parent
---
2017-07-13T06:03:10.102 [INFO] Skipping packaging of the jar
2017-07-13T06:03:10.199 [INFO] 
2017-07-13T06:03:10.199 [INFO] --- maven-jar-plugin:3.0.2:test-jar (default-test-jar) @ beam-sdks-parent
---
2017-07-13T06:03:10.200 [INFO] Skipping packaging of the test-jar
2017-07-13T06:03:10.249 [INFO] 
2017-07-13T06:03:10.249 [INFO] --- maven-shade-plugin:3.0.0:shade (bundle-and-repackage) @
beam-sdks-parent ---
2017-07-13T06:03:10.252 [INFO] Replacing original artifact with shaded artifact.
2017-07-13T06:03:10.302 [INFO] 
2017-07-13T06:03:10.302 [INFO] --- maven-dependency-plugin:3.0.1:analyze-only (default) @
beam-sdks-parent ---
2017-07-13T06:03:10.303 [INFO] Skipping pom project
[JENKINS] Archiving disabled
2017-07-13T06:03:10.984 [INFO]                                                           
             
2017-07-13T06:03:10.984 [INFO] ------------------------------------------------------------------------
2017-07-13T06:03:10.984 [INFO] Building Apache Beam :: SDKs :: Common 2.2.0-SNAPSHOT
2017-07-13T06:03:10.984 [INFO] ------------------------------------------------------------------------
2017-07-13T06:03:10.987 [INFO] 
2017-07-13T06:03:10.987 [INFO] --- maven-clean-plugin:3.0.0:clean (default-clean) @ beam-sdks-common-parent
---
2017-07-13T06:03:10.989 [INFO] Deleting <https://builds.apache.org/job/beam_PostCommit_Java_ValidatesRunner_Apex/ws/sdks/common>
(includes = [**/*.pyc, **/*.egg-info/, **/sdks/python/LICENSE, **/sdks/python/NOTICE, **/sdks/python/README.md],
excludes = [])
2017-07-13T06:03:11.038 [INFO] 
2017-07-13T06:03:11.038 [INFO] --- maven-enforcer-plugin:1.4.1:enforce (enforce) @ beam-sdks-common-parent
---
2017-07-13T06:03:11.190 [INFO] 
2017-07-13T06:03:11.190 [INFO] --- maven-enforcer-plugin:1.4.1:enforce (enforce-banned-dependencies)
@ beam-sdks-common-parent ---
2017-07-13T06:03:11.255 [INFO] 
2017-07-13T06:03:11.255 [INFO] --- maven-remote-resources-plugin:1.5:process (process-resource-bundles)
@ beam-sdks-common-parent ---
2017-07-13T06:03:11.317 [INFO] 
2017-07-13T06:03:11.317 [INFO] --- maven-checkstyle-plugin:2.17:check (default) @ beam-sdks-common-parent
---
2017-07-13T06:03:12.033 [INFO] Starting audit...
Audit done.
2017-07-13T06:03:12.083 [INFO] 
2017-07-13T06:03:12.084 [INFO] --- build-helper-maven-plugin:3.0.0:regex-properties (render-artifact-id)
@ beam-sdks-common-parent ---
2017-07-13T06:03:12.193 [INFO] 
2017-07-13T06:03:12.193 [INFO] --- maven-site-plugin:3.5.1:attach-descriptor (attach-descriptor)
@ beam-sdks-common-parent ---
2017-07-13T06:03:12.370 [INFO] 
2017-07-13T06:03:12.370 [INFO] --- maven-jar-plugin:3.0.2:jar (default-jar) @ beam-sdks-common-parent
---
2017-07-13T06:03:12.371 [INFO] Skipping packaging of the jar
2017-07-13T06:03:12.509 [INFO] 
2017-07-13T06:03:12.509 [INFO] --- maven-jar-plugin:3.0.2:test-jar (default-test-jar) @ beam-sdks-common-parent
---
2017-07-13T06:03:12.510 [INFO] Skipping packaging of the test-jar
2017-07-13T06:03:12.569 [INFO] 
2017-07-13T06:03:12.569 [INFO] --- maven-shade-plugin:3.0.0:shade (bundle-and-repackage) @
beam-sdks-common-parent ---
2017-07-13T06:03:12.573 [INFO] Replacing original artifact with shaded artifact.
2017-07-13T06:03:12.662 [INFO] 
2017-07-13T06:03:12.662 [INFO] --- maven-dependency-plugin:3.0.1:analyze-only (default) @
beam-sdks-common-parent ---
2017-07-13T06:03:12.662 [INFO] Skipping pom project
[JENKINS] Archiving disabled
2017-07-13T06:03:13.401 [INFO]                                                           
             
2017-07-13T06:03:13.402 [INFO] ------------------------------------------------------------------------
2017-07-13T06:03:13.402 [INFO] Building Apache Beam :: SDKs :: Common :: Runner API 2.2.0-SNAPSHOT
2017-07-13T06:03:13.402 [INFO] ------------------------------------------------------------------------
2017-07-13T06:03:13.403 [INFO] Downloading: https://repo.maven.apache.org/maven2/org/xolstice/maven/plugins/protobuf-maven-plugin/0.5.0/protobuf-maven-plugin-0.5.0.pom
[INFO] I/O exception (java.net.SocketException) caught when processing request to {s}->https://repo.maven.apache.org:443:
Connection reset
[INFO] Retrying request to {s}->https://repo.maven.apache.org:443
[INFO] I/O exception (java.net.SocketException) caught when processing request to {s}->https://repo.maven.apache.org:443:
Connection reset
[INFO] Retrying request to {s}->https://repo.maven.apache.org:443
[INFO] I/O exception (java.net.SocketException) caught when processing request to {s}->https://repo.maven.apache.org:443:
Connection reset
[INFO] Retrying request to {s}->https://repo.maven.apache.org:443
[JENKINS] Archiving disabled
[JENKINS] Archiving disabled
[JENKINS] Archiving disabled
[JENKINS] Archiving disabled
[JENKINS] Archiving disabled
[JENKINS] Archiving disabled
[JENKINS] Archiving disabled
[JENKINS] Archiving disabled
[JENKINS] Archiving disabled
[JENKINS] Archiving disabled
[JENKINS] Archiving disabled
[JENKINS] Archiving disabled
[JENKINS] Archiving disabled2017-07-13T06:03:17.019 [INFO] ------------------------------------------------------------------------
2017-07-13T06:03:17.019 [INFO] Reactor Summary:
2017-07-13T06:03:17.019 [INFO] 
2017-07-13T06:03:17.019 [INFO] Apache Beam :: Parent .............................. SUCCESS
[ 22.752 s]
2017-07-13T06:03:17.019 [INFO] Apache Beam :: SDKs :: Java :: Build Tools ......... SUCCESS
[ 11.692 s]
2017-07-13T06:03:17.020 [INFO] Apache Beam :: SDKs ................................ SUCCESS
[  4.902 s]
2017-07-13T06:03:17.020 [INFO] Apache Beam :: SDKs :: Common ...................... SUCCESS
[  1.885 s]
2017-07-13T06:03:17.020 [INFO] Apache Beam :: SDKs :: Common :: Runner API ........ FAILURE
[  0.210 s]
2017-07-13T06:03:17.020 [INFO] Apache Beam :: SDKs :: Common :: Fn API ............ SKIPPED

2017-07-13T06:03:17.020 [INFO] Apache Beam :: SDKs :: Java ........................ SKIPPED
2017-07-13T06:03:17.020 [INFO] Apache Beam :: SDKs :: Java :: Core ................ SKIPPED
2017-07-13T06:03:17.020 [INFO] Apache Beam :: Runners ............................. SKIPPED
2017-07-13T06:03:17.020 [INFO] Apache Beam :: Runners :: Core Construction Java ... SKIPPED
2017-07-13T06:03:17.020 [INFO] Apache Beam :: Runners :: Core Java ................ SKIPPED
2017-07-13T06:03:17.020 [INFO] Apache Beam :: Runners :: Apex ..................... SKIPPED
2017-07-13T06:03:17.020 [INFO] ------------------------------------------------------------------------
2017-07-13T06:03:17.020 [INFO] BUILD FAILURE
2017-07-13T06:03:17.020 [INFO] ------------------------------------------------------------------------
2017-07-13T06:03:17.020 [INFO] Total time: 01:30 min
2017-07-13T06:03:17.020 [INFO] Finished at: 2017-07-13T06:03:17+00:00
2017-07-13T06:03:17.494 [INFO] Final Memory: 68M/914M
2017-07-13T06:03:17.494 [INFO] ------------------------------------------------------------------------
2017-07-13T06:03:17.494 [WARNING] The requested profile "validates-runner-tests" could not
be activated because it does not exist.
2017-07-13T06:03:17.498 [ERROR] Plugin org.xolstice.maven.plugins:protobuf-maven-plugin:0.5.0
or one of its dependencies could not be resolved: Failed to read artifact descriptor for org.xolstice.maven.plugins:protobuf-maven-plugin:jar:0.5.0:
Could not transfer artifact org.xolstice.maven.plugins:protobuf-maven-plugin:pom:0.5.0 from/to
central (https://repo.maven.apache.org/maven2): Connection reset -> [Help 1]
2017-07-13T06:03:17.498 [ERROR] 
2017-07-13T06:03:17.498 [ERROR] To see the full stack trace of the errors, re-run Maven with
the -e switch.
2017-07-13T06:03:17.498 [ERROR] Re-run Maven using the -X switch to enable full debug logging.
2017-07-13T06:03:17.498 [ERROR] 
2017-07-13T06:03:17.498 [ERROR] For more information about the errors and possible solutions,
please read the following articles:
2017-07-13T06:03:17.498 [ERROR] [Help 1] http://cwiki.apache.org/confluence/display/MAVEN/PluginResolutionException
channel stopped

Mime
View raw message