beam-commits mailing list archives

Site index · List index
Message view « Date » · « Thread »
Top « Date » · « Thread »
From Apache Jenkins Server <jenk...@builds.apache.org>
Subject Build failed in Jenkins: beam_PostCommit_Java_ValidatesRunner_Apex #1899
Date Mon, 03 Jul 2017 12:13:30 GMT
See <https://builds.apache.org/job/beam_PostCommit_Java_ValidatesRunner_Apex/1899/display/redirect>

------------------------------------------
Started by timer
[EnvInject] - Loading node environment variables.
Building remotely on beam1 (beam) in workspace <https://builds.apache.org/job/beam_PostCommit_Java_ValidatesRunner_Apex/ws/>
 > git rev-parse --is-inside-work-tree # timeout=10
Fetching changes from the remote Git repository
 > git config remote.origin.url https://github.com/apache/beam.git # timeout=10
Fetching upstream changes from https://github.com/apache/beam.git
 > git --version # timeout=10
 > git fetch --tags --progress https://github.com/apache/beam.git +refs/heads/*:refs/remotes/origin/*
+refs/pull/${ghprbPullId}/*:refs/remotes/origin/pr/${ghprbPullId}/*
 > git rev-parse origin/master^{commit} # timeout=10
Checking out Revision 11010cf08ec9ca90a843cc15ea8f0fd4910f7fab (origin/master)
 > git config core.sparsecheckout # timeout=10
 > git checkout -f 11010cf08ec9ca90a843cc15ea8f0fd4910f7fab
 > git rev-list 11010cf08ec9ca90a843cc15ea8f0fd4910f7fab # timeout=10
Cleaning workspace
 > git rev-parse --verify HEAD # timeout=10
Resetting working tree
 > git reset --hard # timeout=10
 > git clean -fdx # timeout=10
[EnvInject] - Executing scripts and injecting environment variables after the SCM step.
[EnvInject] - Injecting as environment variables the properties content 
SPARK_LOCAL_IP=127.0.0.1

[EnvInject] - Variables injected successfully.
Parsing POMs
Downloaded artifact http://repo.maven.apache.org/maven2/org/apache/apache/18/apache-18.pom
Modules changed, recalculating dependency graph
Established TCP socket on 53950
maven33-agent.jar already up to date
maven33-interceptor.jar already up to date
maven3-interceptor-commons.jar already up to date
[beam_PostCommit_Java_ValidatesRunner_Apex] $ /home/jenkins/tools/java/latest1.8/bin/java
-Dorg.slf4j.simpleLogger.showDateTime=true -Dorg.slf4j.simpleLogger.dateTimeFormat=yyyy-MM-dd'T'HH:mm:ss.SSS
-XX:+TieredCompilation -XX:TieredStopAtLevel=1 -cp /home/jenkins/jenkins-slave/maven33-agent.jar:/home/jenkins/tools/maven/apache-maven-3.3.3/boot/plexus-classworlds-2.5.2.jar:/home/jenkins/tools/maven/apache-maven-3.3.3/conf/logging
jenkins.maven3.agent.Maven33Main /home/jenkins/tools/maven/apache-maven-3.3.3 /home/jenkins/jenkins-slave/slave.jar
/home/jenkins/jenkins-slave/maven33-interceptor.jar /home/jenkins/jenkins-slave/maven3-interceptor-commons.jar
53950
<===[JENKINS REMOTING CAPACITY]===>   channel started
Executing Maven:  -B -f <https://builds.apache.org/job/beam_PostCommit_Java_ValidatesRunner_Apex/ws/pom.xml>
-Dmaven.repo.local=<https://builds.apache.org/job/beam_PostCommit_Java_ValidatesRunner_Apex/ws/.repository>
clean verify --projects runners/apex --also-make --batch-mode --errors --activate-profiles
validates-runner-tests --activate-profiles local-validates-runner-tests
2017-07-03T12:03:10.605 [INFO] Error stacktraces are turned on.
2017-07-03T12:03:10.668 [INFO] Scanning for projects...
2017-07-03T12:03:11.453 [INFO] Downloading: https://repo.maven.apache.org/maven2/kr/motd/maven/os-maven-plugin/1.5.0.Final/os-maven-plugin-1.5.0.Final.pom
2017-07-03T12:03:11.841 [INFO] Downloaded: https://repo.maven.apache.org/maven2/kr/motd/maven/os-maven-plugin/1.5.0.Final/os-maven-plugin-1.5.0.Final.pom
(7 KB at 15.9 KB/sec)
2017-07-03T12:03:11.848 [INFO] Downloading: https://repo.maven.apache.org/maven2/org/sonatype/oss/oss-parent/9/oss-parent-9.pom
2017-07-03T12:03:11.878 [INFO] Downloaded: https://repo.maven.apache.org/maven2/org/sonatype/oss/oss-parent/9/oss-parent-9.pom
(7 KB at 213.8 KB/sec)
2017-07-03T12:03:11.886 [INFO] Downloading: https://repo.maven.apache.org/maven2/org/apache/maven/maven-plugin-api/3.2.1/maven-plugin-api-3.2.1.pom
2017-07-03T12:03:11.915 [INFO] Downloaded: https://repo.maven.apache.org/maven2/org/apache/maven/maven-plugin-api/3.2.1/maven-plugin-api-3.2.1.pom
(4 KB at 113.9 KB/sec)
2017-07-03T12:03:11.917 [INFO] Downloading: https://repo.maven.apache.org/maven2/org/apache/maven/maven/3.2.1/maven-3.2.1.pom
2017-07-03T12:03:11.955 [INFO] Downloaded: https://repo.maven.apache.org/maven2/org/apache/maven/maven/3.2.1/maven-3.2.1.pom
(23 KB at 565.6 KB/sec)
2017-07-03T12:03:11.958 [INFO] Downloading: https://repo.maven.apache.org/maven2/org/apache/maven/maven-parent/23/maven-parent-23.pom
2017-07-03T12:03:11.998 [INFO] Downloaded: https://repo.maven.apache.org/maven2/org/apache/maven/maven-parent/23/maven-parent-23.pom
(32 KB at 816.0 KB/sec)
2017-07-03T12:03:12.001 [INFO] Downloading: https://repo.maven.apache.org/maven2/org/apache/apache/13/apache-13.pom
2017-07-03T12:03:12.032 [INFO] Downloaded: https://repo.maven.apache.org/maven2/org/apache/apache/13/apache-13.pom
(14 KB at 440.2 KB/sec)
2017-07-03T12:03:12.038 [INFO] Downloading: https://repo.maven.apache.org/maven2/org/apache/maven/maven-model/3.2.1/maven-model-3.2.1.pom
2017-07-03T12:03:12.070 [INFO] Downloaded: https://repo.maven.apache.org/maven2/org/apache/maven/maven-model/3.2.1/maven-model-3.2.1.pom
(5 KB at 126.4 KB/sec)
2017-07-03T12:03:12.074 [INFO] Downloading: https://repo.maven.apache.org/maven2/org/codehaus/plexus/plexus-utils/3.0.17/plexus-utils-3.0.17.pom
2017-07-03T12:03:12.102 [INFO] Downloaded: https://repo.maven.apache.org/maven2/org/codehaus/plexus/plexus-utils/3.0.17/plexus-utils-3.0.17.pom
(4 KB at 118.4 KB/sec)
2017-07-03T12:03:12.104 [INFO] Downloading: https://repo.maven.apache.org/maven2/org/codehaus/plexus/plexus/3.3.1/plexus-3.3.1.pom
2017-07-03T12:03:12.138 [INFO] Downloaded: https://repo.maven.apache.org/maven2/org/codehaus/plexus/plexus/3.3.1/plexus-3.3.1.pom
(20 KB at 587.3 KB/sec)
2017-07-03T12:03:12.141 [INFO] Downloading: https://repo.maven.apache.org/maven2/org/sonatype/spice/spice-parent/17/spice-parent-17.pom
2017-07-03T12:03:12.169 [INFO] Downloaded: https://repo.maven.apache.org/maven2/org/sonatype/spice/spice-parent/17/spice-parent-17.pom
(7 KB at 235.7 KB/sec)
2017-07-03T12:03:12.171 [INFO] Downloading: https://repo.maven.apache.org/maven2/org/sonatype/forge/forge-parent/10/forge-parent-10.pom
2017-07-03T12:03:12.201 [INFO] Downloaded: https://repo.maven.apache.org/maven2/org/sonatype/forge/forge-parent/10/forge-parent-10.pom
(14 KB at 441.4 KB/sec)
2017-07-03T12:03:12.205 [INFO] Downloading: https://repo.maven.apache.org/maven2/org/apache/maven/maven-artifact/3.2.1/maven-artifact-3.2.1.pom
2017-07-03T12:03:12.232 [INFO] Downloaded: https://repo.maven.apache.org/maven2/org/apache/maven/maven-artifact/3.2.1/maven-artifact-3.2.1.pom
(2 KB at 71.3 KB/sec)
2017-07-03T12:03:12.237 [INFO] Downloading: https://repo.maven.apache.org/maven2/org/eclipse/sisu/org.eclipse.sisu.plexus/0.0.0.M5/org.eclipse.sisu.plexus-0.0.0.M5.pom
2017-07-03T12:03:12.266 [INFO] Downloaded: https://repo.maven.apache.org/maven2/org/eclipse/sisu/org.eclipse.sisu.plexus/0.0.0.M5/org.eclipse.sisu.plexus-0.0.0.M5.pom
(5 KB at 162.6 KB/sec)
2017-07-03T12:03:12.268 [INFO] Downloading: https://repo.maven.apache.org/maven2/org/eclipse/sisu/sisu-plexus/0.0.0.M5/sisu-plexus-0.0.0.M5.pom
2017-07-03T12:03:12.301 [INFO] Downloaded: https://repo.maven.apache.org/maven2/org/eclipse/sisu/sisu-plexus/0.0.0.M5/sisu-plexus-0.0.0.M5.pom
(13 KB at 402.9 KB/sec)
2017-07-03T12:03:12.303 [INFO] Downloading: https://repo.maven.apache.org/maven2/org/sonatype/oss/oss-parent/7/oss-parent-7.pom
2017-07-03T12:03:12.331 [INFO] Downloaded: https://repo.maven.apache.org/maven2/org/sonatype/oss/oss-parent/7/oss-parent-7.pom
(5 KB at 168.2 KB/sec)
2017-07-03T12:03:12.334 [INFO] Downloading: https://repo.maven.apache.org/maven2/javax/enterprise/cdi-api/1.0/cdi-api-1.0.pom
2017-07-03T12:03:12.364 [INFO] Downloaded: https://repo.maven.apache.org/maven2/javax/enterprise/cdi-api/1.0/cdi-api-1.0.pom
(2 KB at 46.7 KB/sec)
2017-07-03T12:03:12.366 [INFO] Downloading: https://repo.maven.apache.org/maven2/org/jboss/weld/weld-api-parent/1.0/weld-api-parent-1.0.pom
2017-07-03T12:03:12.394 [INFO] Downloaded: https://repo.maven.apache.org/maven2/org/jboss/weld/weld-api-parent/1.0/weld-api-parent-1.0.pom
(3 KB at 82.1 KB/sec)
2017-07-03T12:03:12.396 [INFO] Downloading: https://repo.maven.apache.org/maven2/org/jboss/weld/weld-api-bom/1.0/weld-api-bom-1.0.pom
2017-07-03T12:03:12.436 [INFO] Downloaded: https://repo.maven.apache.org/maven2/org/jboss/weld/weld-api-bom/1.0/weld-api-bom-1.0.pom
(8 KB at 193.0 KB/sec)
2017-07-03T12:03:12.438 [INFO] Downloading: https://repo.maven.apache.org/maven2/org/jboss/weld/weld-parent/6/weld-parent-6.pom
2017-07-03T12:03:12.475 [INFO] Downloaded: https://repo.maven.apache.org/maven2/org/jboss/weld/weld-parent/6/weld-parent-6.pom
(21 KB at 546.1 KB/sec)
2017-07-03T12:03:12.479 [INFO] Downloading: https://repo.maven.apache.org/maven2/javax/annotation/jsr250-api/1.0/jsr250-api-1.0.pom
2017-07-03T12:03:12.508 [INFO] Downloaded: https://repo.maven.apache.org/maven2/javax/annotation/jsr250-api/1.0/jsr250-api-1.0.pom
(1023 B at 34.4 KB/sec)
2017-07-03T12:03:12.511 [INFO] Downloading: https://repo.maven.apache.org/maven2/javax/inject/javax.inject/1/javax.inject-1.pom
2017-07-03T12:03:12.538 [INFO] Downloaded: https://repo.maven.apache.org/maven2/javax/inject/javax.inject/1/javax.inject-1.pom
(612 B at 22.1 KB/sec)
2017-07-03T12:03:12.540 [INFO] Downloading: https://repo.maven.apache.org/maven2/com/google/guava/guava/10.0.1/guava-10.0.1.pom
2017-07-03T12:03:12.569 [INFO] Downloaded: https://repo.maven.apache.org/maven2/com/google/guava/guava/10.0.1/guava-10.0.1.pom
(6 KB at 181.3 KB/sec)
2017-07-03T12:03:12.571 [INFO] Downloading: https://repo.maven.apache.org/maven2/com/google/guava/guava-parent/10.0.1/guava-parent-10.0.1.pom
2017-07-03T12:03:12.599 [INFO] Downloaded: https://repo.maven.apache.org/maven2/com/google/guava/guava-parent/10.0.1/guava-parent-10.0.1.pom
(2 KB at 68.3 KB/sec)
2017-07-03T12:03:12.602 [INFO] Downloading: https://repo.maven.apache.org/maven2/com/google/code/findbugs/jsr305/1.3.9/jsr305-1.3.9.pom
2017-07-03T12:03:12.629 [INFO] Downloaded: https://repo.maven.apache.org/maven2/com/google/code/findbugs/jsr305/1.3.9/jsr305-1.3.9.pom
(965 B at 34.9 KB/sec)
2017-07-03T12:03:12.631 [INFO] Downloading: https://repo.maven.apache.org/maven2/org/sonatype/sisu/sisu-guice/3.1.0/sisu-guice-3.1.0.pom
2017-07-03T12:03:12.660 [INFO] Downloaded: https://repo.maven.apache.org/maven2/org/sonatype/sisu/sisu-guice/3.1.0/sisu-guice-3.1.0.pom
(10 KB at 341.8 KB/sec)
2017-07-03T12:03:12.662 [INFO] Downloading: https://repo.maven.apache.org/maven2/org/sonatype/sisu/inject/guice-parent/3.1.0/guice-parent-3.1.0.pom
2017-07-03T12:03:12.692 [INFO] Downloaded: https://repo.maven.apache.org/maven2/org/sonatype/sisu/inject/guice-parent/3.1.0/guice-parent-3.1.0.pom
(11 KB at 355.7 KB/sec)
2017-07-03T12:03:12.696 [INFO] Downloading: https://repo.maven.apache.org/maven2/aopalliance/aopalliance/1.0/aopalliance-1.0.pom
2017-07-03T12:03:12.723 [INFO] Downloaded: https://repo.maven.apache.org/maven2/aopalliance/aopalliance/1.0/aopalliance-1.0.pom
(363 B at 13.1 KB/sec)
2017-07-03T12:03:12.725 [INFO] Downloading: https://repo.maven.apache.org/maven2/org/eclipse/sisu/org.eclipse.sisu.inject/0.0.0.M5/org.eclipse.sisu.inject-0.0.0.M5.pom
2017-07-03T12:03:12.765 [INFO] Downloaded: https://repo.maven.apache.org/maven2/org/eclipse/sisu/org.eclipse.sisu.inject/0.0.0.M5/org.eclipse.sisu.inject-0.0.0.M5.pom
(3 KB at 61.5 KB/sec)
2017-07-03T12:03:12.767 [INFO] Downloading: https://repo.maven.apache.org/maven2/org/eclipse/sisu/sisu-inject/0.0.0.M5/sisu-inject-0.0.0.M5.pom
2017-07-03T12:03:12.809 [INFO] Downloaded: https://repo.maven.apache.org/maven2/org/eclipse/sisu/sisu-inject/0.0.0.M5/sisu-inject-0.0.0.M5.pom
(14 KB at 325.4 KB/sec)
2017-07-03T12:03:12.813 [INFO] Downloading: https://repo.maven.apache.org/maven2/org/codehaus/plexus/plexus-component-annotations/1.5.5/plexus-component-annotations-1.5.5.pom
2017-07-03T12:03:12.840 [INFO] Downloaded: https://repo.maven.apache.org/maven2/org/codehaus/plexus/plexus-component-annotations/1.5.5/plexus-component-annotations-1.5.5.pom
(815 B at 29.5 KB/sec)
2017-07-03T12:03:12.842 [INFO] Downloading: https://repo.maven.apache.org/maven2/org/codehaus/plexus/plexus-containers/1.5.5/plexus-containers-1.5.5.pom
2017-07-03T12:03:12.868 [INFO] Downloaded: https://repo.maven.apache.org/maven2/org/codehaus/plexus/plexus-containers/1.5.5/plexus-containers-1.5.5.pom
(5 KB at 159.3 KB/sec)
2017-07-03T12:03:12.870 [INFO] Downloading: https://repo.maven.apache.org/maven2/org/codehaus/plexus/plexus/2.0.7/plexus-2.0.7.pom
2017-07-03T12:03:12.902 [INFO] Downloaded: https://repo.maven.apache.org/maven2/org/codehaus/plexus/plexus/2.0.7/plexus-2.0.7.pom
(17 KB at 527.8 KB/sec)
2017-07-03T12:03:12.905 [INFO] Downloading: https://repo.maven.apache.org/maven2/org/codehaus/plexus/plexus-classworlds/2.4/plexus-classworlds-2.4.pom
2017-07-03T12:03:12.932 [INFO] Downloaded: https://repo.maven.apache.org/maven2/org/codehaus/plexus/plexus-classworlds/2.4/plexus-classworlds-2.4.pom
(4 KB at 140.4 KB/sec)
2017-07-03T12:03:12.935 [INFO] Downloading: https://repo.maven.apache.org/maven2/org/codehaus/plexus/plexus-utils/2.1/plexus-utils-2.1.pom
2017-07-03T12:03:12.961 [INFO] Downloaded: https://repo.maven.apache.org/maven2/org/codehaus/plexus/plexus-utils/2.1/plexus-utils-2.1.pom
(4 KB at 151.5 KB/sec)
2017-07-03T12:03:12.963 [INFO] Downloading: https://repo.maven.apache.org/maven2/org/sonatype/spice/spice-parent/16/spice-parent-16.pom
2017-07-03T12:03:12.991 [INFO] Downloaded: https://repo.maven.apache.org/maven2/org/sonatype/spice/spice-parent/16/spice-parent-16.pom
(9 KB at 291.5 KB/sec)
2017-07-03T12:03:12.993 [INFO] Downloading: https://repo.maven.apache.org/maven2/org/sonatype/forge/forge-parent/5/forge-parent-5.pom
2017-07-03T12:03:13.021 [INFO] Downloaded: https://repo.maven.apache.org/maven2/org/sonatype/forge/forge-parent/5/forge-parent-5.pom
(9 KB at 291.7 KB/sec)
2017-07-03T12:03:13.036 [INFO] Downloading: https://repo.maven.apache.org/maven2/kr/motd/maven/os-maven-plugin/1.5.0.Final/os-maven-plugin-1.5.0.Final.jar
2017-07-03T12:03:13.036 [INFO] Downloading: https://repo.maven.apache.org/maven2/org/apache/maven/maven-plugin-api/3.2.1/maven-plugin-api-3.2.1.jar
2017-07-03T12:03:13.036 [INFO] Downloading: https://repo.maven.apache.org/maven2/org/apache/maven/maven-model/3.2.1/maven-model-3.2.1.jar
2017-07-03T12:03:13.037 [INFO] Downloading: https://repo.maven.apache.org/maven2/org/apache/maven/maven-artifact/3.2.1/maven-artifact-3.2.1.jar
2017-07-03T12:03:13.040 [INFO] Downloading: https://repo.maven.apache.org/maven2/org/eclipse/sisu/org.eclipse.sisu.plexus/0.0.0.M5/org.eclipse.sisu.plexus-0.0.0.M5.jar
2017-07-03T12:03:13.109 [INFO] Downloaded: https://repo.maven.apache.org/maven2/kr/motd/maven/os-maven-plugin/1.5.0.Final/os-maven-plugin-1.5.0.Final.jar
(29 KB at 385.1 KB/sec)
2017-07-03T12:03:13.109 [INFO] Downloading: https://repo.maven.apache.org/maven2/javax/enterprise/cdi-api/1.0/cdi-api-1.0.jar
2017-07-03T12:03:13.116 [INFO] Downloaded: https://repo.maven.apache.org/maven2/org/apache/maven/maven-plugin-api/3.2.1/maven-plugin-api-3.2.1.jar
(45 KB at 559.5 KB/sec)
2017-07-03T12:03:13.116 [INFO] Downloading: https://repo.maven.apache.org/maven2/javax/annotation/jsr250-api/1.0/jsr250-api-1.0.jar
2017-07-03T12:03:13.124 [INFO] Downloaded: https://repo.maven.apache.org/maven2/org/apache/maven/maven-artifact/3.2.1/maven-artifact-3.2.1.jar
(53 KB at 595.4 KB/sec)
2017-07-03T12:03:13.124 [INFO] Downloading: https://repo.maven.apache.org/maven2/javax/inject/javax.inject/1/javax.inject-1.jar
2017-07-03T12:03:13.125 [INFO] Downloaded: https://repo.maven.apache.org/maven2/org/apache/maven/maven-model/3.2.1/maven-model-3.2.1.jar
(157 KB at 1754.0 KB/sec)
2017-07-03T12:03:13.126 [INFO] Downloading: https://repo.maven.apache.org/maven2/com/google/guava/guava/10.0.1/guava-10.0.1.jar
2017-07-03T12:03:13.143 [INFO] Downloaded: https://repo.maven.apache.org/maven2/javax/annotation/jsr250-api/1.0/jsr250-api-1.0.jar
(6 KB at 53.9 KB/sec)
2017-07-03T12:03:13.143 [INFO] Downloading: https://repo.maven.apache.org/maven2/com/google/code/findbugs/jsr305/1.3.9/jsr305-1.3.9.jar
2017-07-03T12:03:13.146 [INFO] Downloaded: https://repo.maven.apache.org/maven2/javax/enterprise/cdi-api/1.0/cdi-api-1.0.jar
(44 KB at 402.3 KB/sec)
2017-07-03T12:03:13.146 [INFO] Downloading: https://repo.maven.apache.org/maven2/org/sonatype/sisu/sisu-guice/3.1.0/sisu-guice-3.1.0-no_aop.jar
2017-07-03T12:03:13.151 [INFO] Downloaded: https://repo.maven.apache.org/maven2/javax/inject/javax.inject/1/javax.inject-1.jar
(3 KB at 21.4 KB/sec)
2017-07-03T12:03:13.151 [INFO] Downloading: https://repo.maven.apache.org/maven2/aopalliance/aopalliance/1.0/aopalliance-1.0.jar
2017-07-03T12:03:13.155 [INFO] Downloaded: https://repo.maven.apache.org/maven2/org/eclipse/sisu/org.eclipse.sisu.plexus/0.0.0.M5/org.eclipse.sisu.plexus-0.0.0.M5.jar
(192 KB at 1626.6 KB/sec)
2017-07-03T12:03:13.155 [INFO] Downloading: https://repo.maven.apache.org/maven2/org/eclipse/sisu/org.eclipse.sisu.inject/0.0.0.M5/org.eclipse.sisu.inject-0.0.0.M5.jar
2017-07-03T12:03:13.175 [INFO] Downloaded: https://repo.maven.apache.org/maven2/com/google/code/findbugs/jsr305/1.3.9/jsr305-1.3.9.jar
(33 KB at 233.6 KB/sec)
2017-07-03T12:03:13.175 [INFO] Downloading: https://repo.maven.apache.org/maven2/org/codehaus/plexus/plexus-component-annotations/1.5.5/plexus-component-annotations-1.5.5.jar
2017-07-03T12:03:13.179 [INFO] Downloaded: https://repo.maven.apache.org/maven2/aopalliance/aopalliance/1.0/aopalliance-1.0.jar
(5 KB at 30.7 KB/sec)
2017-07-03T12:03:13.180 [INFO] Downloading: https://repo.maven.apache.org/maven2/org/codehaus/plexus/plexus-classworlds/2.4/plexus-classworlds-2.4.jar
2017-07-03T12:03:13.202 [INFO] Downloaded: https://repo.maven.apache.org/maven2/org/codehaus/plexus/plexus-component-annotations/1.5.5/plexus-component-annotations-1.5.5.jar
(5 KB at 24.9 KB/sec)
2017-07-03T12:03:13.202 [INFO] Downloading: https://repo.maven.apache.org/maven2/org/codehaus/plexus/plexus-utils/3.0.17/plexus-utils-3.0.17.jar
2017-07-03T12:03:13.218 [INFO] Downloaded: https://repo.maven.apache.org/maven2/org/codehaus/plexus/plexus-classworlds/2.4/plexus-classworlds-2.4.jar
(46 KB at 253.9 KB/sec)
2017-07-03T12:03:13.239 [INFO] Downloaded: https://repo.maven.apache.org/maven2/org/sonatype/sisu/sisu-guice/3.1.0/sisu-guice-3.1.0-no_aop.jar
(350 KB at 1736.6 KB/sec)
2017-07-03T12:03:13.239 [INFO] Downloaded: https://repo.maven.apache.org/maven2/org/eclipse/sisu/org.eclipse.sisu.inject/0.0.0.M5/org.eclipse.sisu.inject-0.0.0.M5.jar
(285 KB at 1408.7 KB/sec)
2017-07-03T12:03:13.280 [INFO] Downloaded: https://repo.maven.apache.org/maven2/org/codehaus/plexus/plexus-utils/3.0.17/plexus-utils-3.0.17.jar
(246 KB at 1011.9 KB/sec)
2017-07-03T12:03:13.401 [INFO] Downloaded: https://repo.maven.apache.org/maven2/com/google/guava/guava/10.0.1/guava-10.0.1.jar
(1467 KB at 4028.5 KB/sec)
2017-07-03T12:03:13.532 [INFO] Downloading: https://repo.maven.apache.org/maven2/org/apache/maven/archetype/archetype-packaging/2.4/archetype-packaging-2.4.pom
2017-07-03T12:03:13.561 [INFO] Downloaded: https://repo.maven.apache.org/maven2/org/apache/maven/archetype/archetype-packaging/2.4/archetype-packaging-2.4.pom
(2 KB at 52.8 KB/sec)
2017-07-03T12:03:13.563 [INFO] Downloading: https://repo.maven.apache.org/maven2/org/apache/maven/archetype/maven-archetype/2.4/maven-archetype-2.4.pom
2017-07-03T12:03:13.592 [INFO] Downloaded: https://repo.maven.apache.org/maven2/org/apache/maven/archetype/maven-archetype/2.4/maven-archetype-2.4.pom
(13 KB at 444.5 KB/sec)
2017-07-03T12:03:13.594 [INFO] Downloading: https://repo.maven.apache.org/maven2/org/apache/maven/maven-parent/26/maven-parent-26.pom
2017-07-03T12:03:13.625 [INFO] Downloaded: https://repo.maven.apache.org/maven2/org/apache/maven/maven-parent/26/maven-parent-26.pom
(39 KB at 1253.3 KB/sec)
2017-07-03T12:03:13.628 [INFO] Downloading: https://repo.maven.apache.org/maven2/org/apache/apache/16/apache-16.pom
2017-07-03T12:03:13.655 [INFO] Downloaded: https://repo.maven.apache.org/maven2/org/apache/apache/16/apache-16.pom
(16 KB at 556.9 KB/sec)
2017-07-03T12:03:13.660 [INFO] Downloading: https://repo.maven.apache.org/maven2/org/apache/maven/archetype/archetype-packaging/2.4/archetype-packaging-2.4.jar
2017-07-03T12:03:13.660 [INFO] Downloading: https://repo.maven.apache.org/maven2/org/codehaus/plexus/plexus-utils/1.1/plexus-utils-1.1.jar
2017-07-03T12:03:13.688 [INFO] Downloaded: https://repo.maven.apache.org/maven2/org/apache/maven/archetype/archetype-packaging/2.4/archetype-packaging-2.4.jar
(8 KB at 253.7 KB/sec)
2017-07-03T12:03:13.719 [INFO] Downloaded: https://repo.maven.apache.org/maven2/org/codehaus/plexus/plexus-utils/1.1/plexus-utils-1.1.jar
(165 KB at 2790.1 KB/sec)
2017-07-03T12:03:13.814 [INFO] ------------------------------------------------------------------------
2017-07-03T12:03:13.814 [INFO] Detecting the operating system and CPU architecture
2017-07-03T12:03:13.814 [INFO] ------------------------------------------------------------------------
2017-07-03T12:03:13.814 [INFO] os.detected.name: linux
2017-07-03T12:03:13.814 [INFO] os.detected.arch: x86_64
2017-07-03T12:03:13.814 [INFO] os.detected.version: 3.19
2017-07-03T12:03:13.814 [INFO] os.detected.version.major: 3
2017-07-03T12:03:13.815 [INFO] os.detected.version.minor: 19
2017-07-03T12:03:13.815 [INFO] os.detected.release: ubuntu
2017-07-03T12:03:13.815 [INFO] os.detected.release.version: 14.04
2017-07-03T12:03:13.815 [INFO] os.detected.release.like.ubuntu: true
2017-07-03T12:03:13.815 [INFO] os.detected.release.like.debian: true
2017-07-03T12:03:13.815 [INFO] os.detected.classifier: linux-x86_64
2017-07-03T12:12:08.039 [INFO] ------------------------------------------------------------------------
2017-07-03T12:12:08.040 [INFO] Reactor Build Order:
2017-07-03T12:12:08.040 [INFO] 
2017-07-03T12:12:08.040 [INFO] Apache Beam :: Parent
2017-07-03T12:12:08.040 [INFO] Apache Beam :: SDKs :: Java :: Build Tools
2017-07-03T12:12:08.040 [INFO] Apache Beam :: SDKs
2017-07-03T12:12:08.040 [INFO] Apache Beam :: SDKs :: Common
2017-07-03T12:12:08.040 [INFO] Apache Beam :: SDKs :: Common :: Runner API
2017-07-03T12:12:08.040 [INFO] Apache Beam :: SDKs :: Common :: Fn API
2017-07-03T12:12:08.040 [INFO] Apache Beam :: SDKs :: Java
2017-07-03T12:12:08.040 [INFO] Apache Beam :: SDKs :: Java :: Core
2017-07-03T12:12:08.040 [INFO] Apache Beam :: Runners
2017-07-03T12:12:08.040 [INFO] Apache Beam :: Runners :: Core Construction Java
2017-07-03T12:12:08.040 [INFO] Apache Beam :: Runners :: Core Java
2017-07-03T12:12:08.040 [INFO] Apache Beam :: Runners :: Apex
2017-07-03T12:12:13.210 [INFO]                                                           
             
2017-07-03T12:12:13.210 [INFO] ------------------------------------------------------------------------
2017-07-03T12:12:13.210 [INFO] Building Apache Beam :: Parent 2.1.0-SNAPSHOT
2017-07-03T12:12:13.210 [INFO] ------------------------------------------------------------------------
2017-07-03T12:12:13.213 [INFO] Downloading: https://repo.maven.apache.org/maven2/org/apache/maven/plugins/maven-remote-resources-plugin/1.5/maven-remote-resources-plugin-1.5.pom
[INFO] I/O exception (java.net.SocketException) caught when processing request to {s}->https://repo.maven.apache.org:443:
Connection reset
[INFO] Retrying request to {s}->https://repo.maven.apache.org:443
[INFO] I/O exception (java.net.SocketException) caught when processing request to {s}->https://repo.maven.apache.org:443:
Connection reset
[INFO] Retrying request to {s}->https://repo.maven.apache.org:443
[INFO] I/O exception (java.net.SocketException) caught when processing request to {s}->https://repo.maven.apache.org:443:
Connection reset
[INFO] Retrying request to {s}->https://repo.maven.apache.org:443
[JENKINS] Archiving disabled
[JENKINS] Archiving disabled
[JENKINS] Archiving disabled
[JENKINS] Archiving disabled
[JENKINS] Archiving disabled
[JENKINS] Archiving disabled
[JENKINS] Archiving disabled
[JENKINS] Archiving disabled
[JENKINS] Archiving disabled
[JENKINS] Archiving disabled
[JENKINS] Archiving disabled
[JENKINS] Archiving disabled
2017-07-03T12:12:19.886 [INFO] ------------------------------------------------------------------------
2017-07-03T12:12:19.886 [INFO] Reactor Summary:
2017-07-03T12:12:19.886 [INFO] 
2017-07-03T12:12:19.887 [INFO] Apache Beam :: Parent .............................. FAILURE
[  5.222 s]
2017-07-03T12:12:19.887 [INFO] Apache Beam :: SDKs :: Java :: Build Tools ......... SKIPPED
2017-07-03T12:12:19.887 [INFO] Apache Beam :: SDKs ................................ SKIPPED
2017-07-03T12:12:19.887 [INFO] Apache Beam :: SDKs :: Common ...................... SKIPPED
2017-07-03T12:12:19.887 [INFO] Apache Beam :: SDKs :: Common :: Runner API ........ SKIPPED
2017-07-03T12:12:19.887 [INFO] Apache Beam :: SDKs :: Common :: Fn API ............ SKIPPED
2017-07-03T12:12:19.887 [INFO] Apache Beam :: SDKs :: Java ........................ SKIPPED
2017-07-03T12:12:19.887 [INFO] Apache Beam :: SDKs :: Java :: Core ................ SKIPPED
2017-07-03T12:12:19.887 [INFO] Apache Beam :: Runners ............................. SKIPPED
2017-07-03T12:12:19.887 [INFO] Apache Beam :: Runners :: Core Construction Java ... SKIPPED
2017-07-03T12:12:19.887 [INFO] Apache Beam :: Runners :: Core Java ................ SKIPPED
2017-07-03T12:12:19.887 [INFO] Apache Beam :: Runners :: Apex ..................... SKIPPED
2017-07-03T12:12:19.887 [INFO] ------------------------------------------------------------------------
2017-07-03T12:12:19.887 [INFO] BUILD FAILURE
2017-07-03T12:12:19.887 [INFO] ------------------------------------------------------------------------
2017-07-03T12:12:19.887 [INFO] Total time: 09:09 min
2017-07-03T12:12:19.887 [INFO] Finished at: 2017-07-03T12:12:19+00:00
[JENKINS] Archiving disabled
2017-07-03T12:12:20.341 [INFO] Final Memory: 38M/358M
2017-07-03T12:12:20.341 [INFO] ------------------------------------------------------------------------
2017-07-03T12:12:20.341 [WARNING] The requested profile "validates-runner-tests" could not
be activated because it does not exist.
Waiting for Jenkins to finish collecting data
2017-07-03T12:12:29.749 [ERROR] Plugin org.apache.maven.plugins:maven-remote-resources-plugin:1.5
or one of its dependencies could not be resolved: Failed to read artifact descriptor for org.apache.maven.plugins:maven-remote-resources-plugin:jar:1.5:
Could not transfer artifact org.apache.maven.plugins:maven-remote-resources-plugin:pom:1.5
from/to central (https://repo.maven.apache.org/maven2): Connection reset -> [Help 1]
2017-07-03T12:12:29.749 [ERROR] 
2017-07-03T12:12:29.749 [ERROR] To see the full stack trace of the errors, re-run Maven with
the -e switch.
2017-07-03T12:12:29.749 [ERROR] Re-run Maven using the -X switch to enable full debug logging.
2017-07-03T12:12:29.750 [ERROR] 
2017-07-03T12:12:29.750 [ERROR] For more information about the errors and possible solutions,
please read the following articles:
2017-07-03T12:12:29.750 [ERROR] [Help 1] http://cwiki.apache.org/confluence/display/MAVEN/PluginResolutionException
channel stopped

Mime
View raw message