beam-commits mailing list archives

Site index · List index
Message view « Date » · « Thread »
Top « Date » · « Thread »
From Apache Jenkins Server <jenk...@builds.apache.org>
Subject Build failed in Jenkins: beam_PostCommit_Java_MavenInstall #4377
Date Sat, 15 Jul 2017 00:59:48 GMT
See <https://builds.apache.org/job/beam_PostCommit_Java_MavenInstall/4377/display/redirect>

------------------------------------------
[...truncated 1.46 MB...]
2017-07-15T00:39:32.430 [INFO] Excluding com.google.http-client:google-http-client:jar:1.22.0
from the shaded jar.
2017-07-15T00:39:32.430 [INFO] Excluding org.apache.httpcomponents:httpclient:jar:4.0.1 from
the shaded jar.
2017-07-15T00:39:32.430 [INFO] Excluding org.apache.httpcomponents:httpcore:jar:4.0.1 from
the shaded jar.
2017-07-15T00:39:32.430 [INFO] Excluding commons-codec:commons-codec:jar:1.3 from the shaded
jar.
2017-07-15T00:39:32.430 [INFO] Excluding com.google.cloud.bigdataoss:util:jar:1.4.5 from the
shaded jar.
2017-07-15T00:39:32.430 [INFO] Excluding com.google.api-client:google-api-client-java6:jar:1.22.0
from the shaded jar.
2017-07-15T00:39:32.430 [INFO] Excluding com.google.api-client:google-api-client-jackson2:jar:1.22.0
from the shaded jar.
2017-07-15T00:39:32.430 [INFO] Excluding com.google.oauth-client:google-oauth-client-java6:jar:1.22.0
from the shaded jar.
2017-07-15T00:39:32.430 [INFO] Excluding com.google.auth:google-auth-library-oauth2-http:jar:0.6.1
from the shaded jar.
2017-07-15T00:39:32.430 [INFO] Excluding com.google.auth:google-auth-library-credentials:jar:0.6.1
from the shaded jar.
2017-07-15T00:39:32.430 [INFO] Excluding org.apache.avro:avro:jar:1.8.2 from the shaded jar.
2017-07-15T00:39:32.430 [INFO] Excluding org.codehaus.jackson:jackson-core-asl:jar:1.9.13
from the shaded jar.
2017-07-15T00:39:32.430 [INFO] Excluding org.codehaus.jackson:jackson-mapper-asl:jar:1.9.13
from the shaded jar.
2017-07-15T00:39:32.430 [INFO] Excluding com.thoughtworks.paranamer:paranamer:jar:2.7 from
the shaded jar.
2017-07-15T00:39:32.430 [INFO] Excluding org.tukaani:xz:jar:1.5 from the shaded jar.
2017-07-15T00:39:32.430 [INFO] Excluding com.google.apis:google-api-services-pubsub:jar:v1-rev10-1.22.0
from the shaded jar.
2017-07-15T00:39:32.430 [INFO] Including com.google.guava:guava:jar:20.0 in the shaded jar.
2017-07-15T00:39:32.430 [INFO] Excluding com.google.cloud.datastore:datastore-v1-proto-client:jar:1.4.0
from the shaded jar.
2017-07-15T00:39:32.430 [INFO] Excluding com.google.http-client:google-http-client-protobuf:jar:1.22.0
from the shaded jar.
2017-07-15T00:39:32.430 [INFO] Excluding com.google.http-client:google-http-client-jackson:jar:1.22.0
from the shaded jar.
2017-07-15T00:39:32.430 [INFO] Excluding com.google.cloud.datastore:datastore-v1-protos:jar:1.3.0
from the shaded jar.
2017-07-15T00:39:32.430 [INFO] Excluding com.google.api.grpc:grpc-google-common-protos:jar:0.1.9
from the shaded jar.
2017-07-15T00:39:32.430 [INFO] Excluding joda-time:joda-time:jar:2.4 from the shaded jar.
2017-07-15T00:39:32.430 [INFO] Excluding org.slf4j:slf4j-api:jar:1.7.14 from the shaded jar.
2017-07-15T00:39:32.430 [INFO] Excluding org.slf4j:slf4j-jdk14:jar:1.7.14 from the shaded
jar.
2017-07-15T00:39:32.430 [INFO] Excluding org.apache.beam:beam-sdks-common-runner-api:jar:2.2.0-SNAPSHOT
from the shaded jar.
2017-07-15T00:39:32.430 [INFO] Excluding org.apache.beam:beam-runners-core-construction-java:jar:2.2.0-SNAPSHOT
from the shaded jar.
2017-07-15T00:39:32.430 [INFO] Excluding org.apache.beam:beam-runners-google-cloud-dataflow-java:jar:2.2.0-SNAPSHOT
from the shaded jar.
2017-07-15T00:39:32.430 [INFO] Excluding com.google.apis:google-api-services-dataflow:jar:v1b3-rev196-1.22.0
from the shaded jar.
2017-07-15T00:39:32.430 [INFO] Excluding com.google.apis:google-api-services-clouddebugger:jar:v2-rev8-1.22.0
from the shaded jar.
2017-07-15T00:39:34.154 [INFO] Replacing original artifact with shaded artifact.
2017-07-15T00:39:34.154 [INFO] Replacing <https://builds.apache.org/job/beam_PostCommit_Java_MavenInstall/ws/examples/java/target/beam-examples-java-2.2.0-SNAPSHOT.jar>
with <https://builds.apache.org/job/beam_PostCommit_Java_MavenInstall/ws/examples/java/target/beam-examples-java-2.2.0-SNAPSHOT-shaded.jar>
2017-07-15T00:39:34.154 [INFO] Replacing original test artifact with shaded test artifact.
2017-07-15T00:39:34.154 [INFO] Replacing <https://builds.apache.org/job/beam_PostCommit_Java_MavenInstall/ws/examples/java/target/beam-examples-java-2.2.0-SNAPSHOT-tests.jar>
with <https://builds.apache.org/job/beam_PostCommit_Java_MavenInstall/ws/examples/java/target/beam-examples-java-2.2.0-SNAPSHOT-shaded-tests.jar>
2017-07-15T00:39:34.155 [INFO] Dependency-reduced POM written at: <https://builds.apache.org/job/beam_PostCommit_Java_MavenInstall/ws/examples/java/dependency-reduced-pom.xml>
2017-07-15T00:39:34.292 [INFO] 
2017-07-15T00:39:34.292 [INFO] --- maven-javadoc-plugin:2.10.4:jar (attach-javadocs) @ beam-examples-java
---
2017-07-15T00:39:37.758 [INFO] Building jar: <https://builds.apache.org/job/beam_PostCommit_Java_MavenInstall/ws/examples/java/target/beam-examples-java-2.2.0-SNAPSHOT-javadoc.jar>
2017-07-15T00:39:37.838 [INFO] 
2017-07-15T00:39:37.838 [INFO] --- maven-source-plugin:3.0.1:jar-no-fork (attach-sources)
@ beam-examples-java ---
2017-07-15T00:39:37.840 [INFO] Building jar: <https://builds.apache.org/job/beam_PostCommit_Java_MavenInstall/ws/examples/java/target/beam-examples-java-2.2.0-SNAPSHOT-sources.jar>
2017-07-15T00:39:37.916 [INFO] 
2017-07-15T00:39:37.916 [INFO] --- maven-source-plugin:3.0.1:test-jar-no-fork (attach-test-sources)
@ beam-examples-java ---
2017-07-15T00:39:37.919 [INFO] Building jar: <https://builds.apache.org/job/beam_PostCommit_Java_MavenInstall/ws/examples/java/target/beam-examples-java-2.2.0-SNAPSHOT-test-sources.jar>
2017-07-15T00:39:37.982 [INFO] 
2017-07-15T00:39:37.982 [INFO] --- maven-failsafe-plugin:2.20:integration-test (default) @
beam-examples-java ---
2017-07-15T00:39:37.992 [INFO] Failsafe report directory: <https://builds.apache.org/job/beam_PostCommit_Java_MavenInstall/ws/examples/java/target/failsafe-reports>
2017-07-15T00:39:37.993 [INFO] parallel='all', perCoreThreadCount=true, threadCount=4, useUnlimitedThreads=false,
threadCountSuites=0, threadCountClasses=0, threadCountMethods=0, parallelOptimized=true
2017-07-15T00:39:38.013 [INFO] 
2017-07-15T00:39:38.013 [INFO] -------------------------------------------------------
2017-07-15T00:39:38.013 [INFO]  T E S T S
2017-07-15T00:39:38.013 [INFO] -------------------------------------------------------
2017-07-15T00:44:45.957 [INFO] Running org.apache.beam.examples.cookbook.BigQueryTornadoesIT
2017-07-15T00:44:45.967 [INFO] Tests run: 1, Failures: 0, Errors: 0, Skipped: 0, Time elapsed:
303.214 s - in org.apache.beam.examples.cookbook.BigQueryTornadoesIT
2017-07-15T00:44:45.967 [INFO] Running org.apache.beam.examples.WordCountIT
2017-07-15T00:44:45.974 [INFO] Tests run: 1, Failures: 0, Errors: 0, Skipped: 0, Time elapsed:
239.95 s - in org.apache.beam.examples.WordCountIT
2017-07-15T00:44:45.975 [INFO] Running org.apache.beam.examples.WindowedWordCountIT
2017-07-15T00:44:45.981 [INFO] Tests run: 3, Failures: 0, Errors: 0, Skipped: 0, Time elapsed:
280.478 s - in org.apache.beam.examples.WindowedWordCountIT
2017-07-15T00:44:46.577 [INFO] 
2017-07-15T00:44:46.577 [INFO] Results:
2017-07-15T00:44:46.577 [INFO] 
2017-07-15T00:44:46.577 [INFO] Tests run: 5, Failures: 0, Errors: 0, Skipped: 0
2017-07-15T00:44:46.577 [INFO] 
[WARNING] Cannot calculate digest of mojo class, because mojo wasn't loaded from a jar, but
from: <https://builds.apache.org/job/beam_PostCommit_Java_MavenInstall/ws/.repository/org/apache/maven/plugins/maven-failsafe-plugin/2.20/maven-failsafe-plugin-2.20.jar>
[JENKINS] Recording test results
2017-07-15T00:44:50.014 [INFO] 
2017-07-15T00:44:50.014 [INFO] --- maven-dependency-plugin:3.0.1:analyze-only (default) @
beam-examples-java ---
[WARNING] Cannot calculate digest of mojo class, because mojo wasn't loaded from a jar, but
from: <https://builds.apache.org/job/beam_PostCommit_Java_MavenInstall/ws/.repository/org/apache/maven/plugins/maven-dependency-plugin/3.0.1/maven-dependency-plugin-3.0.1.jar>
[JENKINS] Archiving disabled
2017-07-15T00:44:55.757 [INFO]                                                           
             
2017-07-15T00:44:55.757 [INFO] ------------------------------------------------------------------------
2017-07-15T00:44:55.757 [INFO] Skipping Apache Beam :: Parent
2017-07-15T00:44:55.757 [INFO] This project has been banned from the build due to previous
failures.
2017-07-15T00:44:55.757 [INFO] ------------------------------------------------------------------------
[JENKINS] Archiving disabled
[JENKINS] Archiving disabled
[JENKINS] Archiving disabled
[JENKINS] Archiving disabled
[JENKINS] Archiving disabled
[JENKINS] Archiving disabled
[JENKINS] Archiving disabled
[JENKINS] Archiving disabled
[JENKINS] Archiving disabled
[JENKINS] Archiving disabled
[JENKINS] Archiving disabled
[JENKINS] Archiving disabled
[JENKINS] Archiving disabled
[JENKINS] Archiving disabled
[JENKINS] Archiving disabled
[JENKINS] Archiving disabled
[JENKINS] Archiving disabled
[JENKINS] Archiving disabled
[JENKINS] Archiving disabled
[JENKINS] Archiving disabled
[JENKINS] Archiving disabled
[JENKINS] Archiving disabled
[JENKINS] Archiving disabled
[JENKINS] Archiving disabled
[JENKINS] Archiving disabled
[JENKINS] Archiving disabled
[JENKINS] Archiving disabled
[JENKINS] Archiving disabled
[JENKINS] Archiving disabled
[JENKINS] Archiving disabled
[JENKINS] Archiving disabled
[JENKINS] Archiving disabled
[JENKINS] Archiving disabled
[JENKINS] Archiving disabled
[JENKINS] Archiving disabled
[JENKINS] Archiving disabled
[JENKINS] Archiving disabled
[JENKINS] Archiving disabled
[JENKINS] Archiving disabled
[JENKINS] Archiving disabled
[JENKINS] Archiving disabled
[JENKINS] Archiving disabled
[JENKINS] Archiving disabled
[JENKINS] Archiving disabled
[JENKINS] Archiving disabled
[JENKINS] Archiving disabled
[JENKINS] Archiving disabled
[JENKINS] Archiving disabled
[JENKINS] Archiving disabled
2017-07-15T00:45:25.182 [INFO] ------------------------------------------------------------------------
2017-07-15T00:45:25.182 [INFO] Reactor Summary:
2017-07-15T00:45:25.182 [INFO] 
2017-07-15T00:45:25.182 [INFO] Apache Beam :: Parent .............................. SUCCESS
[01:21 min]
2017-07-15T00:45:25.182 [INFO] Apache Beam :: SDKs :: Java :: Build Tools ......... SUCCESS
[ 14.077 s]
2017-07-15T00:45:25.182 [INFO] Apache Beam :: SDKs ................................ SUCCESS
[  5.371 s]
2017-07-15T00:45:25.182 [INFO] Apache Beam :: SDKs :: Common ...................... SUCCESS
[  2.217 s]
2017-07-15T00:45:25.182 [INFO] Apache Beam :: SDKs :: Common :: Runner API ........ SUCCESS
[ 25.736 s]
2017-07-15T00:45:25.182 [INFO] Apache Beam :: SDKs :: Common :: Fn API ............ SUCCESS
[ 25.025 s]
2017-07-15T00:45:25.183 [INFO] Apache Beam :: SDKs :: Java ........................ SUCCESS
[  2.667 s]
2017-07-15T00:45:25.183 [INFO] Apache Beam :: SDKs :: Java :: Core ................ SUCCESS
[03:53 min]
2017-07-15T00:45:25.183 [INFO] Apache Beam :: Runners ............................. SUCCESS
[  3.150 s]
2017-07-15T00:45:25.183 [INFO] Apache Beam :: Runners :: Core Construction Java ... SUCCESS
[ 31.504 s]
2017-07-15T00:45:25.183 [INFO] Apache Beam :: Runners :: Core Java ................ SUCCESS
[01:01 min]
2017-07-15T00:45:25.183 [INFO] Apache Beam :: Runners :: Direct Java .............. SUCCESS
[03:23 min]
2017-07-15T00:45:25.183 [INFO] Apache Beam :: SDKs :: Java :: IO .................. SUCCESS
[  2.641 s]
2017-07-15T00:45:25.183 [INFO] Apache Beam :: SDKs :: Java :: IO :: AMQP .......... SUCCESS
[ 38.489 s]
2017-07-15T00:45:25.183 [INFO] Apache Beam :: SDKs :: Java :: IO :: Common ........ SUCCESS
[  5.247 s]
2017-07-15T00:45:25.183 [INFO] Apache Beam :: SDKs :: Java :: IO :: Cassandra ..... SUCCESS
[ 31.700 s]
2017-07-15T00:45:25.183 [INFO] Apache Beam :: SDKs :: Java :: IO :: Elasticsearch . SUCCESS
[ 45.349 s]
2017-07-15T00:45:25.183 [INFO] Apache Beam :: SDKs :: Java :: Extensions .......... SUCCESS
[  1.781 s]
2017-07-15T00:45:25.183 [INFO] Apache Beam :: SDKs :: Java :: Extensions :: Google Cloud Platform
Core SUCCESS [ 38.774 s]
2017-07-15T00:45:25.183 [INFO] Apache Beam :: SDKs :: Java :: Extensions :: Protobuf SUCCESS
[ 26.142 s]
2017-07-15T00:45:25.183 [INFO] Apache Beam :: SDKs :: Java :: IO :: Google Cloud Platform
SUCCESS [02:00 min]
2017-07-15T00:45:25.183 [INFO] Apache Beam :: SDKs :: Java :: IO :: Hadoop Common . SUCCESS
[ 24.622 s]
2017-07-15T00:45:25.183 [INFO] Apache Beam :: SDKs :: Java :: IO :: Hadoop File System SUCCESS
[ 53.451 s]
2017-07-15T00:45:25.183 [INFO] Apache Beam :: SDKs :: Java :: IO :: Hadoop ........ SUCCESS
[  4.309 s]
2017-07-15T00:45:25.183 [INFO] Apache Beam :: SDKs :: Java :: IO :: Hadoop :: input-format
SUCCESS [ 30.794 s]
2017-07-15T00:45:25.183 [INFO] Apache Beam :: Runners :: Google Cloud Dataflow .... SUCCESS
[08:33 min]
2017-07-15T00:45:25.183 [INFO] Apache Beam :: SDKs :: Java :: IO :: Hadoop :: jdk1.8-tests
SUCCESS [01:37 min]
2017-07-15T00:45:25.183 [INFO] Apache Beam :: SDKs :: Java :: IO :: HBase ......... SUCCESS
[01:14 min]
2017-07-15T00:45:25.183 [INFO] Apache Beam :: SDKs :: Java :: IO :: HCatalog ...... SUCCESS
[01:27 min]
2017-07-15T00:45:25.183 [INFO] Apache Beam :: SDKs :: Java :: IO :: JDBC .......... SUCCESS
[ 46.015 s]
2017-07-15T00:45:25.183 [INFO] Apache Beam :: SDKs :: Java :: IO :: JMS ........... SUCCESS
[ 29.486 s]
2017-07-15T00:45:25.183 [INFO] Apache Beam :: SDKs :: Java :: IO :: Kafka ......... SUCCESS
[ 30.922 s]
2017-07-15T00:45:25.183 [INFO] Apache Beam :: SDKs :: Java :: IO :: Kinesis ....... SUCCESS
[ 30.045 s]
2017-07-15T00:45:25.183 [INFO] Apache Beam :: SDKs :: Java :: IO :: MongoDB ....... SUCCESS
[ 49.967 s]
2017-07-15T00:45:25.184 [INFO] Apache Beam :: SDKs :: Java :: IO :: MQTT .......... SUCCESS
[ 25.392 s]
2017-07-15T00:45:25.184 [INFO] Apache Beam :: SDKs :: Java :: IO :: XML ........... SUCCESS
[ 32.050 s]
2017-07-15T00:45:25.184 [INFO] Apache Beam :: SDKs :: Java :: Maven Archetypes .... SUCCESS
[  4.735 s]
2017-07-15T00:45:25.184 [INFO] Apache Beam :: SDKs :: Java :: Maven Archetypes :: Starter
SUCCESS [ 17.186 s]
2017-07-15T00:45:25.184 [INFO] Apache Beam :: Examples ............................ SUCCESS
[  2.168 s]
2017-07-15T00:45:25.184 [INFO] Apache Beam :: Examples :: Java .................... FAILURE
[05:48 min]
2017-07-15T00:45:25.184 [INFO] Apache Beam :: SDKs :: Java :: Maven Archetypes :: Examples
SKIPPED
2017-07-15T00:45:25.184 [INFO] Apache Beam :: Examples :: Java 8 .................. SKIPPED
2017-07-15T00:45:25.184 [INFO] Apache Beam :: SDKs :: Java :: Maven Archetypes :: Examples
- Java 8 SKIPPED
2017-07-15T00:45:25.184 [INFO] Apache Beam :: SDKs :: Java :: Extensions :: Jackson SKIPPED
2017-07-15T00:45:25.184 [INFO] Apache Beam :: SDKs :: Java :: Extensions :: Join library SKIPPED
2017-07-15T00:45:25.184 [INFO] Apache Beam :: SDKs :: Java :: Extensions :: Sorter  SKIPPED
2017-07-15T00:45:25.184 [INFO] Apache Beam :: SDKs :: Java :: Harness ............. SKIPPED
2017-07-15T00:45:25.184 [INFO] Apache Beam :: SDKs :: Java :: Java 8 Tests ........ SKIPPED
2017-07-15T00:45:25.184 [INFO] Apache Beam :: SDKs :: Python ...................... SKIPPED
2017-07-15T00:45:25.184 [INFO] Apache Beam :: Runners :: Flink .................... SKIPPED
2017-07-15T00:45:25.184 [INFO] Apache Beam :: Runners :: Spark .................... SKIPPED
2017-07-15T00:45:25.184 [INFO] Apache Beam :: Runners :: Apex ..................... SKIPPED
2017-07-15T00:45:25.184 [INFO] Apache Beam :: SDKs :: Java :: Aggregated Javadoc .. SKIPPED
2017-07-15T00:45:25.184 [INFO] ------------------------------------------------------------------------
2017-07-15T00:45:25.184 [INFO] BUILD FAILURE
2017-07-15T00:45:25.184 [INFO] ------------------------------------------------------------------------
2017-07-15T00:45:25.184 [INFO] Total time: 43:23 min
2017-07-15T00:45:25.184 [INFO] Finished at: 2017-07-15T00:45:25+00:00
2017-07-15T00:45:26.859 [INFO] Final Memory: 294M/2068M
2017-07-15T00:45:26.859 [INFO] ------------------------------------------------------------------------
Waiting for Jenkins to finish collecting data
2017-07-15T00:58:18.236 [ERROR] Failed to execute goal org.apache.maven.plugins:maven-dependency-plugin:3.0.1:analyze-only
(default) on project beam-examples-java: Cannot analyze dependencies: <https://builds.apache.org/job/beam_PostCommit_Java_MavenInstall/ws/.repository/com/google/protobuf/protobuf-java/3.2.0/protobuf-java-3.2.0.jar>
(No such file or directory) -> [Help 1]
org.apache.maven.lifecycle.LifecycleExecutionException: Failed to execute goal org.apache.maven.plugins:maven-dependency-plugin:3.0.1:analyze-only
(default) on project beam-examples-java: Cannot analyze dependencies
	at org.apache.maven.lifecycle.internal.MojoExecutor.execute(MojoExecutor.java:216)
	at org.apache.maven.lifecycle.internal.MojoExecutor.execute(MojoExecutor.java:153)
	at org.apache.maven.lifecycle.internal.MojoExecutor.execute(MojoExecutor.java:145)
	at org.apache.maven.lifecycle.internal.LifecycleModuleBuilder.buildProject(LifecycleModuleBuilder.java:116)
	at org.apache.maven.lifecycle.internal.LifecycleModuleBuilder.buildProject(LifecycleModuleBuilder.java:80)
	at org.apache.maven.lifecycle.internal.builder.singlethreaded.SingleThreadedBuilder.build(SingleThreadedBuilder.java:51)
	at org.apache.maven.lifecycle.internal.LifecycleStarter.execute(LifecycleStarter.java:128)
	at org.apache.maven.DefaultMaven.doExecute(DefaultMaven.java:307)
	at org.apache.maven.DefaultMaven.doExecute(DefaultMaven.java:193)
	at org.apache.maven.DefaultMaven.execute(DefaultMaven.java:106)
	at org.jvnet.hudson.maven3.launcher.Maven33Launcher.main(Maven33Launcher.java:129)
	at sun.reflect.NativeMethodAccessorImpl.invoke0(Native Method)
	at sun.reflect.NativeMethodAccessorImpl.invoke(NativeMethodAccessorImpl.java:62)
	at sun.reflect.DelegatingMethodAccessorImpl.invoke(DelegatingMethodAccessorImpl.java:43)
	at java.lang.reflect.Method.invoke(Method.java:498)
	at org.codehaus.plexus.classworlds.launcher.Launcher.launchStandard(Launcher.java:330)
	at org.codehaus.plexus.classworlds.launcher.Launcher.launch(Launcher.java:238)
	at jenkins.maven3.agent.Maven33Main.launch(Maven33Main.java:176)
	at sun.reflect.NativeMethodAccessorImpl.invoke0(Native Method)
	at sun.reflect.NativeMethodAccessorImpl.invoke(NativeMethodAccessorImpl.java:62)
	at sun.reflect.DelegatingMethodAccessorImpl.invoke(DelegatingMethodAccessorImpl.java:43)
	at java.lang.reflect.Method.invoke(Method.java:498)
	at hudson.maven.Maven3Builder.call(Maven3Builder.java:139)
	at hudson.maven.Maven3Builder.call(Maven3Builder.java:70)
	at hudson.remoting.UserRequest.perform(UserRequest.java:153)
	at hudson.remoting.UserRequest.perform(UserRequest.java:50)
	at hudson.remoting.Request$2.run(Request.java:336)
	at hudson.remoting.InterceptingExecutorService$1.call(InterceptingExecutorService.java:68)
	at java.util.concurrent.FutureTask.run(FutureTask.java:266)
	at java.util.concurrent.ThreadPoolExecutor.runWorker(ThreadPoolExecutor.java:1142)
	at java.util.concurrent.ThreadPoolExecutor$Worker.run(ThreadPoolExecutor.java:617)
	at java.lang.Thread.run(Thread.java:748)
Caused by: org.apache.maven.plugin.MojoExecutionException: Cannot analyze dependencies
	at org.apache.maven.plugins.dependency.analyze.AbstractAnalyzeMojo.checkDependencies(AbstractAnalyzeMojo.java:315)
	at org.apache.maven.plugins.dependency.analyze.AbstractAnalyzeMojo.execute(AbstractAnalyzeMojo.java:257)
	at org.apache.maven.plugin.DefaultBuildPluginManager.executeMojo(DefaultBuildPluginManager.java:134)
	at org.apache.maven.lifecycle.internal.MojoExecutor.execute(MojoExecutor.java:208)
	... 31 more
Caused by: org.apache.maven.shared.dependency.analyzer.ProjectDependencyAnalyzerException:
Cannot analyze dependencies
	at org.apache.maven.shared.dependency.analyzer.DefaultProjectDependencyAnalyzer.analyze(DefaultProjectDependencyAnalyzer.java:94)
	at org.apache.maven.plugins.dependency.analyze.AbstractAnalyzeMojo.checkDependencies(AbstractAnalyzeMojo.java:306)
	... 34 more
Caused by: java.io.FileNotFoundException: <https://builds.apache.org/job/beam_PostCommit_Java_MavenInstall/ws/.repository/com/google/protobuf/protobuf-java/3.2.0/protobuf-java-3.2.0.jar>
(No such file or directory)
	at java.util.zip.ZipFile.open(Native Method)
	at java.util.zip.ZipFile.<init>(ZipFile.java:219)
	at java.util.zip.ZipFile.<init>(ZipFile.java:149)
	at java.util.jar.JarFile.<init>(JarFile.java:166)
	at java.util.jar.JarFile.<init>(JarFile.java:130)
	at org.apache.maven.shared.dependency.analyzer.DefaultProjectDependencyAnalyzer.buildArtifactClassMap(DefaultProjectDependencyAnalyzer.java:147)
	at org.apache.maven.shared.dependency.analyzer.DefaultProjectDependencyAnalyzer.analyze(DefaultProjectDependencyAnalyzer.java:72)
	... 35 more
2017-07-15T00:58:18.237 [ERROR] 
2017-07-15T00:58:18.237 [ERROR] Re-run Maven using the -X switch to enable full debug logging.
2017-07-15T00:58:18.237 [ERROR] 
2017-07-15T00:58:18.237 [ERROR] For more information about the errors and possible solutions,
please read the following articles:
2017-07-15T00:58:18.237 [ERROR] [Help 1] http://cwiki.apache.org/confluence/display/MAVEN/MojoExecutionException
2017-07-15T00:58:18.238 [ERROR] 
2017-07-15T00:58:18.238 [ERROR] After correcting the problems, you can resume the build with
the command
2017-07-15T00:58:18.238 [ERROR]   mvn <goals> -rf :beam-examples-java
channel stopped

Mime
View raw message