beam-commits mailing list archives

Site index · List index
Message view « Date » · « Thread »
Top « Date » · « Thread »
From Apache Jenkins Server <jenk...@builds.apache.org>
Subject Build failed in Jenkins: beam_PostCommit_Java_ValidatesRunner_Flink #3381
Date Wed, 12 Jul 2017 13:52:35 GMT
See <https://builds.apache.org/job/beam_PostCommit_Java_ValidatesRunner_Flink/3381/display/redirect>

------------------------------------------
[...truncated 481.79 KB...]
[INFO] Retrying request to {s}->https://repo.maven.apache.org:443
2017-07-12T13:50:52.145 [INFO] Downloaded: https://repo.maven.apache.org/maven2/org/apache/flink/force-shading/1.3.0/force-shading-1.3.0.jar
(8 KB at 245.2 KB/sec)
2017-07-12T13:50:52.145 [INFO] Downloaded: https://repo.maven.apache.org/maven2/org/apache/flink/flink-annotations/1.3.0/flink-annotations-1.3.0.jar
(8 KB at 248.7 KB/sec)
2017-07-12T13:50:52.145 [INFO] Downloading: https://repo.maven.apache.org/maven2/org/objenesis/objenesis/2.1/objenesis-2.1.jar
2017-07-12T13:50:52.145 [INFO] Downloading: https://repo.maven.apache.org/maven2/com/esotericsoftware/kryo/kryo/2.24.0/kryo-2.24.0.jar
2017-07-12T13:50:52.163 [INFO] Downloaded: https://repo.maven.apache.org/maven2/org/apache/flink/flink-clients_2.10/1.3.0/flink-clients_2.10-1.3.0.jar
(89 KB at 1848.1 KB/sec)
2017-07-12T13:50:52.164 [INFO] Downloading: https://repo.maven.apache.org/maven2/org/apache/flink/flink-metrics-core/1.3.0/flink-metrics-core-1.3.0.jar
2017-07-12T13:50:52.177 [INFO] Downloaded: https://repo.maven.apache.org/maven2/org/objenesis/objenesis/2.1/objenesis-2.1.jar
(41 KB at 679.6 KB/sec)
2017-07-12T13:50:52.177 [INFO] Downloading: https://repo.maven.apache.org/maven2/org/apache/flink/flink-java/1.3.0/flink-java-1.3.0.jar
2017-07-12T13:50:52.193 [INFO] Downloaded: https://repo.maven.apache.org/maven2/org/apache/flink/flink-metrics-core/1.3.0/flink-metrics-core-1.3.0.jar
(16 KB at 205.5 KB/sec)
2017-07-12T13:50:52.193 [INFO] Downloading: https://repo.maven.apache.org/maven2/org/apache/flink/flink-shaded-hadoop2/1.3.0/flink-shaded-hadoop2-1.3.0.jar
2017-07-12T13:50:52.202 [INFO] Downloaded: https://repo.maven.apache.org/maven2/com/esotericsoftware/kryo/kryo/2.24.0/kryo-2.24.0.jar
(332 KB at 3944.4 KB/sec)
2017-07-12T13:50:52.202 [INFO] Downloading: https://repo.maven.apache.org/maven2/xmlenc/xmlenc/0.52/xmlenc-0.52.jar
2017-07-12T13:50:52.229 [INFO] Downloaded: https://repo.maven.apache.org/maven2/xmlenc/xmlenc/0.52/xmlenc-0.52.jar
(15 KB at 130.9 KB/sec)
2017-07-12T13:50:52.229 [INFO] Downloading: https://repo.maven.apache.org/maven2/commons-codec/commons-codec/1.4/commons-codec-1.4.jar
2017-07-12T13:50:52.264 [INFO] Downloaded: https://repo.maven.apache.org/maven2/commons-codec/commons-codec/1.4/commons-codec-1.4.jar
(57 KB at 386.4 KB/sec)
2017-07-12T13:50:52.264 [INFO] Downloading: https://repo.maven.apache.org/maven2/commons-net/commons-net/3.1/commons-net-3.1.jar
2017-07-12T13:50:52.281 [INFO] Downloaded: https://repo.maven.apache.org/maven2/org/apache/flink/flink-core/1.3.0/flink-core-1.3.0.jar
(1362 KB at 8251.5 KB/sec)
2017-07-12T13:50:52.282 [INFO] Downloading: https://repo.maven.apache.org/maven2/org/mortbay/jetty/jetty-util/6.1.26/jetty-util-6.1.26.jar
2017-07-12T13:50:52.302 [INFO] Downloaded: https://repo.maven.apache.org/maven2/org/apache/flink/flink-java/1.3.0/flink-java-1.3.0.jar
(752 KB at 4064.2 KB/sec)
2017-07-12T13:50:52.303 [INFO] Downloading: https://repo.maven.apache.org/maven2/com/sun/jersey/jersey-core/1.9/jersey-core-1.9.jar
2017-07-12T13:50:52.327 [INFO] Downloaded: https://repo.maven.apache.org/maven2/commons-net/commons-net/3.1/commons-net-3.1.jar
(267 KB at 1271.3 KB/sec)
2017-07-12T13:50:52.327 [INFO] Downloading: https://repo.maven.apache.org/maven2/commons-el/commons-el/1.0/commons-el-1.0.jar
2017-07-12T13:50:52.328 [INFO] Downloaded: https://repo.maven.apache.org/maven2/org/mortbay/jetty/jetty-util/6.1.26/jetty-util-6.1.26.jar
(173 KB at 819.8 KB/sec)
2017-07-12T13:50:52.329 [INFO] Downloading: https://repo.maven.apache.org/maven2/commons-logging/commons-logging/1.1.3/commons-logging-1.1.3.jar
2017-07-12T13:50:52.369 [INFO] Downloaded: https://repo.maven.apache.org/maven2/commons-el/commons-el/1.0/commons-el-1.0.jar
(110 KB at 435.3 KB/sec)
2017-07-12T13:50:52.369 [INFO] Downloading: https://repo.maven.apache.org/maven2/com/jamesmurty/utils/java-xmlbuilder/0.4/java-xmlbuilder-0.4.jar
2017-07-12T13:50:52.370 [INFO] Downloaded: https://repo.maven.apache.org/maven2/commons-logging/commons-logging/1.1.3/commons-logging-1.1.3.jar
(61 KB at 239.5 KB/sec)
2017-07-12T13:50:52.370 [INFO] Downloading: https://repo.maven.apache.org/maven2/commons-configuration/commons-configuration/1.7/commons-configuration-1.7.jar
2017-07-12T13:50:52.371 [INFO] Downloaded: https://repo.maven.apache.org/maven2/com/sun/jersey/jersey-core/1.9/jersey-core-1.9.jar
(448 KB at 1763.7 KB/sec)
2017-07-12T13:50:52.371 [INFO] Downloading: https://repo.maven.apache.org/maven2/commons-digester/commons-digester/1.8.1/commons-digester-1.8.1.jar
2017-07-12T13:50:52.400 [INFO] Downloaded: https://repo.maven.apache.org/maven2/com/jamesmurty/utils/java-xmlbuilder/0.4/java-xmlbuilder-0.4.jar
(19 KB at 63.8 KB/sec)
2017-07-12T13:50:52.400 [INFO] Downloading: https://repo.maven.apache.org/maven2/com/jcraft/jsch/0.1.42/jsch-0.1.42.jar
2017-07-12T13:50:52.414 [INFO] Downloaded: https://repo.maven.apache.org/maven2/commons-digester/commons-digester/1.8.1/commons-digester-1.8.1.jar
(143 KB at 480.4 KB/sec)
2017-07-12T13:50:52.414 [INFO] Downloading: https://repo.maven.apache.org/maven2/commons-beanutils/commons-beanutils-bean-collections/1.8.3/commons-beanutils-bean-collections-1.8.3.jar
2017-07-12T13:50:52.433 [INFO] Downloaded: https://repo.maven.apache.org/maven2/commons-configuration/commons-configuration/1.7/commons-configuration-1.7.jar
(343 KB at 1082.7 KB/sec)
2017-07-12T13:50:52.433 [INFO] Downloading: https://repo.maven.apache.org/maven2/commons-daemon/commons-daemon/1.0.13/commons-daemon-1.0.13.jar
2017-07-12T13:50:52.444 [INFO] Downloaded: https://repo.maven.apache.org/maven2/commons-beanutils/commons-beanutils-bean-collections/1.8.3/commons-beanutils-bean-collections-1.8.3.jar
(26 KB at 79.4 KB/sec)
2017-07-12T13:50:52.444 [INFO] Downloading: https://repo.maven.apache.org/maven2/javax/xml/bind/jaxb-api/2.2.2/jaxb-api-2.2.2.jar
2017-07-12T13:50:52.451 [INFO] Downloaded: https://repo.maven.apache.org/maven2/com/jcraft/jsch/0.1.42/jsch-0.1.42.jar
(182 KB at 543.1 KB/sec)
2017-07-12T13:50:52.451 [INFO] Downloading: https://repo.maven.apache.org/maven2/javax/xml/stream/stax-api/1.0-2/stax-api-1.0-2.jar
2017-07-12T13:50:52.464 [INFO] Downloaded: https://repo.maven.apache.org/maven2/commons-daemon/commons-daemon/1.0.13/commons-daemon-1.0.13.jar
(24 KB at 68.2 KB/sec)
2017-07-12T13:50:52.464 [INFO] Downloading: https://repo.maven.apache.org/maven2/javax/activation/activation/1.1/activation-1.1.jar
2017-07-12T13:50:52.479 [INFO] Downloaded: https://repo.maven.apache.org/maven2/javax/xml/stream/stax-api/1.0-2/stax-api-1.0-2.jar
(23 KB at 63.0 KB/sec)
2017-07-12T13:50:52.479 [INFO] Downloading: https://repo.maven.apache.org/maven2/org/apache/commons/commons-math3/3.5/commons-math3-3.5.jar
2017-07-12T13:50:52.480 [INFO] Downloaded: https://repo.maven.apache.org/maven2/javax/xml/bind/jaxb-api/2.2.2/jaxb-api-2.2.2.jar
(103 KB at 282.8 KB/sec)
2017-07-12T13:50:52.480 [INFO] Downloading: https://repo.maven.apache.org/maven2/org/apache/flink/flink-runtime_2.10/1.3.0/flink-runtime_2.10-1.3.0.jar
2017-07-12T13:50:52.500 [INFO] Downloaded: https://repo.maven.apache.org/maven2/javax/activation/activation/1.1/activation-1.1.jar
(62 KB at 160.6 KB/sec)
2017-07-12T13:50:52.500 [INFO] Downloading: https://repo.maven.apache.org/maven2/io/netty/netty-all/4.0.27.Final/netty-all-4.0.27.Final.jar
2017-07-12T13:50:52.622 [INFO] Downloaded: https://repo.maven.apache.org/maven2/org/apache/flink/flink-optimizer_2.10/1.3.0/flink-optimizer_2.10-1.3.0.jar
(2679 KB at 5304.8 KB/sec)
2017-07-12T13:50:52.622 [INFO] Downloading: https://repo.maven.apache.org/maven2/org/javassist/javassist/3.18.2-GA/javassist-3.18.2-GA.jar
2017-07-12T13:50:52.829 [INFO] Downloaded: https://repo.maven.apache.org/maven2/org/javassist/javassist/3.18.2-GA/javassist-3.18.2-GA.jar
(698 KB at 980.0 KB/sec)
2017-07-12T13:50:52.829 [INFO] Downloaded: https://repo.maven.apache.org/maven2/org/apache/commons/commons-math3/3.5/commons-math3-3.5.jar
(1991 KB at 2795.9 KB/sec)
2017-07-12T13:50:52.830 [INFO] Downloading: https://repo.maven.apache.org/maven2/org/scala-lang/scala-library/2.10.4/scala-library-2.10.4.jar
2017-07-12T13:50:52.830 [INFO] Downloading: https://repo.maven.apache.org/maven2/com/data-artisans/flakka-actor_2.10/2.3-custom/flakka-actor_2.10-2.3-custom.jar
2017-07-12T13:50:52.835 [INFO] Downloaded: https://repo.maven.apache.org/maven2/io/netty/netty-all/4.0.27.Final/netty-all-4.0.27.Final.jar
(1894 KB at 2637.8 KB/sec)
2017-07-12T13:50:52.835 [INFO] Downloading: https://repo.maven.apache.org/maven2/com/typesafe/config/1.2.1/config-1.2.1.jar
2017-07-12T13:50:52.888 [INFO] Downloaded: https://repo.maven.apache.org/maven2/com/typesafe/config/1.2.1/config-1.2.1.jar
(215 KB at 278.1 KB/sec)
2017-07-12T13:50:52.888 [INFO] Downloading: https://repo.maven.apache.org/maven2/com/data-artisans/flakka-remote_2.10/2.3-custom/flakka-remote_2.10-2.3-custom.jar
2017-07-12T13:50:53.036 [INFO] Downloaded: https://repo.maven.apache.org/maven2/com/data-artisans/flakka-remote_2.10/2.3-custom/flakka-remote_2.10-2.3-custom.jar
(1347 KB at 1465.7 KB/sec)
2017-07-12T13:50:53.036 [INFO] Downloading: https://repo.maven.apache.org/maven2/io/netty/netty/3.8.0.Final/netty-3.8.0.Final.jar
2017-07-12T13:50:53.156 [INFO] Downloaded: https://repo.maven.apache.org/maven2/com/data-artisans/flakka-actor_2.10/2.3-custom/flakka-actor_2.10-2.3-custom.jar
(2754 KB at 2650.1 KB/sec)
2017-07-12T13:50:53.156 [INFO] Downloading: https://repo.maven.apache.org/maven2/org/uncommons/maths/uncommons-maths/1.2.2a/uncommons-maths-1.2.2a.jar
2017-07-12T13:50:53.184 [INFO] Downloaded: https://repo.maven.apache.org/maven2/org/uncommons/maths/uncommons-maths/1.2.2a/uncommons-maths-1.2.2a.jar
(48 KB at 44.9 KB/sec)
2017-07-12T13:50:53.184 [INFO] Downloading: https://repo.maven.apache.org/maven2/com/data-artisans/flakka-slf4j_2.10/2.3-custom/flakka-slf4j_2.10-2.3-custom.jar
2017-07-12T13:50:53.188 [INFO] Downloaded: https://repo.maven.apache.org/maven2/io/netty/netty/3.8.0.Final/netty-3.8.0.Final.jar
(1202 KB at 1121.7 KB/sec)
2017-07-12T13:50:53.188 [INFO] Downloading: https://repo.maven.apache.org/maven2/org/clapper/grizzled-slf4j_2.10/1.0.2/grizzled-slf4j_2.10-1.0.2.jar
2017-07-12T13:50:53.211 [INFO] Downloaded: https://repo.maven.apache.org/maven2/com/data-artisans/flakka-slf4j_2.10/2.3-custom/flakka-slf4j_2.10-2.3-custom.jar
(16 KB at 13.9 KB/sec)
2017-07-12T13:50:53.211 [INFO] Downloading: https://repo.maven.apache.org/maven2/com/github/scopt/scopt_2.10/3.5.0/scopt_2.10-3.5.0.jar
2017-07-12T13:50:53.214 [INFO] Downloaded: https://repo.maven.apache.org/maven2/org/clapper/grizzled-slf4j_2.10/1.0.2/grizzled-slf4j_2.10-1.0.2.jar
(7 KB at 5.7 KB/sec)
2017-07-12T13:50:53.215 [INFO] Downloading: https://repo.maven.apache.org/maven2/org/apache/zookeeper/zookeeper/3.4.6/zookeeper-3.4.6.jar
2017-07-12T13:50:53.252 [INFO] Downloaded: https://repo.maven.apache.org/maven2/com/github/scopt/scopt_2.10/3.5.0/scopt_2.10-3.5.0.jar
(140 KB at 123.2 KB/sec)
2017-07-12T13:50:53.252 [INFO] Downloading: https://repo.maven.apache.org/maven2/jline/jline/0.9.94/jline-0.9.94.jar
2017-07-12T13:50:53.282 [INFO] Downloaded: https://repo.maven.apache.org/maven2/jline/jline/0.9.94/jline-0.9.94.jar
(86 KB at 73.3 KB/sec)
2017-07-12T13:50:53.282 [INFO] Downloading: https://repo.maven.apache.org/maven2/com/twitter/chill_2.10/0.7.4/chill_2.10-0.7.4.jar
2017-07-12T13:50:53.300 [INFO] Downloaded: https://repo.maven.apache.org/maven2/org/apache/zookeeper/zookeeper/3.4.6/zookeeper-3.4.6.jar
(775 KB at 655.1 KB/sec)
2017-07-12T13:50:53.301 [INFO] Downloaded: https://repo.maven.apache.org/maven2/org/apache/flink/flink-runtime_2.10/1.3.0/flink-runtime_2.10-1.3.0.jar
(9005 KB at 7604.8 KB/sec)
2017-07-12T13:50:53.301 [INFO] Downloading: https://repo.maven.apache.org/maven2/com/twitter/chill-java/0.7.4/chill-java-0.7.4.jar
2017-07-12T13:50:53.301 [INFO] Downloading: https://repo.maven.apache.org/maven2/org/apache/flink/flink-streaming-java_2.10/1.3.0/flink-streaming-java_2.10-1.3.0.jar
2017-07-12T13:50:53.324 [INFO] Downloaded: https://repo.maven.apache.org/maven2/com/twitter/chill_2.10/0.7.4/chill_2.10-0.7.4.jar
(217 KB at 179.1 KB/sec)
2017-07-12T13:50:53.324 [INFO] Downloading: https://repo.maven.apache.org/maven2/org/apache/sling/org.apache.sling.commons.json/2.0.6/org.apache.sling.commons.json-2.0.6.jar
2017-07-12T13:50:53.331 [INFO] Downloaded: https://repo.maven.apache.org/maven2/com/twitter/chill-java/0.7.4/chill-java-0.7.4.jar
(50 KB at 40.5 KB/sec)
2017-07-12T13:50:53.331 [INFO] Downloading: https://repo.maven.apache.org/maven2/org/apache/flink/flink-core/1.3.0/flink-core-1.3.0-tests.jar
2017-07-12T13:50:53.335 [INFO] Downloaded: https://repo.maven.apache.org/maven2/org/scala-lang/scala-library/2.10.4/scala-library-2.10.4.jar
(6960 KB at 5713.8 KB/sec)
2017-07-12T13:50:53.335 [INFO] Downloading: https://repo.maven.apache.org/maven2/org/apache/flink/flink-runtime_2.10/1.3.0/flink-runtime_2.10-1.3.0-tests.jar
2017-07-12T13:50:53.356 [INFO] Downloaded: https://repo.maven.apache.org/maven2/org/apache/sling/org.apache.sling.commons.json/2.0.6/org.apache.sling.commons.json-2.0.6.jar
(47 KB at 37.9 KB/sec)
2017-07-12T13:50:53.356 [INFO] Downloading: https://repo.maven.apache.org/maven2/com/google/apis/google-api-services-bigquery/v2-rev295-1.22.0/google-api-services-bigquery-v2-rev295-1.22.0.jar
2017-07-12T13:50:53.395 [INFO] Downloaded: https://repo.maven.apache.org/maven2/com/google/apis/google-api-services-bigquery/v2-rev295-1.22.0/google-api-services-bigquery-v2-rev295-1.22.0.jar
(100 KB at 78.0 KB/sec)
2017-07-12T13:50:53.396 [INFO] Downloading: https://repo.maven.apache.org/maven2/com/google/api-client/google-api-client/1.22.0/google-api-client-1.22.0.jar
2017-07-12T13:50:53.416 [INFO] Downloaded: https://repo.maven.apache.org/maven2/org/apache/flink/flink-core/1.3.0/flink-core-1.3.0-tests.jar
(753 KB at 579.4 KB/sec)
2017-07-12T13:50:53.416 [INFO] Downloading: https://repo.maven.apache.org/maven2/com/google/oauth-client/google-oauth-client/1.22.0/google-oauth-client-1.22.0.jar
2017-07-12T13:50:53.436 [INFO] Downloaded: https://repo.maven.apache.org/maven2/com/google/api-client/google-api-client/1.22.0/google-api-client-1.22.0.jar
(195 KB at 147.5 KB/sec)
2017-07-12T13:50:53.436 [INFO] Downloading: https://repo.maven.apache.org/maven2/com/google/http-client/google-http-client/1.22.0/google-http-client-1.22.0.jar
2017-07-12T13:50:53.447 [INFO] Downloaded: https://repo.maven.apache.org/maven2/com/google/oauth-client/google-oauth-client/1.22.0/google-oauth-client-1.22.0.jar
(60 KB at 45.1 KB/sec)
2017-07-12T13:50:53.447 [INFO] Downloading: https://repo.maven.apache.org/maven2/org/apache/httpcomponents/httpclient/4.0.1/httpclient-4.0.1.jar
2017-07-12T13:50:53.506 [INFO] Downloaded: https://repo.maven.apache.org/maven2/org/apache/httpcomponents/httpclient/4.0.1/httpclient-4.0.1.jar
(285 KB at 204.8 KB/sec)
2017-07-12T13:50:53.506 [INFO] Downloading: https://repo.maven.apache.org/maven2/com/google/http-client/google-http-client-jackson2/1.22.0/google-http-client-jackson2-1.22.0.jar
2017-07-12T13:50:53.507 [INFO] Downloaded: https://repo.maven.apache.org/maven2/com/google/http-client/google-http-client/1.22.0/google-http-client-1.22.0.jar
(349 KB at 251.0 KB/sec)
2017-07-12T13:50:53.507 [INFO] Downloading: https://repo.maven.apache.org/maven2/org/apache/flink/flink-streaming-java_2.10/1.3.0/flink-streaming-java_2.10-1.3.0-tests.jar
2017-07-12T13:50:53.533 [INFO] Downloaded: https://repo.maven.apache.org/maven2/com/google/http-client/google-http-client-jackson2/1.22.0/google-http-client-jackson2-1.22.0.jar
(7 KB at 4.6 KB/sec)
2017-07-12T13:50:53.533 [INFO] Downloading: https://repo.maven.apache.org/maven2/org/apache/flink/flink-test-utils_2.10/1.3.0/flink-test-utils_2.10-1.3.0.jar
2017-07-12T13:50:53.580 [INFO] Downloaded: https://repo.maven.apache.org/maven2/org/apache/flink/flink-runtime_2.10/1.3.0/flink-runtime_2.10-1.3.0-tests.jar
(2841 KB at 1942.9 KB/sec)
2017-07-12T13:50:53.580 [INFO] Downloading: https://repo.maven.apache.org/maven2/org/apache/flink/flink-test-utils-junit/1.3.0/flink-test-utils-junit-1.3.0.jar
2017-07-12T13:50:53.586 [INFO] Downloaded: https://repo.maven.apache.org/maven2/org/apache/flink/flink-streaming-java_2.10/1.3.0/flink-streaming-java_2.10-1.3.0.jar
(3128 KB at 2130.4 KB/sec)
2017-07-12T13:50:53.586 [INFO] Downloading: https://repo.maven.apache.org/maven2/org/apache/curator/curator-test/2.12.0/curator-test-2.12.0.jar
2017-07-12T13:50:53.607 [INFO] Downloaded: https://repo.maven.apache.org/maven2/org/apache/flink/flink-test-utils-junit/1.3.0/flink-test-utils-junit-1.3.0.jar
(26 KB at 17.0 KB/sec)
2017-07-12T13:50:53.626 [INFO] Downloaded: https://repo.maven.apache.org/maven2/org/apache/flink/flink-streaming-java_2.10/1.3.0/flink-streaming-java_2.10-1.3.0-tests.jar
(1133 KB at 751.2 KB/sec)
2017-07-12T13:50:53.717 [INFO] Downloaded: https://repo.maven.apache.org/maven2/org/apache/flink/flink-shaded-hadoop2/1.3.0/flink-shaded-hadoop2-1.3.0.jar
(16586 KB at 10365.8 KB/sec)
2017-07-12T13:50:53.732 [INFO] Downloaded: https://repo.maven.apache.org/maven2/org/apache/flink/flink-test-utils_2.10/1.3.0/flink-test-utils_2.10-1.3.0.jar
(2365 KB at 1464.9 KB/sec)
2017-07-12T13:50:53.773 [INFO] Downloaded: https://repo.maven.apache.org/maven2/org/apache/curator/curator-test/2.12.0/curator-test-2.12.0.jar
(2368 KB at 1430.6 KB/sec)
2017-07-12T13:50:53.788 [INFO] 
2017-07-12T13:50:53.788 [INFO] --- maven-clean-plugin:3.0.0:clean (default-clean) @ beam-runners-flink_2.10
---
2017-07-12T13:50:53.790 [INFO] Deleting <https://builds.apache.org/job/beam_PostCommit_Java_ValidatesRunner_Flink/ws/runners/flink>
(includes = [**/*.pyc, **/*.egg-info/, **/sdks/python/LICENSE, **/sdks/python/NOTICE, **/sdks/python/README.md],
excludes = [])
2017-07-12T13:50:53.840 [INFO] 
2017-07-12T13:50:53.840 [INFO] --- maven-enforcer-plugin:1.4.1:enforce (enforce) @ beam-runners-flink_2.10
---
2017-07-12T13:50:56.442 [INFO] 
2017-07-12T13:50:56.442 [INFO] --- maven-enforcer-plugin:1.4.1:enforce (enforce-banned-dependencies)
@ beam-runners-flink_2.10 ---
2017-07-12T13:50:56.513 [INFO] 
2017-07-12T13:50:56.513 [INFO] --- maven-remote-resources-plugin:1.5:process (process-resource-bundles)
@ beam-runners-flink_2.10 ---
2017-07-12T13:50:57.024 [INFO] 
2017-07-12T13:50:57.024 [INFO] --- maven-resources-plugin:3.0.2:resources (default-resources)
@ beam-runners-flink_2.10 ---
2017-07-12T13:50:57.025 [INFO] Using 'UTF-8' encoding to copy filtered resources.
2017-07-12T13:50:57.025 [INFO] Copying 1 resource
2017-07-12T13:50:57.043 [INFO] Copying 3 resources
2017-07-12T13:50:57.114 [INFO] 
2017-07-12T13:50:57.114 [INFO] --- maven-compiler-plugin:3.6.1:compile (default-compile) @
beam-runners-flink_2.10 ---
2017-07-12T13:50:57.126 [INFO] Changes detected - recompiling the module!
2017-07-12T13:50:57.127 [INFO] Compiling 76 source files to <https://builds.apache.org/job/beam_PostCommit_Java_ValidatesRunner_Flink/ws/runners/flink/target/classes>
2017-07-12T13:50:58.532 [WARNING] bootstrap class path not set in conjunction with -source
1.7
2017-07-12T13:50:58.532 [INFO] <https://builds.apache.org/job/beam_PostCommit_Java_ValidatesRunner_Flink/ws/runners/flink/src/main/java/org/apache/beam/runners/flink/translation/wrappers/streaming/io/DedupingOperator.java>:
Some input files use or override a deprecated API.
2017-07-12T13:50:58.532 [INFO] <https://builds.apache.org/job/beam_PostCommit_Java_ValidatesRunner_Flink/ws/runners/flink/src/main/java/org/apache/beam/runners/flink/translation/wrappers/streaming/io/DedupingOperator.java>:
Recompile with -Xlint:deprecation for details.
2017-07-12T13:50:58.532 [INFO] <https://builds.apache.org/job/beam_PostCommit_Java_ValidatesRunner_Flink/ws/runners/flink/src/main/java/org/apache/beam/runners/flink/FlinkStreamingPipelineTranslator.java>:
Some input files use unchecked or unsafe operations.
2017-07-12T13:50:58.532 [INFO] <https://builds.apache.org/job/beam_PostCommit_Java_ValidatesRunner_Flink/ws/runners/flink/src/main/java/org/apache/beam/runners/flink/FlinkStreamingPipelineTranslator.java>:
Recompile with -Xlint:unchecked for details.
2017-07-12T13:50:58.622 [INFO] 
2017-07-12T13:50:58.622 [INFO] --- maven-resources-plugin:3.0.2:testResources (default-testResources)
@ beam-runners-flink_2.10 ---
2017-07-12T13:50:58.623 [INFO] Using 'UTF-8' encoding to copy filtered resources.
2017-07-12T13:50:58.623 [INFO] Copying 1 resource
2017-07-12T13:50:58.625 [INFO] Copying 3 resources
2017-07-12T13:50:58.741 [INFO] 
2017-07-12T13:50:58.741 [INFO] --- maven-compiler-plugin:3.6.1:testCompile (default-testCompile)
@ beam-runners-flink_2.10 ---
2017-07-12T13:50:58.750 [INFO] Changes detected - recompiling the module!
2017-07-12T13:50:58.750 [INFO] Compiling 17 source files to <https://builds.apache.org/job/beam_PostCommit_Java_ValidatesRunner_Flink/ws/runners/flink/target/test-classes>
2017-07-12T13:50:59.264 [INFO] <https://builds.apache.org/job/beam_PostCommit_Java_ValidatesRunner_Flink/ws/runners/flink/src/test/java/org/apache/beam/runners/flink/streaming/UnboundedSourceWrapperTest.java>:
Some input files use unchecked or unsafe operations.
2017-07-12T13:50:59.264 [INFO] <https://builds.apache.org/job/beam_PostCommit_Java_ValidatesRunner_Flink/ws/runners/flink/src/test/java/org/apache/beam/runners/flink/streaming/UnboundedSourceWrapperTest.java>:
Recompile with -Xlint:unchecked for details.
2017-07-12T13:50:59.314 [INFO] 
2017-07-12T13:50:59.314 [INFO] --- maven-checkstyle-plugin:2.17:check (default) @ beam-runners-flink_2.10
---
2017-07-12T13:51:00.436 [INFO] Starting audit...
[ERROR] <https://builds.apache.org/job/beam_PostCommit_Java_ValidatesRunner_Flink/ws/runners/flink/src/main/java/org/apache/beam/runners/flink/translation/wrappers/streaming/DoFnOperator.java>:334:
Line is longer than 100 characters (found 158). [LineLength]
[ERROR] <https://builds.apache.org/job/beam_PostCommit_Java_ValidatesRunner_Flink/ws/runners/flink/src/main/java/org/apache/beam/runners/flink/translation/wrappers/streaming/DoFnOperator.java>:334:158:
'+' should be on a new line. [OperatorWrap]
[ERROR] <https://builds.apache.org/job/beam_PostCommit_Java_ValidatesRunner_Flink/ws/runners/flink/src/main/java/org/apache/beam/runners/flink/translation/wrappers/streaming/DoFnOperator.java>:335:
Line is longer than 100 characters (found 177). [LineLength]
[ERROR] <https://builds.apache.org/job/beam_PostCommit_Java_ValidatesRunner_Flink/ws/runners/flink/src/main/java/org/apache/beam/runners/flink/translation/wrappers/streaming/DoFnOperator.java>:337:
Line is longer than 100 characters (found 158). [LineLength]
[ERROR] <https://builds.apache.org/job/beam_PostCommit_Java_ValidatesRunner_Flink/ws/runners/flink/src/main/java/org/apache/beam/runners/flink/translation/wrappers/streaming/DoFnOperator.java>:337:158:
'+' should be on a new line. [OperatorWrap]
[ERROR] <https://builds.apache.org/job/beam_PostCommit_Java_ValidatesRunner_Flink/ws/runners/flink/src/main/java/org/apache/beam/runners/flink/translation/wrappers/streaming/DoFnOperator.java>:338:
Line is longer than 100 characters (found 124). [LineLength]
Audit done.
2017-07-12T13:51:00.436 [INFO] There are 6 errors reported by Checkstyle 6.19 with beam/checkstyle.xml
ruleset.
2017-07-12T13:51:00.438 [ERROR] src/main/java/org/apache/beam/runners/flink/translation/wrappers/streaming/DoFnOperator.java:[334]
(sizes) LineLength: Line is longer than 100 characters (found 158).
2017-07-12T13:51:00.438 [ERROR] src/main/java/org/apache/beam/runners/flink/translation/wrappers/streaming/DoFnOperator.java:[334,158]
(whitespace) OperatorWrap: '+' should be on a new line.
2017-07-12T13:51:00.438 [ERROR] src/main/java/org/apache/beam/runners/flink/translation/wrappers/streaming/DoFnOperator.java:[335]
(sizes) LineLength: Line is longer than 100 characters (found 177).
2017-07-12T13:51:00.438 [ERROR] src/main/java/org/apache/beam/runners/flink/translation/wrappers/streaming/DoFnOperator.java:[337]
(sizes) LineLength: Line is longer than 100 characters (found 158).
2017-07-12T13:51:00.438 [ERROR] src/main/java/org/apache/beam/runners/flink/translation/wrappers/streaming/DoFnOperator.java:[337,158]
(whitespace) OperatorWrap: '+' should be on a new line.
2017-07-12T13:51:00.438 [ERROR] src/main/java/org/apache/beam/runners/flink/translation/wrappers/streaming/DoFnOperator.java:[338]
(sizes) LineLength: Line is longer than 100 characters (found 124).
[JENKINS] Archiving disabled
[JENKINS] Archiving disabled
[JENKINS] Archiving disabled
[JENKINS] Archiving disabled
[JENKINS] Archiving disabled
[JENKINS] Archiving disabled
[JENKINS] Archiving disabled
[JENKINS] Archiving disabled
[JENKINS] Archiving disabled
[JENKINS] Archiving disabled
[JENKINS] Archiving disabled
[JENKINS] Archiving disabled
[JENKINS] Archiving disabled
2017-07-12T13:51:04.913 [INFO] ------------------------------------------------------------------------
2017-07-12T13:51:04.913 [INFO] Reactor Summary:
2017-07-12T13:51:04.913 [INFO] 
2017-07-12T13:51:04.913 [INFO] Apache Beam :: Parent .............................. SUCCESS
[ 27.903 s]
2017-07-12T13:51:04.913 [INFO] Apache Beam :: SDKs :: Java :: Build Tools ......... SUCCESS
[  8.104 s]
2017-07-12T13:51:04.913 [INFO] Apache Beam :: SDKs ................................ SUCCESS
[  1.400 s]
2017-07-12T13:51:04.913 [INFO] Apache Beam :: SDKs :: Common ...................... SUCCESS
[  4.467 s]
2017-07-12T13:51:04.913 [INFO] Apache Beam :: SDKs :: Common :: Runner API ........ SUCCESS
[  9.682 s]
2017-07-12T13:51:04.913 [INFO] Apache Beam :: SDKs :: Common :: Fn API ............ SUCCESS
[ 22.911 s]
2017-07-12T13:51:04.913 [INFO] Apache Beam :: SDKs :: Java ........................ SUCCESS
[  3.033 s]
2017-07-12T13:51:04.913 [INFO] Apache Beam :: SDKs :: Java :: Core ................ SUCCESS
[02:11 min]
2017-07-12T13:51:04.913 [INFO] Apache Beam :: Runners ............................. SUCCESS
[  2.398 s]
2017-07-12T13:51:04.913 [INFO] Apache Beam :: Runners :: Core Construction Java ... SUCCESS
[ 18.314 s]
2017-07-12T13:51:04.913 [INFO] Apache Beam :: Runners :: Core Java ................ SUCCESS
[ 31.242 s]
2017-07-12T13:51:04.913 [INFO] Apache Beam :: Runners :: Flink .................... FAILURE
[ 11.471 s]
2017-07-12T13:51:04.913 [INFO] ------------------------------------------------------------------------
2017-07-12T13:51:04.913 [INFO] BUILD FAILURE
2017-07-12T13:51:04.913 [INFO] ------------------------------------------------------------------------
2017-07-12T13:51:04.914 [INFO] Total time: 05:51 min
2017-07-12T13:51:04.914 [INFO] Finished at: 2017-07-12T13:51:04+00:00
2017-07-12T13:51:05.665 [INFO] Final Memory: 238M/1549M
2017-07-12T13:51:05.665 [INFO] ------------------------------------------------------------------------
2017-07-12T13:51:05.665 [WARNING] The requested profile "validates-runner-tests" could not
be activated because it does not exist.
Waiting for Jenkins to finish collecting data
2017-07-12T13:52:00.277 [ERROR] Failed to execute goal org.apache.maven.plugins:maven-checkstyle-plugin:2.17:check
(default) on project beam-runners-flink_2.10: You have 6 Checkstyle violations. -> [Help
1]
org.apache.maven.lifecycle.LifecycleExecutionException: Failed to execute goal org.apache.maven.plugins:maven-checkstyle-plugin:2.17:check
(default) on project beam-runners-flink_2.10: You have 6 Checkstyle violations.
	at org.apache.maven.lifecycle.internal.MojoExecutor.execute(MojoExecutor.java:212)
	at org.apache.maven.lifecycle.internal.MojoExecutor.execute(MojoExecutor.java:153)
	at org.apache.maven.lifecycle.internal.MojoExecutor.execute(MojoExecutor.java:145)
	at org.apache.maven.lifecycle.internal.LifecycleModuleBuilder.buildProject(LifecycleModuleBuilder.java:116)
	at org.apache.maven.lifecycle.internal.LifecycleModuleBuilder.buildProject(LifecycleModuleBuilder.java:80)
	at org.apache.maven.lifecycle.internal.builder.singlethreaded.SingleThreadedBuilder.build(SingleThreadedBuilder.java:51)
	at org.apache.maven.lifecycle.internal.LifecycleStarter.execute(LifecycleStarter.java:128)
	at org.apache.maven.DefaultMaven.doExecute(DefaultMaven.java:307)
	at org.apache.maven.DefaultMaven.doExecute(DefaultMaven.java:193)
	at org.apache.maven.DefaultMaven.execute(DefaultMaven.java:106)
	at org.jvnet.hudson.maven3.launcher.Maven33Launcher.main(Maven33Launcher.java:129)
	at sun.reflect.NativeMethodAccessorImpl.invoke0(Native Method)
	at sun.reflect.NativeMethodAccessorImpl.invoke(NativeMethodAccessorImpl.java:62)
	at sun.reflect.DelegatingMethodAccessorImpl.invoke(DelegatingMethodAccessorImpl.java:43)
	at java.lang.reflect.Method.invoke(Method.java:498)
	at org.codehaus.plexus.classworlds.launcher.Launcher.launchStandard(Launcher.java:330)
	at org.codehaus.plexus.classworlds.launcher.Launcher.launch(Launcher.java:238)
	at jenkins.maven3.agent.Maven33Main.launch(Maven33Main.java:176)
	at sun.reflect.NativeMethodAccessorImpl.invoke0(Native Method)
	at sun.reflect.NativeMethodAccessorImpl.invoke(NativeMethodAccessorImpl.java:62)
	at sun.reflect.DelegatingMethodAccessorImpl.invoke(DelegatingMethodAccessorImpl.java:43)
	at java.lang.reflect.Method.invoke(Method.java:498)
	at hudson.maven.Maven3Builder.call(Maven3Builder.java:139)
	at hudson.maven.Maven3Builder.call(Maven3Builder.java:70)
	at hudson.remoting.UserRequest.perform(UserRequest.java:153)
	at hudson.remoting.UserRequest.perform(UserRequest.java:50)
	at hudson.remoting.Request$2.run(Request.java:336)
	at hudson.remoting.InterceptingExecutorService$1.call(InterceptingExecutorService.java:68)
	at java.util.concurrent.FutureTask.run(FutureTask.java:266)
	at java.util.concurrent.ThreadPoolExecutor.runWorker(ThreadPoolExecutor.java:1142)
	at java.util.concurrent.ThreadPoolExecutor$Worker.run(ThreadPoolExecutor.java:617)
	at java.lang.Thread.run(Thread.java:748)
Caused by: org.apache.maven.plugin.MojoFailureException: You have 6 Checkstyle violations.
	at org.apache.maven.plugin.checkstyle.CheckstyleViolationCheckMojo.execute(CheckstyleViolationCheckMojo.java:588)
	at org.apache.maven.plugin.DefaultBuildPluginManager.executeMojo(DefaultBuildPluginManager.java:134)
	at org.apache.maven.lifecycle.internal.MojoExecutor.execute(MojoExecutor.java:208)
	... 31 more
2017-07-12T13:52:00.279 [ERROR] 
2017-07-12T13:52:00.279 [ERROR] Re-run Maven using the -X switch to enable full debug logging.
2017-07-12T13:52:00.279 [ERROR] 
2017-07-12T13:52:00.279 [ERROR] For more information about the errors and possible solutions,
please read the following articles:
2017-07-12T13:52:00.279 [ERROR] [Help 1] http://cwiki.apache.org/confluence/display/MAVEN/MojoFailureException
2017-07-12T13:52:00.279 [ERROR] 
2017-07-12T13:52:00.279 [ERROR] After correcting the problems, you can resume the build with
the command
2017-07-12T13:52:00.279 [ERROR]   mvn <goals> -rf :beam-runners-flink_2.10
channel stopped
Not sending mail to unregistered user klk@google.com
Not sending mail to unregistered user kirpichov@google.com
Not sending mail to unregistered user valentyn@google.com

Mime
View raw message