beam-commits mailing list archives

Site index · List index
Message view « Date » · « Thread »
Top « Date » · « Thread »
From Apache Jenkins Server <jenk...@builds.apache.org>
Subject Build failed in Jenkins: beam_PostCommit_Python_Verify #2720
Date Thu, 13 Jul 2017 21:19:00 GMT
See <https://builds.apache.org/job/beam_PostCommit_Python_Verify/2720/display/redirect?page=changes>

Changes:

[klk] Unbundle Context and WindowedContext.

------------------------------------------
[...truncated 567.12 KB...]
Successfully downloaded pyhamcrest mock setuptools six funcsigs pbr
test_default_value_singleton_side_input (apache_beam.transforms.sideinputs_test.SideInputsTest)
... ok
DEPRECATION: pip install --download has been deprecated and will be removed in the future.
Pip now has a download command that should be used instead.
Collecting pyhamcrest (from -r postcommit_requirements.txt (line 1))
  File was already downloaded /tmp/dataflow-requirements-cache/PyHamcrest-1.9.0.tar.gz
Collecting mock (from -r postcommit_requirements.txt (line 2))
  File was already downloaded /tmp/dataflow-requirements-cache/mock-2.0.0.tar.gz
Collecting setuptools (from pyhamcrest->-r postcommit_requirements.txt (line 1))
  File was already downloaded /tmp/dataflow-requirements-cache/setuptools-36.1.1.zip
Collecting six (from pyhamcrest->-r postcommit_requirements.txt (line 1))
  File was already downloaded /tmp/dataflow-requirements-cache/six-1.10.0.tar.gz
Collecting funcsigs>=1 (from mock->-r postcommit_requirements.txt (line 2))
  File was already downloaded /tmp/dataflow-requirements-cache/funcsigs-1.0.2.tar.gz
Collecting pbr>=0.11 (from mock->-r postcommit_requirements.txt (line 2))
  File was already downloaded /tmp/dataflow-requirements-cache/pbr-3.1.1.tar.gz
Successfully downloaded pyhamcrest mock setuptools six funcsigs pbr
test_as_singleton_with_different_defaults (apache_beam.transforms.sideinputs_test.SideInputsTest)
... ok
DEPRECATION: pip install --download has been deprecated and will be removed in the future.
Pip now has a download command that should be used instead.
Collecting pyhamcrest (from -r postcommit_requirements.txt (line 1))
  File was already downloaded /tmp/dataflow-requirements-cache/PyHamcrest-1.9.0.tar.gz
Collecting mock (from -r postcommit_requirements.txt (line 2))
  File was already downloaded /tmp/dataflow-requirements-cache/mock-2.0.0.tar.gz
Collecting setuptools (from pyhamcrest->-r postcommit_requirements.txt (line 1))
  File was already downloaded /tmp/dataflow-requirements-cache/setuptools-36.1.1.zip
Collecting six (from pyhamcrest->-r postcommit_requirements.txt (line 1))
  File was already downloaded /tmp/dataflow-requirements-cache/six-1.10.0.tar.gz
Collecting funcsigs>=1 (from mock->-r postcommit_requirements.txt (line 2))
  File was already downloaded /tmp/dataflow-requirements-cache/funcsigs-1.0.2.tar.gz
Collecting pbr>=0.11 (from mock->-r postcommit_requirements.txt (line 2))
  File was already downloaded /tmp/dataflow-requirements-cache/pbr-3.1.1.tar.gz
Successfully downloaded pyhamcrest mock setuptools six funcsigs pbr
test_as_singleton_without_unique_labels (apache_beam.transforms.sideinputs_test.SideInputsTest)
... ok
DEPRECATION: pip install --download has been deprecated and will be removed in the future.
Pip now has a download command that should be used instead.
Collecting pyhamcrest (from -r postcommit_requirements.txt (line 1))
  File was already downloaded /tmp/dataflow-requirements-cache/PyHamcrest-1.9.0.tar.gz
Collecting mock (from -r postcommit_requirements.txt (line 2))
  File was already downloaded /tmp/dataflow-requirements-cache/mock-2.0.0.tar.gz
Collecting setuptools (from pyhamcrest->-r postcommit_requirements.txt (line 1))
  File was already downloaded /tmp/dataflow-requirements-cache/setuptools-36.1.1.zip
Collecting six (from pyhamcrest->-r postcommit_requirements.txt (line 1))
  File was already downloaded /tmp/dataflow-requirements-cache/six-1.10.0.tar.gz
Collecting funcsigs>=1 (from mock->-r postcommit_requirements.txt (line 2))
  File was already downloaded /tmp/dataflow-requirements-cache/funcsigs-1.0.2.tar.gz
Collecting pbr>=0.11 (from mock->-r postcommit_requirements.txt (line 2))
  File was already downloaded /tmp/dataflow-requirements-cache/pbr-3.1.1.tar.gz
Successfully downloaded pyhamcrest mock setuptools six funcsigs pbr
test_empty_singleton_side_input (apache_beam.transforms.sideinputs_test.SideInputsTest) ...
ok
test_flattened_side_input (apache_beam.transforms.sideinputs_test.SideInputsTest) ... ok
test_iterable_side_input (apache_beam.transforms.sideinputs_test.SideInputsTest) ... ok
test_multi_valued_singleton_side_input (apache_beam.transforms.sideinputs_test.SideInputsTest)
... ok

======================================================================
ERROR: test_multiple_empty_outputs (apache_beam.transforms.ptransform_test.PTransformTest)
----------------------------------------------------------------------
Traceback (most recent call last):
  File "<https://builds.apache.org/job/beam_PostCommit_Python_Verify/ws/sdks/python/apache_beam/transforms/ptransform_test.py",>
line 262, in test_multiple_empty_outputs
    pipeline.run()
  File "<https://builds.apache.org/job/beam_PostCommit_Python_Verify/ws/sdks/python/apache_beam/testing/test_pipeline.py",>
line 96, in run
    result = super(TestPipeline, self).run()
  File "<https://builds.apache.org/job/beam_PostCommit_Python_Verify/ws/sdks/python/apache_beam/pipeline.py",>
line 319, in run
    self.to_runner_api(), self.runner, self._options).run(False)
  File "<https://builds.apache.org/job/beam_PostCommit_Python_Verify/ws/sdks/python/apache_beam/pipeline.py",>
line 328, in run
    return self.runner.run(self)
  File "<https://builds.apache.org/job/beam_PostCommit_Python_Verify/ws/sdks/python/apache_beam/runners/dataflow/test_dataflow_runner.py",>
line 38, in run
    self.result = super(TestDataflowRunner, self).run(pipeline)
  File "<https://builds.apache.org/job/beam_PostCommit_Python_Verify/ws/sdks/python/apache_beam/runners/dataflow/dataflow_runner.py",>
line 271, in run
    self.dataflow_client.create_job(self.job), self)
  File "<https://builds.apache.org/job/beam_PostCommit_Python_Verify/ws/sdks/python/apache_beam/utils/retry.py",>
line 168, in wrapper
    return fun(*args, **kwargs)
  File "<https://builds.apache.org/job/beam_PostCommit_Python_Verify/ws/sdks/python/apache_beam/runners/dataflow/internal/apiclient.py",>
line 438, in create_job
    self.create_job_description(job)
  File "<https://builds.apache.org/job/beam_PostCommit_Python_Verify/ws/sdks/python/apache_beam/runners/dataflow/internal/apiclient.py",>
line 461, in create_job_description
    job.options, file_copy=self._gcs_file_copy)
  File "<https://builds.apache.org/job/beam_PostCommit_Python_Verify/ws/sdks/python/apache_beam/runners/dataflow/internal/dependency.py",>
line 327, in stage_job_resources
    setup_options.requirements_file, requirements_cache_path)
  File "<https://builds.apache.org/job/beam_PostCommit_Python_Verify/ws/sdks/python/apache_beam/runners/dataflow/internal/dependency.py",>
line 261, in _populate_requirements_cache
    processes.check_call(cmd_args)
  File "<https://builds.apache.org/job/beam_PostCommit_Python_Verify/ws/sdks/python/apache_beam/utils/processes.py",>
line 44, in check_call
    return subprocess.check_call(*args, **kwargs)
  File "/usr/lib/python2.7/subprocess.py", line 540, in check_call
    raise CalledProcessError(retcode, cmd)
CalledProcessError: Command '['<https://builds.apache.org/job/beam_PostCommit_Python_Verify/ws/sdks/python/bin/python',>
'-m', 'pip', 'install', '--download', '/tmp/dataflow-requirements-cache', '-r', 'postcommit_requirements.txt',
'--no-binary', ':all:']' returned non-zero exit status 2
-------------------- >> begin captured logging << --------------------
root: DEBUG: PValue computed by Some Numbers/Read (tag None): refcount: 1 => 0
root: DEBUG: PValue computed by ClassifyNumbers/FlatMap(<lambda at ptransform_test.py:256>)
(tag None): refcount: 1 => 0
root: DEBUG: PValue computed by assert_that/WindowInto(WindowIntoFn) (tag None): refcount:
1 => 0
root: DEBUG: PValue computed by assert_that/Create/Read (tag None): refcount: 1 => 0
root: DEBUG: PValue computed by assert_that/ToVoidKey (tag None): refcount: 1 => 0
root: DEBUG: PValue computed by assert_that/Group/pair_with_0 (tag None): refcount: 1 =>
0
root: DEBUG: PValue computed by assert_that/Group/pair_with_1 (tag None): refcount: 1 =>
0
root: DEBUG: PValue computed by assert_that/Group/Flatten (tag None): refcount: 1 => 0
root: DEBUG: PValue computed by assert_that/Group/GroupByKey (tag None): refcount: 1 =>
0
root: DEBUG: PValue computed by assert_that/Group/Map(_merge_tagged_vals_under_key) (tag None):
refcount: 1 => 0
root: DEBUG: PValue computed by assert_that/Unkey (tag None): refcount: 1 => 0
root: DEBUG: PValue computed by ClassifyNumbers/FlatMap(<lambda at ptransform_test.py:256>)
(tag odd): refcount: 1 => 0
root: DEBUG: PValue computed by assert:odd/WindowInto(WindowIntoFn) (tag None): refcount:
1 => 0
root: DEBUG: PValue computed by assert:odd/Create/Read (tag None): refcount: 1 => 0
root: DEBUG: PValue computed by assert:odd/ToVoidKey (tag None): refcount: 1 => 0
root: DEBUG: PValue computed by assert:odd/Group/pair_with_0 (tag None): refcount: 1 =>
0
root: DEBUG: PValue computed by assert:odd/Group/pair_with_1 (tag None): refcount: 1 =>
0
root: DEBUG: PValue computed by assert:odd/Group/Flatten (tag None): refcount: 1 => 0
root: DEBUG: PValue computed by assert:odd/Group/GroupByKey (tag None): refcount: 1 =>
0
root: DEBUG: PValue computed by assert:odd/Group/Map(_merge_tagged_vals_under_key) (tag None):
refcount: 1 => 0
root: DEBUG: PValue computed by assert:odd/Unkey (tag None): refcount: 1 => 0
root: DEBUG: PValue computed by ClassifyNumbers/FlatMap(<lambda at ptransform_test.py:256>)
(tag even): refcount: 1 => 0
root: DEBUG: PValue computed by assert:even/WindowInto(WindowIntoFn) (tag None): refcount:
1 => 0
root: DEBUG: PValue computed by assert:even/Create/Read (tag None): refcount: 1 => 0
root: DEBUG: PValue computed by assert:even/ToVoidKey (tag None): refcount: 1 => 0
root: DEBUG: PValue computed by assert:even/Group/pair_with_0 (tag None): refcount: 1 =>
0
root: DEBUG: PValue computed by assert:even/Group/pair_with_1 (tag None): refcount: 1 =>
0
root: DEBUG: PValue computed by assert:even/Group/Flatten (tag None): refcount: 1 => 0
root: DEBUG: PValue computed by assert:even/Group/GroupByKey (tag None): refcount: 1 =>
0
root: DEBUG: PValue computed by assert:even/Group/Map(_merge_tagged_vals_under_key) (tag None):
refcount: 1 => 0
root: DEBUG: PValue computed by assert:even/Unkey (tag None): refcount: 1 => 0
root: DEBUG: Connecting using Google Application Default Credentials.
root: INFO: Starting GCS upload to gs://temp-storage-for-end-to-end-tests/staging-validatesrunner-test/beamapp-jenkins-0713210004-367088.1499979604.367417/requirements.txt...
oauth2client.transport: INFO: Attempting refresh to obtain initial access_token
root: INFO: Completed GCS upload to gs://temp-storage-for-end-to-end-tests/staging-validatesrunner-test/beamapp-jenkins-0713210004-367088.1499979604.367417/requirements.txt
root: INFO: Executing command: ['<https://builds.apache.org/job/beam_PostCommit_Python_Verify/ws/sdks/python/bin/python',>
'-m', 'pip', 'install', '--download', '/tmp/dataflow-requirements-cache', '-r', 'postcommit_requirements.txt',
'--no-binary', ':all:']
--------------------- >> end captured logging << ---------------------

======================================================================
ERROR: test_read_from_text_metrics (apache_beam.transforms.ptransform_test.PTransformTest)
----------------------------------------------------------------------
Traceback (most recent call last):
  File "<https://builds.apache.org/job/beam_PostCommit_Python_Verify/ws/sdks/python/apache_beam/transforms/ptransform_test.py",>
line 191, in test_read_from_text_metrics
    res = pipeline.run()
  File "<https://builds.apache.org/job/beam_PostCommit_Python_Verify/ws/sdks/python/apache_beam/testing/test_pipeline.py",>
line 96, in run
    result = super(TestPipeline, self).run()
  File "<https://builds.apache.org/job/beam_PostCommit_Python_Verify/ws/sdks/python/apache_beam/pipeline.py",>
line 319, in run
    self.to_runner_api(), self.runner, self._options).run(False)
  File "<https://builds.apache.org/job/beam_PostCommit_Python_Verify/ws/sdks/python/apache_beam/pipeline.py",>
line 328, in run
    return self.runner.run(self)
  File "<https://builds.apache.org/job/beam_PostCommit_Python_Verify/ws/sdks/python/apache_beam/runners/dataflow/test_dataflow_runner.py",>
line 38, in run
    self.result = super(TestDataflowRunner, self).run(pipeline)
  File "<https://builds.apache.org/job/beam_PostCommit_Python_Verify/ws/sdks/python/apache_beam/runners/dataflow/dataflow_runner.py",>
line 271, in run
    self.dataflow_client.create_job(self.job), self)
  File "<https://builds.apache.org/job/beam_PostCommit_Python_Verify/ws/sdks/python/apache_beam/utils/retry.py",>
line 168, in wrapper
    return fun(*args, **kwargs)
  File "<https://builds.apache.org/job/beam_PostCommit_Python_Verify/ws/sdks/python/apache_beam/runners/dataflow/internal/apiclient.py",>
line 438, in create_job
    self.create_job_description(job)
  File "<https://builds.apache.org/job/beam_PostCommit_Python_Verify/ws/sdks/python/apache_beam/runners/dataflow/internal/apiclient.py",>
line 461, in create_job_description
    job.options, file_copy=self._gcs_file_copy)
  File "<https://builds.apache.org/job/beam_PostCommit_Python_Verify/ws/sdks/python/apache_beam/runners/dataflow/internal/dependency.py",>
line 327, in stage_job_resources
    setup_options.requirements_file, requirements_cache_path)
  File "<https://builds.apache.org/job/beam_PostCommit_Python_Verify/ws/sdks/python/apache_beam/runners/dataflow/internal/dependency.py",>
line 261, in _populate_requirements_cache
    processes.check_call(cmd_args)
  File "<https://builds.apache.org/job/beam_PostCommit_Python_Verify/ws/sdks/python/apache_beam/utils/processes.py",>
line 44, in check_call
    return subprocess.check_call(*args, **kwargs)
  File "/usr/lib/python2.7/subprocess.py", line 540, in check_call
    raise CalledProcessError(retcode, cmd)
CalledProcessError: Command '['<https://builds.apache.org/job/beam_PostCommit_Python_Verify/ws/sdks/python/bin/python',>
'-m', 'pip', 'install', '--download', '/tmp/dataflow-requirements-cache', '-r', 'postcommit_requirements.txt',
'--no-binary', ':all:']' returned non-zero exit status 2
-------------------- >> begin captured logging << --------------------
root: DEBUG: PValue computed by Read (tag None): refcount: 1 => 0
root: DEBUG: Connecting using Google Application Default Credentials.
root: INFO: Starting GCS upload to gs://temp-storage-for-end-to-end-tests/staging-validatesrunner-test/beamapp-jenkins-0713210004-397793.1499979604.398106/requirements.txt...
oauth2client.transport: INFO: Attempting refresh to obtain initial access_token
root: INFO: Completed GCS upload to gs://temp-storage-for-end-to-end-tests/staging-validatesrunner-test/beamapp-jenkins-0713210004-397793.1499979604.398106/requirements.txt
root: INFO: Executing command: ['<https://builds.apache.org/job/beam_PostCommit_Python_Verify/ws/sdks/python/bin/python',>
'-m', 'pip', 'install', '--download', '/tmp/dataflow-requirements-cache', '-r', 'postcommit_requirements.txt',
'--no-binary', ':all:']
--------------------- >> end captured logging << ---------------------

======================================================================
ERROR: test_par_do_with_multiple_outputs_and_using_yield (apache_beam.transforms.ptransform_test.PTransformTest)
----------------------------------------------------------------------
Traceback (most recent call last):
  File "<https://builds.apache.org/job/beam_PostCommit_Python_Verify/ws/sdks/python/apache_beam/transforms/ptransform_test.py",>
line 220, in test_par_do_with_multiple_outputs_and_using_yield
    pipeline.run()
  File "<https://builds.apache.org/job/beam_PostCommit_Python_Verify/ws/sdks/python/apache_beam/testing/test_pipeline.py",>
line 96, in run
    result = super(TestPipeline, self).run()
  File "<https://builds.apache.org/job/beam_PostCommit_Python_Verify/ws/sdks/python/apache_beam/pipeline.py",>
line 319, in run
    self.to_runner_api(), self.runner, self._options).run(False)
  File "<https://builds.apache.org/job/beam_PostCommit_Python_Verify/ws/sdks/python/apache_beam/pipeline.py",>
line 328, in run
    return self.runner.run(self)
  File "<https://builds.apache.org/job/beam_PostCommit_Python_Verify/ws/sdks/python/apache_beam/runners/dataflow/test_dataflow_runner.py",>
line 38, in run
    self.result = super(TestDataflowRunner, self).run(pipeline)
  File "<https://builds.apache.org/job/beam_PostCommit_Python_Verify/ws/sdks/python/apache_beam/runners/dataflow/dataflow_runner.py",>
line 271, in run
    self.dataflow_client.create_job(self.job), self)
  File "<https://builds.apache.org/job/beam_PostCommit_Python_Verify/ws/sdks/python/apache_beam/utils/retry.py",>
line 168, in wrapper
    return fun(*args, **kwargs)
  File "<https://builds.apache.org/job/beam_PostCommit_Python_Verify/ws/sdks/python/apache_beam/runners/dataflow/internal/apiclient.py",>
line 438, in create_job
    self.create_job_description(job)
  File "<https://builds.apache.org/job/beam_PostCommit_Python_Verify/ws/sdks/python/apache_beam/runners/dataflow/internal/apiclient.py",>
line 461, in create_job_description
    job.options, file_copy=self._gcs_file_copy)
  File "<https://builds.apache.org/job/beam_PostCommit_Python_Verify/ws/sdks/python/apache_beam/runners/dataflow/internal/dependency.py",>
line 327, in stage_job_resources
    setup_options.requirements_file, requirements_cache_path)
  File "<https://builds.apache.org/job/beam_PostCommit_Python_Verify/ws/sdks/python/apache_beam/runners/dataflow/internal/dependency.py",>
line 261, in _populate_requirements_cache
    processes.check_call(cmd_args)
  File "<https://builds.apache.org/job/beam_PostCommit_Python_Verify/ws/sdks/python/apache_beam/utils/processes.py",>
line 44, in check_call
    return subprocess.check_call(*args, **kwargs)
  File "/usr/lib/python2.7/subprocess.py", line 540, in check_call
    raise CalledProcessError(retcode, cmd)
CalledProcessError: Command '['<https://builds.apache.org/job/beam_PostCommit_Python_Verify/ws/sdks/python/bin/python',>
'-m', 'pip', 'install', '--download', '/tmp/dataflow-requirements-cache', '-r', 'postcommit_requirements.txt',
'--no-binary', ':all:']' returned non-zero exit status 2
-------------------- >> begin captured logging << --------------------
root: DEBUG: PValue computed by Some Numbers/Read (tag None): refcount: 1 => 0
root: DEBUG: PValue computed by ClassifyNumbers/ParDo(SomeDoFn) (tag None): refcount: 1 =>
0
root: DEBUG: PValue computed by assert_that/WindowInto(WindowIntoFn) (tag None): refcount:
1 => 0
root: DEBUG: PValue computed by assert_that/Create/Read (tag None): refcount: 1 => 0
root: DEBUG: PValue computed by assert_that/ToVoidKey (tag None): refcount: 1 => 0
root: DEBUG: PValue computed by assert_that/Group/pair_with_0 (tag None): refcount: 1 =>
0
root: DEBUG: PValue computed by assert_that/Group/pair_with_1 (tag None): refcount: 1 =>
0
root: DEBUG: PValue computed by assert_that/Group/Flatten (tag None): refcount: 1 => 0
root: DEBUG: PValue computed by assert_that/Group/GroupByKey (tag None): refcount: 1 =>
0
root: DEBUG: PValue computed by assert_that/Group/Map(_merge_tagged_vals_under_key) (tag None):
refcount: 1 => 0
root: DEBUG: PValue computed by assert_that/Unkey (tag None): refcount: 1 => 0
root: DEBUG: PValue computed by ClassifyNumbers/ParDo(SomeDoFn) (tag odd): refcount: 1 =>
0
root: DEBUG: PValue computed by assert:odd/WindowInto(WindowIntoFn) (tag None): refcount:
1 => 0
root: DEBUG: PValue computed by assert:odd/Create/Read (tag None): refcount: 1 => 0
root: DEBUG: PValue computed by assert:odd/ToVoidKey (tag None): refcount: 1 => 0
root: DEBUG: PValue computed by assert:odd/Group/pair_with_0 (tag None): refcount: 1 =>
0
root: DEBUG: PValue computed by assert:odd/Group/pair_with_1 (tag None): refcount: 1 =>
0
root: DEBUG: PValue computed by assert:odd/Group/Flatten (tag None): refcount: 1 => 0
root: DEBUG: PValue computed by assert:odd/Group/GroupByKey (tag None): refcount: 1 =>
0
root: DEBUG: PValue computed by assert:odd/Group/Map(_merge_tagged_vals_under_key) (tag None):
refcount: 1 => 0
root: DEBUG: PValue computed by assert:odd/Unkey (tag None): refcount: 1 => 0
root: DEBUG: PValue computed by ClassifyNumbers/ParDo(SomeDoFn) (tag even): refcount: 1 =>
0
root: DEBUG: PValue computed by assert:even/WindowInto(WindowIntoFn) (tag None): refcount:
1 => 0
root: DEBUG: PValue computed by assert:even/Create/Read (tag None): refcount: 1 => 0
root: DEBUG: PValue computed by assert:even/ToVoidKey (tag None): refcount: 1 => 0
root: DEBUG: PValue computed by assert:even/Group/pair_with_0 (tag None): refcount: 1 =>
0
root: DEBUG: PValue computed by assert:even/Group/pair_with_1 (tag None): refcount: 1 =>
0
root: DEBUG: PValue computed by assert:even/Group/Flatten (tag None): refcount: 1 => 0
root: DEBUG: PValue computed by assert:even/Group/GroupByKey (tag None): refcount: 1 =>
0
root: DEBUG: PValue computed by assert:even/Group/Map(_merge_tagged_vals_under_key) (tag None):
refcount: 1 => 0
root: DEBUG: PValue computed by assert:even/Unkey (tag None): refcount: 1 => 0
root: DEBUG: Connecting using Google Application Default Credentials.
root: INFO: Starting GCS upload to gs://temp-storage-for-end-to-end-tests/staging-validatesrunner-test/beamapp-jenkins-0713210004-461608.1499979604.461919/requirements.txt...
oauth2client.transport: INFO: Attempting refresh to obtain initial access_token
root: INFO: Completed GCS upload to gs://temp-storage-for-end-to-end-tests/staging-validatesrunner-test/beamapp-jenkins-0713210004-461608.1499979604.461919/requirements.txt
root: INFO: Executing command: ['<https://builds.apache.org/job/beam_PostCommit_Python_Verify/ws/sdks/python/bin/python',>
'-m', 'pip', 'install', '--download', '/tmp/dataflow-requirements-cache', '-r', 'postcommit_requirements.txt',
'--no-binary', ':all:']
--------------------- >> end captured logging << ---------------------

----------------------------------------------------------------------
Ran 15 tests in 1135.322s

FAILED (errors=3)
Found: https://console.cloud.google.com/dataflow/job/2017-07-13_14_00_32-4146748823069317197?project=apache-beam-testing
Found: https://console.cloud.google.com/dataflow/job/2017-07-13_14_07_02-11015860190113437572?project=apache-beam-testing
Found: https://console.cloud.google.com/dataflow/job/2017-07-13_14_13_22-6303386874905628357?project=apache-beam-testing
Found: https://console.cloud.google.com/dataflow/job/2017-07-13_14_00_29-12744102744444159220?project=apache-beam-testing
Found: https://console.cloud.google.com/dataflow/job/2017-07-13_14_07_17-9262412832114126310?project=apache-beam-testing
Found: https://console.cloud.google.com/dataflow/job/2017-07-13_14_12_51-8956821924429334813?project=apache-beam-testing
Found: https://console.cloud.google.com/dataflow/job/2017-07-13_14_00_32-5030655882783952067?project=apache-beam-testing
Found: https://console.cloud.google.com/dataflow/job/2017-07-13_14_06_53-12679606765106515403?project=apache-beam-testing
Found: https://console.cloud.google.com/dataflow/job/2017-07-13_14_13_00-6827669830809475233?project=apache-beam-testing
Found: https://console.cloud.google.com/dataflow/job/2017-07-13_14_00_31-3916378251111875720?project=apache-beam-testing
Found: https://console.cloud.google.com/dataflow/job/2017-07-13_14_05_52-14894608645893723721?project=apache-beam-testing
Found: https://console.cloud.google.com/dataflow/job/2017-07-13_14_11_37-3027966266145330645?project=apache-beam-testing
Build step 'Execute shell' marked build as failure
Not sending mail to unregistered user klk@google.com

Mime
View raw message