beam-commits mailing list archives

Site index · List index
Message view « Date » · « Thread »
Top « Date » · « Thread »
From Apache Jenkins Server <jenk...@builds.apache.org>
Subject Build failed in Jenkins: beam_PostCommit_Java_ValidatesRunner_Apex #1945
Date Sun, 09 Jul 2017 06:06:00 GMT
See <https://builds.apache.org/job/beam_PostCommit_Java_ValidatesRunner_Apex/1945/display/redirect>

------------------------------------------
[...truncated 471.02 KB...]
2017-07-09T06:05:42.881 [INFO] Downloaded: https://repo.maven.apache.org/maven2/org/slf4j/slf4j-log4j12/1.6.1/slf4j-log4j12-1.6.1.pom
(2 KB at 62.1 KB/sec)
2017-07-09T06:05:42.882 [INFO] Downloading: https://repo.maven.apache.org/maven2/org/slf4j/slf4j-parent/1.6.1/slf4j-parent-1.6.1.pom
2017-07-09T06:05:42.915 [INFO] Downloaded: https://repo.maven.apache.org/maven2/org/slf4j/slf4j-parent/1.6.1/slf4j-parent-1.6.1.pom
(10 KB at 275.9 KB/sec)
2017-07-09T06:05:42.917 [INFO] Downloading: https://repo.maven.apache.org/maven2/log4j/log4j/1.2.16/log4j-1.2.16.pom
2017-07-09T06:05:42.943 [INFO] Downloaded: https://repo.maven.apache.org/maven2/log4j/log4j/1.2.16/log4j-1.2.16.pom
(20 KB at 764.0 KB/sec)
2017-07-09T06:05:42.946 [INFO] Downloading: https://repo.maven.apache.org/maven2/jline/jline/0.9.94/jline-0.9.94.pom
2017-07-09T06:05:42.972 [INFO] Downloaded: https://repo.maven.apache.org/maven2/jline/jline/0.9.94/jline-0.9.94.pom
(7 KB at 238.8 KB/sec)
2017-07-09T06:05:42.974 [INFO] Downloading: https://repo.maven.apache.org/maven2/io/netty/netty/3.7.0.Final/netty-3.7.0.Final.pom
2017-07-09T06:05:43.002 [INFO] Downloaded: https://repo.maven.apache.org/maven2/io/netty/netty/3.7.0.Final/netty-3.7.0.Final.pom
(26 KB at 913.9 KB/sec)
2017-07-09T06:05:43.007 [INFO] Downloading: https://repo.maven.apache.org/maven2/org/apache/curator/curator-framework/2.7.1/curator-framework-2.7.1.pom
2017-07-09T06:05:43.033 [INFO] Downloaded: https://repo.maven.apache.org/maven2/org/apache/curator/curator-framework/2.7.1/curator-framework-2.7.1.pom
(3 KB at 78.3 KB/sec)
2017-07-09T06:05:43.035 [INFO] Downloading: https://repo.maven.apache.org/maven2/org/apache/curator/apache-curator/2.7.1/apache-curator-2.7.1.pom
2017-07-09T06:05:43.081 [INFO] Downloaded: https://repo.maven.apache.org/maven2/org/apache/curator/apache-curator/2.7.1/apache-curator-2.7.1.pom
(32 KB at 675.7 KB/sec)
2017-07-09T06:05:43.084 [INFO] Downloading: https://repo.maven.apache.org/maven2/org/apache/curator/curator-client/2.7.1/curator-client-2.7.1.pom
2017-07-09T06:05:43.124 [INFO] Downloaded: https://repo.maven.apache.org/maven2/org/apache/curator/curator-client/2.7.1/curator-client-2.7.1.pom
(3 KB at 56.6 KB/sec)
2017-07-09T06:05:43.126 [INFO] Downloading: https://repo.maven.apache.org/maven2/com/jcraft/jsch/0.1.42/jsch-0.1.42.pom
2017-07-09T06:05:43.153 [INFO] Downloaded: https://repo.maven.apache.org/maven2/com/jcraft/jsch/0.1.42/jsch-0.1.42.pom
(967 B at 35.0 KB/sec)
2017-07-09T06:05:43.154 [INFO] Downloading: https://repo.maven.apache.org/maven2/org/apache/curator/curator-recipes/2.7.1/curator-recipes-2.7.1.pom
2017-07-09T06:05:43.180 [INFO] Downloaded: https://repo.maven.apache.org/maven2/org/apache/curator/curator-recipes/2.7.1/curator-recipes-2.7.1.pom
(3 KB at 88.8 KB/sec)
2017-07-09T06:05:43.183 [INFO] Downloading: https://repo.maven.apache.org/maven2/org/apache/htrace/htrace-core/3.1.0-incubating/htrace-core-3.1.0-incubating.pom
2017-07-09T06:05:43.209 [INFO] Downloaded: https://repo.maven.apache.org/maven2/org/apache/htrace/htrace-core/3.1.0-incubating/htrace-core-3.1.0-incubating.pom
(4 KB at 153.6 KB/sec)
2017-07-09T06:05:43.211 [INFO] Downloading: https://repo.maven.apache.org/maven2/org/apache/htrace/htrace/3.1.0-incubating/htrace-3.1.0-incubating.pom
2017-07-09T06:05:43.237 [INFO] Downloaded: https://repo.maven.apache.org/maven2/org/apache/htrace/htrace/3.1.0-incubating/htrace-3.1.0-incubating.pom
(12 KB at 436.4 KB/sec)
2017-07-09T06:05:43.239 [INFO] Downloading: https://repo.maven.apache.org/maven2/org/apache/apache/12/apache-12.pom
2017-07-09T06:05:43.267 [INFO] Downloaded: https://repo.maven.apache.org/maven2/org/apache/apache/12/apache-12.pom
(16 KB at 561.3 KB/sec)
2017-07-09T06:05:43.269 [INFO] Downloading: https://repo.maven.apache.org/maven2/com/datatorrent/netlet/1.2.1/netlet-1.2.1.pom
2017-07-09T06:05:43.298 [INFO] Downloaded: https://repo.maven.apache.org/maven2/com/datatorrent/netlet/1.2.1/netlet-1.2.1.pom
(19 KB at 629.8 KB/sec)
2017-07-09T06:05:43.301 [INFO] Downloading: https://repo.maven.apache.org/maven2/org/slf4j/slf4j-log4j12/1.7.5/slf4j-log4j12-1.7.5.pom
2017-07-09T06:05:43.327 [INFO] Downloaded: https://repo.maven.apache.org/maven2/org/slf4j/slf4j-log4j12/1.7.5/slf4j-log4j12-1.7.5.pom
(2 KB at 60.1 KB/sec)
2017-07-09T06:05:43.331 [INFO] Downloading: https://repo.maven.apache.org/maven2/com/esotericsoftware/kryo/kryo/2.24.0/kryo-2.24.0.pom
2017-07-09T06:05:43.358 [INFO] Downloaded: https://repo.maven.apache.org/maven2/com/esotericsoftware/kryo/kryo/2.24.0/kryo-2.24.0.pom
(7 KB at 225.0 KB/sec)
2017-07-09T06:05:43.361 [INFO] Downloading: https://repo.maven.apache.org/maven2/org/objenesis/objenesis/2.1/objenesis-2.1.pom
2017-07-09T06:05:43.386 [INFO] Downloaded: https://repo.maven.apache.org/maven2/org/objenesis/objenesis/2.1/objenesis-2.1.pom
(3 KB at 99.1 KB/sec)
2017-07-09T06:05:43.387 [INFO] Downloading: https://repo.maven.apache.org/maven2/org/objenesis/objenesis-parent/2.1/objenesis-parent-2.1.pom
2017-07-09T06:05:43.414 [INFO] Downloaded: https://repo.maven.apache.org/maven2/org/objenesis/objenesis-parent/2.1/objenesis-parent-2.1.pom
(17 KB at 604.3 KB/sec)
2017-07-09T06:05:43.417 [INFO] Downloading: https://repo.maven.apache.org/maven2/org/codehaus/jackson/jackson-core-asl/1.9.2/jackson-core-asl-1.9.2.pom
2017-07-09T06:05:43.442 [INFO] Downloaded: https://repo.maven.apache.org/maven2/org/codehaus/jackson/jackson-core-asl/1.9.2/jackson-core-asl-1.9.2.pom
(1016 B at 39.7 KB/sec)
2017-07-09T06:05:43.443 [INFO] Downloading: https://repo.maven.apache.org/maven2/org/codehaus/jackson/jackson-mapper-asl/1.9.2/jackson-mapper-asl-1.9.2.pom
2017-07-09T06:05:43.468 [INFO] Downloaded: https://repo.maven.apache.org/maven2/org/codehaus/jackson/jackson-mapper-asl/1.9.2/jackson-mapper-asl-1.9.2.pom
(2 KB at 48.5 KB/sec)
2017-07-09T06:05:43.469 [INFO] Downloading: https://repo.maven.apache.org/maven2/javax/validation/validation-api/1.1.0.Final/validation-api-1.1.0.Final.pom
2017-07-09T06:05:43.495 [INFO] Downloaded: https://repo.maven.apache.org/maven2/javax/validation/validation-api/1.1.0.Final/validation-api-1.1.0.Final.pom
(8 KB at 295.2 KB/sec)
2017-07-09T06:05:43.497 [INFO] Downloading: https://repo.maven.apache.org/maven2/org/eclipse/jetty/jetty-servlet/8.1.10.v20130312/jetty-servlet-8.1.10.v20130312.pom
2017-07-09T06:05:43.523 [INFO] Downloaded: https://repo.maven.apache.org/maven2/org/eclipse/jetty/jetty-servlet/8.1.10.v20130312/jetty-servlet-8.1.10.v20130312.pom
(3 KB at 100.8 KB/sec)
2017-07-09T06:05:43.524 [INFO] Downloading: https://repo.maven.apache.org/maven2/org/eclipse/jetty/jetty-project/8.1.10.v20130312/jetty-project-8.1.10.v20130312.pom
2017-07-09T06:05:43.553 [INFO] Downloaded: https://repo.maven.apache.org/maven2/org/eclipse/jetty/jetty-project/8.1.10.v20130312/jetty-project-8.1.10.v20130312.pom
(28 KB at 940.2 KB/sec)
2017-07-09T06:05:43.555 [INFO] Downloading: https://repo.maven.apache.org/maven2/org/eclipse/jetty/jetty-parent/20/jetty-parent-20.pom
2017-07-09T06:05:43.582 [INFO] Downloaded: https://repo.maven.apache.org/maven2/org/eclipse/jetty/jetty-parent/20/jetty-parent-20.pom
(21 KB at 766.7 KB/sec)
2017-07-09T06:05:43.586 [INFO] Downloading: https://repo.maven.apache.org/maven2/org/eclipse/jetty/jetty-security/8.1.10.v20130312/jetty-security-8.1.10.v20130312.pom
2017-07-09T06:05:43.613 [INFO] Downloaded: https://repo.maven.apache.org/maven2/org/eclipse/jetty/jetty-security/8.1.10.v20130312/jetty-security-8.1.10.v20130312.pom
(3 KB at 97.5 KB/sec)
2017-07-09T06:05:43.617 [INFO] Downloading: https://repo.maven.apache.org/maven2/org/eclipse/jetty/jetty-server/8.1.10.v20130312/jetty-server-8.1.10.v20130312.pom
2017-07-09T06:05:43.644 [INFO] Downloaded: https://repo.maven.apache.org/maven2/org/eclipse/jetty/jetty-server/8.1.10.v20130312/jetty-server-8.1.10.v20130312.pom
(4 KB at 135.2 KB/sec)
2017-07-09T06:05:43.647 [INFO] Downloading: https://repo.maven.apache.org/maven2/org/eclipse/jetty/jetty-continuation/8.1.10.v20130312/jetty-continuation-8.1.10.v20130312.pom
2017-07-09T06:05:43.673 [INFO] Downloaded: https://repo.maven.apache.org/maven2/org/eclipse/jetty/jetty-continuation/8.1.10.v20130312/jetty-continuation-8.1.10.v20130312.pom
(3 KB at 101.1 KB/sec)
2017-07-09T06:05:43.678 [INFO] Downloading: https://repo.maven.apache.org/maven2/org/eclipse/jetty/jetty-http/8.1.10.v20130312/jetty-http-8.1.10.v20130312.pom
2017-07-09T06:05:43.705 [INFO] Downloaded: https://repo.maven.apache.org/maven2/org/eclipse/jetty/jetty-http/8.1.10.v20130312/jetty-http-8.1.10.v20130312.pom
(3 KB at 94.0 KB/sec)
2017-07-09T06:05:43.708 [INFO] Downloading: https://repo.maven.apache.org/maven2/org/eclipse/jetty/jetty-io/8.1.10.v20130312/jetty-io-8.1.10.v20130312.pom
2017-07-09T06:05:43.734 [INFO] Downloaded: https://repo.maven.apache.org/maven2/org/eclipse/jetty/jetty-io/8.1.10.v20130312/jetty-io-8.1.10.v20130312.pom
(3 KB at 79.0 KB/sec)
2017-07-09T06:05:43.739 [INFO] Downloading: https://repo.maven.apache.org/maven2/org/eclipse/jetty/jetty-util/8.1.10.v20130312/jetty-util-8.1.10.v20130312.pom
2017-07-09T06:05:43.765 [INFO] Downloaded: https://repo.maven.apache.org/maven2/org/eclipse/jetty/jetty-util/8.1.10.v20130312/jetty-util-8.1.10.v20130312.pom
(4 KB at 127.4 KB/sec)
2017-07-09T06:05:43.768 [INFO] Downloading: https://repo.maven.apache.org/maven2/com/sun/mail/javax.mail/1.5.0/javax.mail-1.5.0.pom
2017-07-09T06:05:43.796 [INFO] Downloaded: https://repo.maven.apache.org/maven2/com/sun/mail/javax.mail/1.5.0/javax.mail-1.5.0.pom
(5 KB at 149.9 KB/sec)
2017-07-09T06:05:43.797 [INFO] Downloading: https://repo.maven.apache.org/maven2/com/sun/mail/all/1.5.0/all-1.5.0.pom
2017-07-09T06:05:43.825 [INFO] Downloaded: https://repo.maven.apache.org/maven2/com/sun/mail/all/1.5.0/all-1.5.0.pom
(19 KB at 677.8 KB/sec)
2017-07-09T06:05:43.828 [INFO] Downloading: https://repo.maven.apache.org/maven2/com/sun/jersey/jersey-client/1.9/jersey-client-1.9.pom
2017-07-09T06:05:43.854 [INFO] Downloaded: https://repo.maven.apache.org/maven2/com/sun/jersey/jersey-client/1.9/jersey-client-1.9.pom
(7 KB at 242.0 KB/sec)
2017-07-09T06:05:43.857 [INFO] Downloading: https://repo.maven.apache.org/maven2/javax/jms/jms-api/1.1-rev-1/jms-api-1.1-rev-1.pom
2017-07-09T06:05:43.882 [INFO] Downloaded: https://repo.maven.apache.org/maven2/javax/jms/jms-api/1.1-rev-1/jms-api-1.1-rev-1.pom
(3 KB at 115.2 KB/sec)
2017-07-09T06:05:43.884 [INFO] Downloading: https://repo.maven.apache.org/maven2/org/glassfish/api/api/1/api-1.pom
2017-07-09T06:05:43.909 [INFO] Downloaded: https://repo.maven.apache.org/maven2/org/glassfish/api/api/1/api-1.pom
(6 KB at 202.0 KB/sec)
2017-07-09T06:05:43.911 [INFO] Downloading: https://repo.maven.apache.org/maven2/org/glassfish/pom/2/pom-2.pom
2017-07-09T06:05:43.938 [INFO] Downloaded: https://repo.maven.apache.org/maven2/org/glassfish/pom/2/pom-2.pom
(9 KB at 326.9 KB/sec)
2017-07-09T06:05:43.940 [INFO] Downloading: https://repo.maven.apache.org/maven2/org/apache/activemq/activemq-client/5.8.0/activemq-client-5.8.0.pom
2017-07-09T06:05:43.966 [INFO] Downloaded: https://repo.maven.apache.org/maven2/org/apache/activemq/activemq-client/5.8.0/activemq-client-5.8.0.pom
(11 KB at 392.2 KB/sec)
2017-07-09T06:05:43.968 [INFO] Downloading: https://repo.maven.apache.org/maven2/org/apache/activemq/activemq-parent/5.8.0/activemq-parent-5.8.0.pom
2017-07-09T06:05:44.004 [INFO] Downloaded: https://repo.maven.apache.org/maven2/org/apache/activemq/activemq-parent/5.8.0/activemq-parent-5.8.0.pom
(54 KB at 1493.2 KB/sec)
2017-07-09T06:05:44.013 [INFO] Downloading: https://repo.maven.apache.org/maven2/org/apache/geronimo/specs/geronimo-jms_1.1_spec/1.1.1/geronimo-jms_1.1_spec-1.1.1.pom
2017-07-09T06:05:44.040 [INFO] Downloaded: https://repo.maven.apache.org/maven2/org/apache/geronimo/specs/geronimo-jms_1.1_spec/1.1.1/geronimo-jms_1.1_spec-1.1.1.pom
(3 KB at 93.3 KB/sec)
2017-07-09T06:05:44.042 [INFO] Downloading: https://repo.maven.apache.org/maven2/org/apache/geronimo/specs/specs/1.4/specs-1.4.pom
2017-07-09T06:05:44.069 [INFO] Downloaded: https://repo.maven.apache.org/maven2/org/apache/geronimo/specs/specs/1.4/specs-1.4.pom
(12 KB at 434.0 KB/sec)
2017-07-09T06:05:44.072 [INFO] Downloading: https://repo.maven.apache.org/maven2/org/apache/geronimo/genesis/config/project-config/1.2/project-config-1.2.pom
2017-07-09T06:05:44.099 [INFO] Downloaded: https://repo.maven.apache.org/maven2/org/apache/geronimo/genesis/config/project-config/1.2/project-config-1.2.pom
(22 KB at 788.2 KB/sec)
2017-07-09T06:05:44.102 [INFO] Downloading: https://repo.maven.apache.org/maven2/org/apache/geronimo/genesis/config/config/1.2/config-1.2.pom
2017-07-09T06:05:44.127 [INFO] Downloaded: https://repo.maven.apache.org/maven2/org/apache/geronimo/genesis/config/config/1.2/config-1.2.pom
(2 KB at 69.4 KB/sec)
2017-07-09T06:05:44.129 [INFO] Downloading: https://repo.maven.apache.org/maven2/org/apache/geronimo/genesis/genesis/1.2/genesis-1.2.pom
2017-07-09T06:05:44.156 [INFO] Downloaded: https://repo.maven.apache.org/maven2/org/apache/geronimo/genesis/genesis/1.2/genesis-1.2.pom
(11 KB at 401.4 KB/sec)
2017-07-09T06:05:44.159 [INFO] Downloading: https://repo.maven.apache.org/maven2/org/fusesource/hawtbuf/hawtbuf/1.9/hawtbuf-1.9.pom
2017-07-09T06:05:44.186 [INFO] Downloaded: https://repo.maven.apache.org/maven2/org/fusesource/hawtbuf/hawtbuf/1.9/hawtbuf-1.9.pom
(3 KB at 93.9 KB/sec)
2017-07-09T06:05:44.187 [INFO] Downloading: https://repo.maven.apache.org/maven2/org/fusesource/hawtbuf/hawtbuf-project/1.9/hawtbuf-project-1.9.pom
2017-07-09T06:05:44.214 [INFO] Downloaded: https://repo.maven.apache.org/maven2/org/fusesource/hawtbuf/hawtbuf-project/1.9/hawtbuf-project-1.9.pom
(11 KB at 387.1 KB/sec)
2017-07-09T06:05:44.217 [INFO] Downloading: https://repo.maven.apache.org/maven2/org/fusesource/fusesource-pom/1.9/fusesource-pom-1.9.pom
2017-07-09T06:05:44.243 [INFO] Downloaded: https://repo.maven.apache.org/maven2/org/fusesource/fusesource-pom/1.9/fusesource-pom-1.9.pom
(15 KB at 555.6 KB/sec)
2017-07-09T06:05:44.246 [INFO] Downloading: https://repo.maven.apache.org/maven2/org/apache/geronimo/specs/geronimo-j2ee-management_1.1_spec/1.0.1/geronimo-j2ee-management_1.1_spec-1.0.1.pom
2017-07-09T06:05:44.271 [INFO] Downloaded: https://repo.maven.apache.org/maven2/org/apache/geronimo/specs/geronimo-j2ee-management_1.1_spec/1.0.1/geronimo-j2ee-management_1.1_spec-1.0.1.pom
(3 KB at 99.5 KB/sec)
2017-07-09T06:05:44.274 [INFO] Downloading: https://repo.maven.apache.org/maven2/com/github/tony19/named-regexp/0.2.3/named-regexp-0.2.3.pom
2017-07-09T06:05:44.300 [INFO] Downloaded: https://repo.maven.apache.org/maven2/com/github/tony19/named-regexp/0.2.3/named-regexp-0.2.3.pom
(7 KB at 255.9 KB/sec)
2017-07-09T06:05:44.303 [INFO] Downloading: https://repo.maven.apache.org/maven2/org/codehaus/janino/commons-compiler/2.7.8/commons-compiler-2.7.8.pom
2017-07-09T06:05:44.329 [INFO] Downloaded: https://repo.maven.apache.org/maven2/org/codehaus/janino/commons-compiler/2.7.8/commons-compiler-2.7.8.pom
(666 B at 25.0 KB/sec)
2017-07-09T06:05:44.330 [INFO] Downloading: https://repo.maven.apache.org/maven2/org/codehaus/janino/janino-parent/2.7.8/janino-parent-2.7.8.pom
2017-07-09T06:05:44.358 [INFO] Downloaded: https://repo.maven.apache.org/maven2/org/codehaus/janino/janino-parent/2.7.8/janino-parent-2.7.8.pom
(9 KB at 291.1 KB/sec)
2017-07-09T06:05:44.361 [INFO] Downloading: https://repo.maven.apache.org/maven2/org/eclipse/jetty/jetty-websocket/8.1.10.v20130312/jetty-websocket-8.1.10.v20130312.pom
2017-07-09T06:05:44.388 [INFO] Downloaded: https://repo.maven.apache.org/maven2/org/eclipse/jetty/jetty-websocket/8.1.10.v20130312/jetty-websocket-8.1.10.v20130312.pom
(4 KB at 146.7 KB/sec)
2017-07-09T06:05:44.392 [INFO] Downloading: https://repo.maven.apache.org/maven2/it/unimi/dsi/fastutil/7.0.6/fastutil-7.0.6.pom
2017-07-09T06:05:44.418 [INFO] Downloaded: https://repo.maven.apache.org/maven2/it/unimi/dsi/fastutil/7.0.6/fastutil-7.0.6.pom
(2 KB at 41.3 KB/sec)
2017-07-09T06:05:44.419 [INFO] Downloading: https://repo.maven.apache.org/maven2/org/apache/apex/apex-shaded-ning19/1.0.0/apex-shaded-ning19-1.0.0.pom
2017-07-09T06:05:44.445 [INFO] Downloaded: https://repo.maven.apache.org/maven2/org/apache/apex/apex-shaded-ning19/1.0.0/apex-shaded-ning19-1.0.0.pom
(651 B at 24.5 KB/sec)
2017-07-09T06:05:44.447 [INFO] Downloading: https://repo.maven.apache.org/maven2/org/apache/apex/apex-engine/3.6.0/apex-engine-3.6.0.pom
2017-07-09T06:05:44.475 [INFO] Downloaded: https://repo.maven.apache.org/maven2/org/apache/apex/apex-engine/3.6.0/apex-engine-3.6.0.pom
(14 KB at 467.2 KB/sec)
2017-07-09T06:05:44.477 [INFO] Downloading: https://repo.maven.apache.org/maven2/org/apache/apex/apex/3.6.0/apex-3.6.0.pom
2017-07-09T06:05:44.506 [INFO] Downloaded: https://repo.maven.apache.org/maven2/org/apache/apex/apex/3.6.0/apex-3.6.0.pom
(17 KB at 573.3 KB/sec)
2017-07-09T06:05:44.511 [INFO] Downloading: https://repo.maven.apache.org/maven2/org/apache/bval/bval-jsr303/0.5/bval-jsr303-0.5.pom
2017-07-09T06:05:44.539 [INFO] Downloaded: https://repo.maven.apache.org/maven2/org/apache/bval/bval-jsr303/0.5/bval-jsr303-0.5.pom
(9 KB at 290.9 KB/sec)
2017-07-09T06:05:44.541 [INFO] Downloading: https://repo.maven.apache.org/maven2/org/apache/bval/bval-parent/0.5/bval-parent-0.5.pom
2017-07-09T06:05:44.572 [INFO] Downloaded: https://repo.maven.apache.org/maven2/org/apache/bval/bval-parent/0.5/bval-parent-0.5.pom
(25 KB at 780.5 KB/sec)
2017-07-09T06:05:44.576 [INFO] Downloading: https://repo.maven.apache.org/maven2/org/apache/bval/bval-core/0.5/bval-core-0.5.pom
2017-07-09T06:05:44.604 [INFO] Downloaded: https://repo.maven.apache.org/maven2/org/apache/bval/bval-core/0.5/bval-core-0.5.pom
(6 KB at 211.4 KB/sec)
2017-07-09T06:05:44.606 [INFO] Downloading: https://repo.maven.apache.org/maven2/org/apache/apex/apex-bufferserver/3.6.0/apex-bufferserver-3.6.0.pom
2017-07-09T06:05:44.632 [INFO] Downloaded: https://repo.maven.apache.org/maven2/org/apache/apex/apex-bufferserver/3.6.0/apex-bufferserver-3.6.0.pom
(3 KB at 87.4 KB/sec)
2017-07-09T06:05:44.634 [INFO] Downloading: https://repo.maven.apache.org/maven2/org/apache/httpcomponents/httpclient/4.3.6/httpclient-4.3.6.pom
2017-07-09T06:05:44.660 [INFO] Downloaded: https://repo.maven.apache.org/maven2/org/apache/httpcomponents/httpclient/4.3.6/httpclient-4.3.6.pom
(6 KB at 195.7 KB/sec)
2017-07-09T06:05:44.661 [INFO] Downloading: https://repo.maven.apache.org/maven2/org/apache/httpcomponents/httpcomponents-client/4.3.6/httpcomponents-client-4.3.6.pom
2017-07-09T06:05:44.686 [INFO] Downloaded: https://repo.maven.apache.org/maven2/org/apache/httpcomponents/httpcomponents-client/4.3.6/httpcomponents-client-4.3.6.pom
(16 KB at 622.9 KB/sec)
2017-07-09T06:05:44.688 [INFO] Downloading: https://repo.maven.apache.org/maven2/org/apache/httpcomponents/project/7/project-7.pom
2017-07-09T06:05:44.714 [INFO] Downloaded: https://repo.maven.apache.org/maven2/org/apache/httpcomponents/project/7/project-7.pom
(27 KB at 1023.2 KB/sec)
2017-07-09T06:05:44.718 [INFO] Downloading: https://repo.maven.apache.org/maven2/org/apache/httpcomponents/httpcore/4.3.3/httpcore-4.3.3.pom
2017-07-09T06:05:44.743 [INFO] Downloaded: https://repo.maven.apache.org/maven2/org/apache/httpcomponents/httpcore/4.3.3/httpcore-4.3.3.pom
(5 KB at 187.1 KB/sec)
2017-07-09T06:05:44.744 [INFO] Downloading: https://repo.maven.apache.org/maven2/org/apache/httpcomponents/httpcomponents-core/4.3.3/httpcomponents-core-4.3.3.pom
2017-07-09T06:05:44.770 [INFO] Downloaded: https://repo.maven.apache.org/maven2/org/apache/httpcomponents/httpcomponents-core/4.3.3/httpcomponents-core-4.3.3.pom
(13 KB at 495.3 KB/sec)
2017-07-09T06:05:44.775 [INFO] Downloading: https://repo.maven.apache.org/maven2/com/sun/jersey/contribs/jersey-apache-client4/1.9/jersey-apache-client4-1.9.pom
2017-07-09T06:05:44.802 [INFO] Downloaded: https://repo.maven.apache.org/maven2/com/sun/jersey/contribs/jersey-apache-client4/1.9/jersey-apache-client4-1.9.pom
(7 KB at 224.6 KB/sec)
2017-07-09T06:05:44.804 [INFO] Downloading: https://repo.maven.apache.org/maven2/com/sun/jersey/contribs/jersey-contribs/1.9/jersey-contribs-1.9.pom
2017-07-09T06:05:44.830 [INFO] Downloaded: https://repo.maven.apache.org/maven2/com/sun/jersey/contribs/jersey-contribs/1.9/jersey-contribs-1.9.pom
(5 KB at 156.1 KB/sec)
2017-07-09T06:05:44.833 [INFO] Downloading: https://repo.maven.apache.org/maven2/org/apache/httpcomponents/httpclient/4.1.1/httpclient-4.1.1.pom
2017-07-09T06:05:44.859 [INFO] Downloaded: https://repo.maven.apache.org/maven2/org/apache/httpcomponents/httpclient/4.1.1/httpclient-4.1.1.pom
(6 KB at 225.0 KB/sec)
2017-07-09T06:05:44.861 [INFO] Downloading: https://repo.maven.apache.org/maven2/org/apache/httpcomponents/httpcomponents-client/4.1.1/httpcomponents-client-4.1.1.pom
2017-07-09T06:05:44.890 [INFO] Downloaded: https://repo.maven.apache.org/maven2/org/apache/httpcomponents/httpcomponents-client/4.1.1/httpcomponents-client-4.1.1.pom
(12 KB at 381.8 KB/sec)
2017-07-09T06:05:44.893 [INFO] Downloading: https://repo.maven.apache.org/maven2/org/apache/httpcomponents/project/4.1.1/project-4.1.1.pom
2017-07-09T06:05:44.920 [INFO] Downloaded: https://repo.maven.apache.org/maven2/org/apache/httpcomponents/project/4.1.1/project-4.1.1.pom
(17 KB at 606.5 KB/sec)
2017-07-09T06:05:44.924 [INFO] Downloading: https://repo.maven.apache.org/maven2/org/apache/httpcomponents/httpcore/4.1/httpcore-4.1.pom
2017-07-09T06:05:44.951 [INFO] Downloaded: https://repo.maven.apache.org/maven2/org/apache/httpcomponents/httpcore/4.1/httpcore-4.1.pom
(9 KB at 302.3 KB/sec)
2017-07-09T06:05:44.954 [INFO] Downloading: https://repo.maven.apache.org/maven2/org/apache/httpcomponents/httpcomponents-core/4.1/httpcomponents-core-4.1.pom
2017-07-09T06:05:44.981 [INFO] Downloaded: https://repo.maven.apache.org/maven2/org/apache/httpcomponents/httpcomponents-core/4.1/httpcomponents-core-4.1.pom
(9 KB at 327.0 KB/sec)
2017-07-09T06:05:44.985 [INFO] Downloading: https://repo.maven.apache.org/maven2/org/apache/hadoop/hadoop-yarn-client/2.6.0/hadoop-yarn-client-2.6.0.pom
2017-07-09T06:05:45.012 [INFO] Downloaded: https://repo.maven.apache.org/maven2/org/apache/hadoop/hadoop-yarn-client/2.6.0/hadoop-yarn-client-2.6.0.pom
(7 KB at 228.7 KB/sec)
2017-07-09T06:05:45.015 [INFO] Downloading: https://repo.maven.apache.org/maven2/org/apache/hadoop/hadoop-yarn/2.6.0/hadoop-yarn-2.6.0.pom
2017-07-09T06:05:45.040 [INFO] Downloaded: https://repo.maven.apache.org/maven2/org/apache/hadoop/hadoop-yarn/2.6.0/hadoop-yarn-2.6.0.pom
(4 KB at 139.7 KB/sec)
2017-07-09T06:05:45.042 [INFO] Downloading: https://repo.maven.apache.org/maven2/org/apache/hadoop/hadoop-project/2.6.0/hadoop-project-2.6.0.pom
2017-07-09T06:05:45.072 [INFO] Downloaded: https://repo.maven.apache.org/maven2/org/apache/hadoop/hadoop-project/2.6.0/hadoop-project-2.6.0.pom
(43 KB at 1411.6 KB/sec)
2017-07-09T06:05:45.076 [INFO] Downloading: https://repo.maven.apache.org/maven2/org/apache/hadoop/hadoop-main/2.6.0/hadoop-main-2.6.0.pom
2017-07-09T06:05:45.103 [INFO] Downloaded: https://repo.maven.apache.org/maven2/org/apache/hadoop/hadoop-main/2.6.0/hadoop-main-2.6.0.pom
(18 KB at 654.0 KB/sec)
2017-07-09T06:05:45.109 [INFO] Downloading: https://repo.maven.apache.org/maven2/org/apache/hadoop/hadoop-annotations/2.6.0/hadoop-annotations-2.6.0.pom
2017-07-09T06:05:45.135 [INFO] Downloaded: https://repo.maven.apache.org/maven2/org/apache/hadoop/hadoop-annotations/2.6.0/hadoop-annotations-2.6.0.pom
(3 KB at 89.7 KB/sec)
2017-07-09T06:05:45.140 [INFO] Downloading: https://repo.maven.apache.org/maven2/org/apache/hadoop/hadoop-yarn-api/2.6.0/hadoop-yarn-api-2.6.0.pom
2017-07-09T06:05:45.165 [INFO] Downloaded: https://repo.maven.apache.org/maven2/org/apache/hadoop/hadoop-yarn-api/2.6.0/hadoop-yarn-api-2.6.0.pom
(5 KB at 180.2 KB/sec)
2017-07-09T06:05:45.171 [INFO] Downloading: https://repo.maven.apache.org/maven2/org/apache/hadoop/hadoop-yarn-common/2.6.0/hadoop-yarn-common-2.6.0.pom
2017-07-09T06:05:45.198 [INFO] Downloaded: https://repo.maven.apache.org/maven2/org/apache/hadoop/hadoop-yarn-common/2.6.0/hadoop-yarn-common-2.6.0.pom
(11 KB at 379.7 KB/sec)
2017-07-09T06:05:45.204 [INFO] Downloading: https://repo.maven.apache.org/maven2/com/google/inject/extensions/guice-servlet/3.0/guice-servlet-3.0.pom
2017-07-09T06:05:45.230 [INFO] Downloaded: https://repo.maven.apache.org/maven2/com/google/inject/extensions/guice-servlet/3.0/guice-servlet-3.0.pom
(915 B at 34.4 KB/sec)
2017-07-09T06:05:45.232 [INFO] Downloading: https://repo.maven.apache.org/maven2/com/google/inject/extensions/extensions-parent/3.0/extensions-parent-3.0.pom
2017-07-09T06:05:45.257 [INFO] Downloaded: https://repo.maven.apache.org/maven2/com/google/inject/extensions/extensions-parent/3.0/extensions-parent-3.0.pom
(4 KB at 140.8 KB/sec)
2017-07-09T06:05:45.259 [INFO] Downloading: https://repo.maven.apache.org/maven2/com/google/inject/guice-parent/3.0/guice-parent-3.0.pom
2017-07-09T06:05:45.287 [INFO] Downloaded: https://repo.maven.apache.org/maven2/com/google/inject/guice-parent/3.0/guice-parent-3.0.pom
(13 KB at 452.5 KB/sec)
2017-07-09T06:05:45.289 [INFO] Downloading: https://repo.maven.apache.org/maven2/com/google/google/5/google-5.pom
2017-07-09T06:05:45.316 [INFO] Downloaded: https://repo.maven.apache.org/maven2/com/google/google/5/google-5.pom
(3 KB at 88.9 KB/sec)
2017-07-09T06:05:45.319 [INFO] Downloading: https://repo.maven.apache.org/maven2/com/google/inject/guice/3.0/guice-3.0.pom
2017-07-09T06:05:45.346 [INFO] Downloaded: https://repo.maven.apache.org/maven2/com/google/inject/guice/3.0/guice-3.0.pom
(8 KB at 263.4 KB/sec)
2017-07-09T06:05:45.350 [INFO] Downloading: https://repo.maven.apache.org/maven2/com/sun/jersey/jersey-server/1.9/jersey-server-1.9.pom
2017-07-09T06:05:45.377 [INFO] Downloaded: https://repo.maven.apache.org/maven2/com/sun/jersey/jersey-server/1.9/jersey-server-1.9.pom
(12 KB at 418.1 KB/sec)
2017-07-09T06:05:45.381 [INFO] Downloading: https://repo.maven.apache.org/maven2/asm/asm/3.1/asm-3.1.pom
2017-07-09T06:05:45.407 [INFO] Downloaded: https://repo.maven.apache.org/maven2/asm/asm/3.1/asm-3.1.pom
(278 B at 10.4 KB/sec)
2017-07-09T06:05:45.409 [INFO] Downloading: https://repo.maven.apache.org/maven2/asm/asm-parent/3.1/asm-parent-3.1.pom
2017-07-09T06:05:45.434 [INFO] Downloaded: https://repo.maven.apache.org/maven2/asm/asm-parent/3.1/asm-parent-3.1.pom
(5 KB at 162.2 KB/sec)
2017-07-09T06:05:45.436 [INFO] Downloading: https://repo.maven.apache.org/maven2/com/sun/jersey/contribs/jersey-guice/1.9/jersey-guice-1.9.pom
2017-07-09T06:05:45.462 [INFO] Downloaded: https://repo.maven.apache.org/maven2/com/sun/jersey/contribs/jersey-guice/1.9/jersey-guice-1.9.pom
(8 KB at 280.8 KB/sec)
2017-07-09T06:05:45.464 [INFO] Downloading: https://repo.maven.apache.org/maven2/jline/jline/2.11/jline-2.11.pom
2017-07-09T06:05:45.491 [INFO] Downloaded: https://repo.maven.apache.org/maven2/jline/jline/2.11/jline-2.11.pom
(17 KB at 610.1 KB/sec)
2017-07-09T06:05:45.494 [INFO] Downloading: https://repo.maven.apache.org/maven2/org/apache/ant/ant/1.9.2/ant-1.9.2.pom
2017-07-09T06:05:45.521 [INFO] Downloaded: https://repo.maven.apache.org/maven2/org/apache/ant/ant/1.9.2/ant-1.9.2.pom
(10 KB at 342.4 KB/sec)
2017-07-09T06:05:45.523 [INFO] Downloading: https://repo.maven.apache.org/maven2/org/apache/ant/ant-parent/1.9.2/ant-parent-1.9.2.pom
2017-07-09T06:05:45.550 [INFO] Downloaded: https://repo.maven.apache.org/maven2/org/apache/ant/ant-parent/1.9.2/ant-parent-1.9.2.pom
(6 KB at 202.7 KB/sec)
2017-07-09T06:05:45.553 [INFO] Downloading: https://repo.maven.apache.org/maven2/org/apache/ant/ant-launcher/1.9.2/ant-launcher-1.9.2.pom
2017-07-09T06:05:45.579 [INFO] Downloaded: https://repo.maven.apache.org/maven2/org/apache/ant/ant-launcher/1.9.2/ant-launcher-1.9.2.pom
(3 KB at 87.7 KB/sec)
2017-07-09T06:05:45.582 [INFO] Downloading: https://repo.maven.apache.org/maven2/net/engio/mbassador/1.1.9/mbassador-1.1.9.pom
2017-07-09T06:05:45.609 [INFO] Downloaded: https://repo.maven.apache.org/maven2/net/engio/mbassador/1.1.9/mbassador-1.1.9.pom
(9 KB at 302.3 KB/sec)
2017-07-09T06:05:45.611 [INFO] Downloading: https://repo.maven.apache.org/maven2/net/lingala/zip4j/zip4j/1.3.2/zip4j-1.3.2.pom
2017-07-09T06:05:45.636 [INFO] Downloaded: https://repo.maven.apache.org/maven2/net/lingala/zip4j/zip4j/1.3.2/zip4j-1.3.2.pom
(922 B at 36.0 KB/sec)
2017-07-09T06:05:45.638 [INFO] Downloading: https://repo.maven.apache.org/maven2/commons-codec/commons-codec/1.10/commons-codec-1.10.pom
2017-07-09T06:05:45.664 [INFO] Downloaded: https://repo.maven.apache.org/maven2/commons-codec/commons-codec/1.10/commons-codec-1.10.pom
(12 KB at 436.0 KB/sec)
2017-07-09T06:05:45.665 [INFO] Downloading: https://repo.maven.apache.org/maven2/org/apache/commons/commons-parent/35/commons-parent-35.pom
2017-07-09T06:05:45.694 [INFO] Downloaded: https://repo.maven.apache.org/maven2/org/apache/commons/commons-parent/35/commons-parent-35.pom
(57 KB at 1945.4 KB/sec)
2017-07-09T06:05:45.700 [INFO] Downloading: https://repo.maven.apache.org/maven2/org/apache/xbean/xbean-asm5-shaded/4.3/xbean-asm5-shaded-4.3.pom
2017-07-09T06:05:45.726 [INFO] Downloaded: https://repo.maven.apache.org/maven2/org/apache/xbean/xbean-asm5-shaded/4.3/xbean-asm5-shaded-4.3.pom
(4 KB at 125.8 KB/sec)
2017-07-09T06:05:45.727 [INFO] Downloading: https://repo.maven.apache.org/maven2/org/apache/xbean/xbean/4.3/xbean-4.3.pom
2017-07-09T06:05:45.755 [INFO] Downloaded: https://repo.maven.apache.org/maven2/org/apache/xbean/xbean/4.3/xbean-4.3.pom
(18 KB at 616.9 KB/sec)
2017-07-09T06:05:45.757 [INFO] Downloading: https://repo.maven.apache.org/maven2/org/apache/geronimo/genesis/genesis-java5-flava/2.1/genesis-java5-flava-2.1.pom
2017-07-09T06:05:45.783 [INFO] Downloaded: https://repo.maven.apache.org/maven2/org/apache/geronimo/genesis/genesis-java5-flava/2.1/genesis-java5-flava-2.1.pom
(6 KB at 206.0 KB/sec)
2017-07-09T06:05:45.785 [INFO] Downloading: https://repo.maven.apache.org/maven2/org/apache/geronimo/genesis/genesis-default-flava/2.1/genesis-default-flava-2.1.pom
2017-07-09T06:05:45.813 [INFO] Downloaded: https://repo.maven.apache.org/maven2/org/apache/geronimo/genesis/genesis-default-flava/2.1/genesis-default-flava-2.1.pom
(16 KB at 560.2 KB/sec)
2017-07-09T06:05:45.816 [INFO] Downloading: https://repo.maven.apache.org/maven2/org/apache/geronimo/genesis/genesis/2.1/genesis-2.1.pom
2017-07-09T06:05:45.843 [INFO] Downloaded: https://repo.maven.apache.org/maven2/org/apache/geronimo/genesis/genesis/2.1/genesis-2.1.pom
(14 KB at 515.7 KB/sec)
2017-07-09T06:05:45.848 [INFO] Downloading: https://repo.maven.apache.org/maven2/org/jctools/jctools-core/1.1/jctools-core-1.1.pom
2017-07-09T06:05:45.875 [INFO] Downloaded: https://repo.maven.apache.org/maven2/org/jctools/jctools-core/1.1/jctools-core-1.1.pom
(3 KB at 104.2 KB/sec)
[JENKINS] Archiving disabled
[JENKINS] Archiving disabled
[JENKINS] Archiving disabled
[JENKINS] Archiving disabled
[JENKINS] Archiving disabled
[JENKINS] Archiving disabled
[JENKINS] Archiving disabled
[JENKINS] Archiving disabled
[JENKINS] Archiving disabled
[JENKINS] Archiving disabled
[JENKINS] Archiving disabled
[JENKINS] Archiving disabled
2017-07-09T06:05:49.875 [INFO] ------------------------------------------------------------------------
2017-07-09T06:05:49.875 [INFO] Reactor Summary:
2017-07-09T06:05:49.875 [INFO] 
2017-07-09T06:05:49.875 [INFO] Apache Beam :: Parent .............................. SUCCESS
[ 23.787 s]
2017-07-09T06:05:49.875 [INFO] Apache Beam :: SDKs :: Java :: Build Tools ......... SUCCESS
[  9.958 s]
2017-07-09T06:05:49.875 [INFO] Apache Beam :: SDKs ................................ SUCCESS
[  1.545 s]
2017-07-09T06:05:49.875 [INFO] Apache Beam :: SDKs :: Common ...................... SUCCESS
[  1.205 s]
2017-07-09T06:05:49.875 [INFO] Apache Beam :: SDKs :: Common :: Runner API ........ SUCCESS
[ 13.403 s]
2017-07-09T06:05:49.875 [INFO] Apache Beam :: SDKs :: Common :: Fn API ............ SUCCESS
[  8.096 s]
2017-07-09T06:05:49.875 [INFO] Apache Beam :: SDKs :: Java ........................ SUCCESS
[  1.323 s]
2017-07-09T06:05:49.875 [INFO] Apache Beam :: SDKs :: Java :: Core ................ SUCCESS
[02:02 min]
2017-07-09T06:05:49.875 [INFO] Apache Beam :: Runners ............................. SUCCESS
[  1.585 s]
2017-07-09T06:05:49.875 [INFO] Apache Beam :: Runners :: Core Construction Java ... SUCCESS
[ 12.322 s]
2017-07-09T06:05:49.875 [INFO] Apache Beam :: Runners :: Core Java ................ SUCCESS
[ 30.231 s]
2017-07-09T06:05:49.876 [INFO] Apache Beam :: Runners :: Apex ..................... FAILURE
[  5.315 s]
2017-07-09T06:05:49.876 [INFO] ------------------------------------------------------------------------
2017-07-09T06:05:49.876 [INFO] BUILD FAILURE
2017-07-09T06:05:49.876 [INFO] ------------------------------------------------------------------------
2017-07-09T06:05:49.876 [INFO] Total time: 04:30 min
2017-07-09T06:05:49.876 [INFO] Finished at: 2017-07-09T06:05:49+00:00
[JENKINS] Archiving disabled
2017-07-09T06:05:51.078 [INFO] Final Memory: 120M/1490M
2017-07-09T06:05:51.079 [INFO] ------------------------------------------------------------------------
2017-07-09T06:05:51.079 [WARNING] The requested profile "validates-runner-tests" could not
be activated because it does not exist.
Waiting for Jenkins to finish collecting data
2017-07-09T06:05:55.956 [ERROR] Failed to execute goal on project beam-runners-apex: Could
not resolve dependencies for project org.apache.beam:beam-runners-apex:jar:2.2.0-SNAPSHOT:
Failed to collect dependencies at org.apache.apex:apex-common:jar:3.6.0: Failed to read artifact
descriptor for org.apache.apex:apex-common:jar:3.6.0: Could not transfer artifact org.apache.apex:apex-common:pom:3.6.0
from/to central (https://repo.maven.apache.org/maven2): Connection reset -> [Help 1]
2017-07-09T06:05:55.957 [ERROR] 
2017-07-09T06:05:55.957 [ERROR] To see the full stack trace of the errors, re-run Maven with
the -e switch.
2017-07-09T06:05:55.957 [ERROR] Re-run Maven using the -X switch to enable full debug logging.
2017-07-09T06:05:55.957 [ERROR] 
2017-07-09T06:05:55.957 [ERROR] For more information about the errors and possible solutions,
please read the following articles:
2017-07-09T06:05:55.958 [ERROR] [Help 1] http://cwiki.apache.org/confluence/display/MAVEN/DependencyResolutionException
2017-07-09T06:05:55.958 [ERROR] 
2017-07-09T06:05:55.958 [ERROR] After correcting the problems, you can resume the build with
the command
2017-07-09T06:05:55.958 [ERROR]   mvn <goals> -rf :beam-runners-apex
channel stopped

Mime
View raw message