beam-commits mailing list archives

Site index · List index
Message view « Date » · « Thread »
Top « Date » · « Thread »
From Apache Jenkins Server <jenk...@builds.apache.org>
Subject Build failed in Jenkins: beam_PostCommit_Java_ValidatesRunner_Gearpump #177
Date Mon, 10 Jul 2017 05:59:23 GMT
See <https://builds.apache.org/job/beam_PostCommit_Java_ValidatesRunner_Gearpump/177/display/redirect?page=changes>

Changes:

[lcwik] Properly convert milliseconds whether there's less than 3/more than 9

[klk] Add support for PipelineOptions parameters

[klk] Fix DoFn javadoc: StateSpec does not require a key

[jbonofre] Make modules that depend on Hadoop and Spark use the same version

[jbonofre] [BEAM-2530] Fix compilation of modules with Java 9 that depend on

[altay] For GCS operations use an http client with a default timeout value.

[jbonofre] [maven-release-plugin] prepare branch release-2.1.0

[jbonofre] [maven-release-plugin] prepare for next development iteration

[jbonofre] Update Python SDK version

[tgroh] Website Mergebot Job

[lcwik] [BEAM-2553] Update Maven exec plugin to 1.6.0 to incorporate messaging

[tgroh] Disallow Combiner Lifting for multi-window WindowFns

[altay] Update SDK dependencies

[altay] Fix PValue input in _PubSubReadEvaluator

[lzljs3620320] [BEAM-2534] Handle offset gaps in Kafka messages.

[klk] Add timeout to initialization of partition in KafkaIO

[klk] Ignore processing time timers in expired windows

[klk] Process timer firings for a window together

[klk] Made DataflowRunner TransformTranslator public

[klk] Fix bad merge

[klk] Simplified ByteBuddyOnTimerInvokerFactory

[jbonofre] Fix javadoc generation for AmqpIO, CassandraIO and HCatalogIO

[owenzhang1990] Upgrade to gearpump 0.8.4

[owenzhang1990] Fix ParDoTest#testPipelineOptionsParameter

------------------------------------------
[...truncated 856.91 KB...]
2017-07-10T04:55:12.036 [INFO] Running org.apache.beam.sdk.values.PCollectionTupleTest
2017-07-10T04:55:25.673 [INFO] Tests run: 1, Failures: 0, Errors: 0, Skipped: 0, Time elapsed:
13.626 s - in org.apache.beam.sdk.values.PCollectionTupleTest
2017-07-10T04:55:25.673 [INFO] Running org.apache.beam.sdk.PipelineTest
2017-07-10T04:55:33.457 [INFO] Tests run: 4, Failures: 0, Errors: 0, Skipped: 0, Time elapsed:
7.781 s - in org.apache.beam.sdk.PipelineTest
2017-07-10T04:55:33.457 [INFO] Running org.apache.beam.sdk.io.ReadTest
2017-07-10T04:55:33.634 [INFO] Tests run: 2, Failures: 0, Errors: 0, Skipped: 0, Time elapsed:
0.172 s - in org.apache.beam.sdk.io.ReadTest
2017-07-10T04:55:33.634 [INFO] Running org.apache.beam.sdk.testing.PAssertTest
2017-07-10T04:57:04.841 [ERROR] Tests run: 17, Failures: 0, Errors: 1, Skipped: 0, Time elapsed:
91.055 s <<< FAILURE! - in org.apache.beam.sdk.testing.PAssertTest
2017-07-10T04:57:04.841 [ERROR] testGlobalWindowContainsInAnyOrder(org.apache.beam.sdk.testing.PAssertTest)
 Time elapsed: 1.443 s  <<< ERROR!
org.apache.gearpump.serializer.FastKryoSerializer$KryoSerializationException: 

 Class is not registered: org.apache.beam.sdk.util.WindowedValue$ValueInGlobalWindow
Note: To register this class use: kryo.register(org.apache.beam.sdk.util.WindowedValue$ValueInGlobalWindow.class);
You can also register the class by providing a configuration with serializer
defined,

gearpump{
  serializers {
    ## Follow this format when adding new serializer for new message types
    #    "yourpackage.YourClass" = "yourpackage.YourSerializerForThisClass"

    ## If you intend to use default serializer for this class, then you can write this
    #    "yourpackage.YourClass" = ""
  }
}

If you want to register the serializer globally, you need to change
gear.conf on every worker in the cluster; if you only want to register
the serializer for a single streaming application, you need to create
a file under conf/ named application.conf, and add the above configuration
into application.conf. To verify whether the configuration is effective,
you can browser your UI http://{UI Server Host}:8090/api/v1.0/app/{appId}/config,
and check whether your custom serializer is added.
        
	at org.apache.gearpump.serializer.FastKryoSerializer.serialize(FastKryoSerializer.scala:71)
	at org.apache.gearpump.streaming.task.ExpressTransport$$anonfun$transport$1.apply(ExpressTransport.scala:57)
	at org.apache.gearpump.streaming.task.ExpressTransport$$anonfun$transport$1.apply(ExpressTransport.scala:48)
	at scala.collection.IndexedSeqOptimized$class.foreach(IndexedSeqOptimized.scala:33)
	at scala.collection.mutable.WrappedArray.foreach(WrappedArray.scala:35)
	at org.apache.gearpump.streaming.task.ExpressTransport$class.transport(ExpressTransport.scala:48)
	at org.apache.gearpump.streaming.task.TaskActor.transport(TaskActor.scala:47)
	at org.apache.gearpump.streaming.task.Subscription.sendMessage(Subscription.scala:113)
	at org.apache.gearpump.streaming.task.Subscription$$anonfun$3.apply(Subscription.scala:76)
	at org.apache.gearpump.streaming.task.Subscription$$anonfun$3.apply(Subscription.scala:74)
	at org.apache.gearpump.streaming.task.Subscription.sendMessage(Subscription.scala:95)
	at org.apache.gearpump.streaming.task.TaskActor.output(TaskActor.scala:132)
	at org.apache.gearpump.streaming.task.TaskWrapper.output(TaskWrapper.scala:60)
	at org.apache.gearpump.streaming.task.TaskUtil$$anonfun$trigger$1.apply(TaskUtil.scala:44)
	at org.apache.gearpump.streaming.task.TaskUtil$$anonfun$trigger$1.apply(TaskUtil.scala:43)
	at scala.collection.mutable.ResizableArray$class.foreach(ResizableArray.scala:59)
	at scala.collection.mutable.ArrayBuffer.foreach(ArrayBuffer.scala:48)
	at org.apache.gearpump.streaming.task.TaskUtil$.trigger(TaskUtil.scala:43)
	at org.apache.gearpump.streaming.source.DataSourceTask.onWatermarkProgress(DataSourceTask.scala:76)
	at org.apache.gearpump.streaming.task.TaskWrapper.onWatermarkProgress(TaskWrapper.scala:140)
	at org.apache.gearpump.streaming.task.TaskActor.org$apache$gearpump$streaming$task$TaskActor$$onUpstreamMinClock(TaskActor.scala:330)
	at org.apache.gearpump.streaming.task.TaskActor$$anonfun$handleMessages$1.applyOrElse(TaskActor.scala:183)
	at akka.actor.Actor$class.aroundReceive(Actor.scala:496)
	at org.apache.gearpump.streaming.task.TaskActor.aroundReceive(TaskActor.scala:47)
	at akka.actor.ActorCell.receiveMessage(ActorCell.scala:526)
	at akka.actor.ActorCell.invoke(ActorCell.scala:495)
	at akka.dispatch.Mailbox.processMailbox(Mailbox.scala:257)
	at akka.dispatch.Mailbox.run(Mailbox.scala:224)
	at akka.dispatch.Mailbox.exec(Mailbox.scala:234)
	at scala.concurrent.forkjoin.ForkJoinTask.doExec(ForkJoinTask.java:260)
	at scala.concurrent.forkjoin.ForkJoinPool$WorkQueue.runTask(ForkJoinPool.java:1339)
	at scala.concurrent.forkjoin.ForkJoinPool.runWorker(ForkJoinPool.java:1979)
	at scala.concurrent.forkjoin.ForkJoinWorkerThread.run(ForkJoinWorkerThread.java:107)
Caused by: java.lang.IllegalArgumentException: Class is not registered: org.apache.beam.sdk.util.WindowedValue$ValueInGlobalWindow
Note: To register this class use: kryo.register(org.apache.beam.sdk.util.WindowedValue$ValueInGlobalWindow.class);
	at org.apache.gearpump.com.esotericsoftware.kryo.Kryo.getRegistration(Kryo.java:488)
	at org.apache.gearpump.com.esotericsoftware.kryo.util.DefaultClassResolver.writeClass(DefaultClassResolver.java:97)
	at org.apache.gearpump.com.esotericsoftware.kryo.Kryo.writeClass(Kryo.java:517)
	at org.apache.gearpump.com.esotericsoftware.kryo.Kryo.writeClassAndObject(Kryo.java:622)
	at org.apache.gearpump.com.romix.akka.serialization.kryo.KryoBasedSerializer.toBinary(KryoSerializer.scala:467)
	at org.apache.gearpump.serializer.FastKryoSerializer.serialize(FastKryoSerializer.scala:42)
	... 32 more

2017-07-10T04:57:04.841 [INFO] Running org.apache.beam.sdk.transforms.SampleTest$PickAnyTest
2017-07-10T04:57:35.140 [INFO] Tests run: 8, Failures: 0, Errors: 0, Skipped: 0, Time elapsed:
30.297 s - in org.apache.beam.sdk.transforms.SampleTest$PickAnyTest
2017-07-10T04:57:35.141 [INFO] Running org.apache.beam.sdk.transforms.SampleTest$MiscTest
2017-07-10T04:58:09.070 [INFO] Tests run: 5, Failures: 0, Errors: 0, Skipped: 0, Time elapsed:
33.927 s - in org.apache.beam.sdk.transforms.SampleTest$MiscTest
2017-07-10T04:58:09.070 [INFO] Running org.apache.beam.sdk.transforms.CountTest
2017-07-10T04:58:27.917 [INFO] Tests run: 4, Failures: 0, Errors: 0, Skipped: 0, Time elapsed:
18.845 s - in org.apache.beam.sdk.transforms.CountTest
2017-07-10T04:58:27.917 [INFO] Running org.apache.beam.sdk.transforms.ViewTest
2017-07-10T05:01:16.316 [INFO] Tests run: 34, Failures: 0, Errors: 0, Skipped: 0, Time elapsed:
168.394 s - in org.apache.beam.sdk.transforms.ViewTest
2017-07-10T05:01:16.316 [INFO] Running org.apache.beam.sdk.transforms.ParDoLifecycleTest
2017-07-10T05:01:18.136 [INFO] Tests run: 4, Failures: 0, Errors: 0, Skipped: 0, Time elapsed:
1.818 s - in org.apache.beam.sdk.transforms.ParDoLifecycleTest
2017-07-10T05:01:18.136 [INFO] Running org.apache.beam.sdk.io.GenerateSequenceTest
2017-07-10T05:14:40.706 [INFO] Tests run: 5, Failures: 0, Errors: 0, Skipped: 0, Time elapsed:
802.568 s - in org.apache.beam.sdk.io.GenerateSequenceTest
2017-07-10T05:14:40.706 [INFO] Running org.apache.beam.sdk.io.BoundedReadFromUnboundedSourceTest
2017-07-10T05:14:50.656 [INFO] Tests run: 3, Failures: 0, Errors: 0, Skipped: 0, Time elapsed:
9.948 s - in org.apache.beam.sdk.io.BoundedReadFromUnboundedSourceTest
2017-07-10T05:14:50.656 [INFO] Running org.apache.beam.sdk.io.TextIOTest
2017-07-10T05:14:50.702 [INFO] Tests run: 1, Failures: 0, Errors: 0, Skipped: 0, Time elapsed:
0.044 s - in org.apache.beam.sdk.io.TextIOTest
2017-07-10T05:14:50.702 [INFO] Running org.apache.beam.sdk.testing.TestPipelineTest$TestPipelineEnforcementsTest$WithRealPipelineRunner
2017-07-10T05:14:54.910 [INFO] Tests run: 7, Failures: 0, Errors: 0, Skipped: 0, Time elapsed:
4.205 s - in org.apache.beam.sdk.testing.TestPipelineTest$TestPipelineEnforcementsTest$WithRealPipelineRunner
2017-07-10T05:14:54.910 [INFO] Running org.apache.beam.sdk.transforms.FlattenTest
2017-07-10T05:15:23.436 [INFO] Tests run: 12, Failures: 0, Errors: 0, Skipped: 0, Time elapsed:
28.521 s - in org.apache.beam.sdk.transforms.FlattenTest
2017-07-10T05:15:23.436 [INFO] Running org.apache.beam.sdk.transforms.ToStringTest
2017-07-10T05:15:32.753 [INFO] Tests run: 5, Failures: 0, Errors: 0, Skipped: 0, Time elapsed:
9.314 s - in org.apache.beam.sdk.transforms.ToStringTest
2017-07-10T05:15:32.753 [INFO] Running org.apache.beam.sdk.transforms.ReshuffleTest
2017-07-10T05:15:58.389 [INFO] Tests run: 7, Failures: 0, Errors: 0, Skipped: 0, Time elapsed:
25.632 s - in org.apache.beam.sdk.transforms.ReshuffleTest
2017-07-10T05:15:58.389 [INFO] Running org.apache.beam.sdk.transforms.MapElementsTest
2017-07-10T05:15:58.422 [INFO] Tests run: 1, Failures: 0, Errors: 0, Skipped: 0, Time elapsed:
0.031 s - in org.apache.beam.sdk.transforms.MapElementsTest
2017-07-10T05:15:58.426 [INFO] Running org.apache.beam.sdk.transforms.WithTimestampsTest
2017-07-10T05:16:11.049 [INFO] Tests run: 3, Failures: 0, Errors: 0, Skipped: 0, Time elapsed:
12.621 s - in org.apache.beam.sdk.transforms.WithTimestampsTest
2017-07-10T05:16:11.050 [INFO] Running org.apache.beam.sdk.transforms.ApproximateUniqueTest$ApproximateUniqueMiscTest
2017-07-10T05:16:23.286 [INFO] Tests run: 1, Failures: 0, Errors: 0, Skipped: 0, Time elapsed:
12.234 s - in org.apache.beam.sdk.transforms.ApproximateUniqueTest$ApproximateUniqueMiscTest
2017-07-10T05:16:23.286 [INFO] Running org.apache.beam.sdk.transforms.FilterTest
2017-07-10T05:16:39.094 [INFO] Tests run: 8, Failures: 0, Errors: 0, Skipped: 0, Time elapsed:
15.806 s - in org.apache.beam.sdk.transforms.FilterTest
2017-07-10T05:16:39.094 [INFO] Running org.apache.beam.sdk.transforms.windowing.WindowTest
2017-07-10T05:17:01.953 [INFO] Tests run: 4, Failures: 0, Errors: 0, Skipped: 0, Time elapsed:
22.857 s - in org.apache.beam.sdk.transforms.windowing.WindowTest
2017-07-10T05:17:01.953 [INFO] Running org.apache.beam.sdk.transforms.ValuesTest
2017-07-10T05:17:05.816 [INFO] Tests run: 2, Failures: 0, Errors: 0, Skipped: 0, Time elapsed:
3.86 s - in org.apache.beam.sdk.transforms.ValuesTest
2017-07-10T05:17:05.816 [INFO] Running org.apache.beam.sdk.transforms.PartitionTest
2017-07-10T05:17:11.234 [INFO] Tests run: 1, Failures: 0, Errors: 0, Skipped: 0, Time elapsed:
5.416 s - in org.apache.beam.sdk.transforms.PartitionTest
2017-07-10T05:17:11.234 [INFO] Running org.apache.beam.sdk.transforms.ReifyTimestampsTest
2017-07-10T05:17:17.967 [INFO] Tests run: 3, Failures: 0, Errors: 0, Skipped: 0, Time elapsed:
6.73 s - in org.apache.beam.sdk.transforms.ReifyTimestampsTest
2017-07-10T05:17:17.967 [INFO] Running org.apache.beam.sdk.transforms.DistinctTest
2017-07-10T05:17:26.713 [INFO] Tests run: 3, Failures: 0, Errors: 0, Skipped: 0, Time elapsed:
8.743 s - in org.apache.beam.sdk.transforms.DistinctTest
2017-07-10T05:17:26.713 [INFO] Running org.apache.beam.sdk.transforms.KvSwapTest
2017-07-10T05:17:30.744 [INFO] Tests run: 2, Failures: 0, Errors: 0, Skipped: 0, Time elapsed:
4.028 s - in org.apache.beam.sdk.transforms.KvSwapTest
2017-07-10T05:17:30.744 [INFO] Running org.apache.beam.sdk.values.PDoneTest
2017-07-10T05:17:30.750 [WARNING] Tests run: 1, Failures: 0, Errors: 0, Skipped: 1, Time elapsed:
0.004 s - in org.apache.beam.sdk.values.PDoneTest
2017-07-10T05:17:30.750 [INFO] Running org.apache.beam.sdk.io.CountingSourceTest
2017-07-10T05:42:53.797 [INFO] Tests run: 6, Failures: 0, Errors: 0, Skipped: 0, Time elapsed:
1,523.045 s - in org.apache.beam.sdk.io.CountingSourceTest
2017-07-10T05:42:53.797 [INFO] Running org.apache.beam.sdk.io.AvroIOTest
2017-07-10T05:42:53.848 [INFO] Tests run: 1, Failures: 0, Errors: 0, Skipped: 0, Time elapsed:
0.049 s - in org.apache.beam.sdk.io.AvroIOTest
2017-07-10T05:42:53.848 [INFO] Running org.apache.beam.sdk.transforms.join.CoGroupByKeyTest
2017-07-10T05:43:12.486 [INFO] Tests run: 4, Failures: 0, Errors: 0, Skipped: 0, Time elapsed:
18.635 s - in org.apache.beam.sdk.transforms.join.CoGroupByKeyTest
2017-07-10T05:43:12.486 [INFO] Running org.apache.beam.sdk.transforms.CreateTest
2017-07-10T05:43:26.836 [INFO] Tests run: 8, Failures: 0, Errors: 0, Skipped: 0, Time elapsed:
14.348 s - in org.apache.beam.sdk.transforms.CreateTest
2017-07-10T05:43:26.836 [INFO] Running org.apache.beam.sdk.transforms.CombineTest
2017-07-10T05:53:04.356 [INFO] Tests run: 22, Failures: 0, Errors: 0, Skipped: 0, Time elapsed:
577.517 s - in org.apache.beam.sdk.transforms.CombineTest
2017-07-10T05:53:04.356 [INFO] Running org.apache.beam.sdk.transforms.KeysTest
2017-07-10T05:53:08.484 [INFO] Tests run: 2, Failures: 0, Errors: 0, Skipped: 0, Time elapsed:
4.124 s - in org.apache.beam.sdk.transforms.KeysTest
2017-07-10T05:53:08.487 [INFO] Running org.apache.beam.sdk.transforms.CombineFnsTest
2017-07-10T05:53:59.240 [INFO] Tests run: 3, Failures: 0, Errors: 0, Skipped: 0, Time elapsed:
50.751 s - in org.apache.beam.sdk.transforms.CombineFnsTest
2017-07-10T05:53:59.240 [INFO] Running org.apache.beam.sdk.transforms.GroupByKeyTest
2017-07-10T05:55:11.165 [INFO] Tests run: 11, Failures: 0, Errors: 0, Skipped: 0, Time elapsed:
71.922 s - in org.apache.beam.sdk.transforms.GroupByKeyTest
2017-07-10T05:55:11.165 [INFO] Running org.apache.beam.sdk.transforms.windowing.WindowingTest
2017-07-10T05:55:25.164 [INFO] Tests run: 4, Failures: 0, Errors: 0, Skipped: 0, Time elapsed:
13.996 s - in org.apache.beam.sdk.transforms.windowing.WindowingTest
2017-07-10T05:55:25.164 [INFO] Running org.apache.beam.sdk.transforms.ParDoTest
2017-07-10T05:59:02.673 [INFO] Tests run: 18, Failures: 0, Errors: 0, Skipped: 0, Time elapsed:
217.506 s - in org.apache.beam.sdk.transforms.ParDoTest
2017-07-10T05:59:02.676 [INFO] 
2017-07-10T05:59:02.676 [INFO] Results:
2017-07-10T05:59:02.676 [INFO] 
2017-07-10T05:59:02.676 [ERROR] Errors: 
2017-07-10T05:59:02.678 [ERROR]   PAssertTest.testGlobalWindowContainsInAnyOrder ยป KryoSerialization

 Class is ...
2017-07-10T05:59:02.678 [INFO] 
2017-07-10T05:59:02.678 [ERROR] Tests run: 227, Failures: 0, Errors: 1, Skipped: 1
2017-07-10T05:59:02.678 [INFO] 
[JENKINS] Archiving disabled
[JENKINS] Archiving disabled
[JENKINS] Archiving disabled
[JENKINS] Archiving disabled
[JENKINS] Archiving disabled
[JENKINS] Archiving disabled
[JENKINS] Archiving disabled
[JENKINS] Archiving disabled
[JENKINS] Archiving disabled
[JENKINS] Archiving disabled
[JENKINS] Archiving disabled
2017-07-10T05:59:06.140 [INFO] ------------------------------------------------------------------------
2017-07-10T05:59:06.140 [INFO] Reactor Summary:
2017-07-10T05:59:06.140 [INFO] 
2017-07-10T05:59:06.140 [INFO] Apache Beam :: Parent .............................. SUCCESS
[ 28.097 s]
2017-07-10T05:59:06.140 [INFO] Apache Beam :: SDKs :: Java :: Build Tools ......... SUCCESS
[  7.970 s]
2017-07-10T05:59:06.140 [INFO] Apache Beam :: SDKs ................................ SUCCESS
[  1.735 s]
2017-07-10T05:59:06.140 [INFO] Apache Beam :: SDKs :: Common ...................... SUCCESS
[  2.053 s]
2017-07-10T05:59:06.140 [INFO] Apache Beam :: SDKs :: Common :: Runner API ........ SUCCESS
[ 10.597 s]
2017-07-10T05:59:06.140 [INFO] Apache Beam :: SDKs :: Common :: Fn API ............ SUCCESS
[  7.478 s]
2017-07-10T05:59:06.141 [INFO] Apache Beam :: SDKs :: Java ........................ SUCCESS
[  1.205 s]
2017-07-10T05:59:06.141 [INFO] Apache Beam :: SDKs :: Java :: Core ................ SUCCESS
[01:30 min]
2017-07-10T05:59:06.141 [INFO] Apache Beam :: Runners ............................. SUCCESS
[  1.517 s]
2017-07-10T05:59:06.141 [INFO] Apache Beam :: Runners :: Core Construction Java ... SUCCESS
[ 13.269 s]
2017-07-10T05:59:06.141 [INFO] Apache Beam :: Runners :: Core Java ................ SUCCESS
[ 29.656 s]
2017-07-10T05:59:06.141 [INFO] Apache Beam :: Runners :: Gearpump ................. FAILURE
[  01:04 h]
2017-07-10T05:59:06.141 [INFO] ------------------------------------------------------------------------
2017-07-10T05:59:06.141 [INFO] BUILD FAILURE
2017-07-10T05:59:06.141 [INFO] ------------------------------------------------------------------------
2017-07-10T05:59:06.141 [INFO] Total time: 01:08 h
2017-07-10T05:59:06.141 [INFO] Finished at: 2017-07-10T05:59:06+00:00
2017-07-10T05:59:07.298 [INFO] Final Memory: 245M/3711M
2017-07-10T05:59:07.298 [INFO] ------------------------------------------------------------------------
2017-07-10T05:59:07.304 [ERROR] Failed to execute goal org.apache.maven.plugins:maven-surefire-plugin:2.20:test
(validates-runner-tests) on project beam-runners-gearpump: There are test failures.
2017-07-10T05:59:07.304 [ERROR] 
2017-07-10T05:59:07.304 [ERROR] Please refer to <https://builds.apache.org/job/beam_PostCommit_Java_ValidatesRunner_Gearpump/ws/runners/gearpump/target/surefire-reports>
for the individual test results.
2017-07-10T05:59:07.304 [ERROR] Please refer to dump files (if any exist) [date]-jvmRun[N].dump,
[date].dumpstream and [date]-jvmRun[N].dumpstream.
2017-07-10T05:59:07.304 [ERROR] -> [Help 1]
org.apache.maven.lifecycle.LifecycleExecutionException: Failed to execute goal org.apache.maven.plugins:maven-surefire-plugin:2.20:test
(validates-runner-tests) on project beam-runners-gearpump: There are test failures.

Please refer to <https://builds.apache.org/job/beam_PostCommit_Java_ValidatesRunner_Gearpump/ws/runners/gearpump/target/surefire-reports>
for the individual test results.
Please refer to dump files (if any exist) [date]-jvmRun[N].dump, [date].dumpstream and [date]-jvmRun[N].dumpstream.
	at org.apache.maven.lifecycle.internal.MojoExecutor.execute(MojoExecutor.java:212)
	at org.apache.maven.lifecycle.internal.MojoExecutor.execute(MojoExecutor.java:153)
	at org.apache.maven.lifecycle.internal.MojoExecutor.execute(MojoExecutor.java:145)
	at org.apache.maven.lifecycle.internal.LifecycleModuleBuilder.buildProject(LifecycleModuleBuilder.java:116)
	at org.apache.maven.lifecycle.internal.LifecycleModuleBuilder.buildProject(LifecycleModuleBuilder.java:80)
	at org.apache.maven.lifecycle.internal.builder.singlethreaded.SingleThreadedBuilder.build(SingleThreadedBuilder.java:51)
	at org.apache.maven.lifecycle.internal.LifecycleStarter.execute(LifecycleStarter.java:128)
	at org.apache.maven.DefaultMaven.doExecute(DefaultMaven.java:307)
	at org.apache.maven.DefaultMaven.doExecute(DefaultMaven.java:193)
	at org.apache.maven.DefaultMaven.execute(DefaultMaven.java:106)
	at org.jvnet.hudson.maven3.launcher.Maven33Launcher.main(Maven33Launcher.java:129)
	at sun.reflect.NativeMethodAccessorImpl.invoke0(Native Method)
	at sun.reflect.NativeMethodAccessorImpl.invoke(NativeMethodAccessorImpl.java:62)
	at sun.reflect.DelegatingMethodAccessorImpl.invoke(DelegatingMethodAccessorImpl.java:43)
	at java.lang.reflect.Method.invoke(Method.java:498)
	at org.codehaus.plexus.classworlds.launcher.Launcher.launchStandard(Launcher.java:330)
	at org.codehaus.plexus.classworlds.launcher.Launcher.launch(Launcher.java:238)
	at jenkins.maven3.agent.Maven33Main.launch(Maven33Main.java:176)
	at sun.reflect.NativeMethodAccessorImpl.invoke0(Native Method)
	at sun.reflect.NativeMethodAccessorImpl.invoke(NativeMethodAccessorImpl.java:62)
	at sun.reflect.DelegatingMethodAccessorImpl.invoke(DelegatingMethodAccessorImpl.java:43)
	at java.lang.reflect.Method.invoke(Method.java:498)
	at hudson.maven.Maven3Builder.call(Maven3Builder.java:139)
	at hudson.maven.Maven3Builder.call(Maven3Builder.java:70)
	at hudson.remoting.UserRequest.perform(UserRequest.java:153)
	at hudson.remoting.UserRequest.perform(UserRequest.java:50)
	at hudson.remoting.Request$2.run(Request.java:336)
	at hudson.remoting.InterceptingExecutorService$1.call(InterceptingExecutorService.java:68)
	at java.util.concurrent.FutureTask.run(FutureTask.java:266)
	at java.util.concurrent.ThreadPoolExecutor.runWorker(ThreadPoolExecutor.java:1142)
	at java.util.concurrent.ThreadPoolExecutor$Worker.run(ThreadPoolExecutor.java:617)
	at java.lang.Thread.run(Thread.java:748)
Caused by: org.apache.maven.plugin.MojoFailureException: There are test failures.

Please refer to <https://builds.apache.org/job/beam_PostCommit_Java_ValidatesRunner_Gearpump/ws/runners/gearpump/target/surefire-reports>
for the individual test results.
Please refer to dump files (if any exist) [date]-jvmRun[N].dump, [date].dumpstream and [date]-jvmRun[N].dumpstream.
	at org.apache.maven.plugin.surefire.SurefireHelper.throwException(SurefireHelper.java:204)
	at org.apache.maven.plugin.surefire.SurefireHelper.reportExecution(SurefireHelper.java:98)
	at org.apache.maven.plugin.surefire.SurefirePlugin.handleSummary(SurefirePlugin.java:334)
	at org.apache.maven.plugin.surefire.AbstractSurefireMojo.executeAfterPreconditionsChecked(AbstractSurefireMojo.java:937)
	at org.apache.maven.plugin.surefire.AbstractSurefireMojo.execute(AbstractSurefireMojo.java:785)
	at org.apache.maven.plugin.DefaultBuildPluginManager.executeMojo(DefaultBuildPluginManager.java:134)
	at org.apache.maven.lifecycle.internal.MojoExecutor.execute(MojoExecutor.java:208)
	... 31 more
2017-07-10T05:59:07.305 [ERROR] 
2017-07-10T05:59:07.305 [ERROR] Re-run Maven using the -X switch to enable full debug logging.
2017-07-10T05:59:07.305 [ERROR] 
2017-07-10T05:59:07.305 [ERROR] For more information about the errors and possible solutions,
please read the following articles:
2017-07-10T05:59:07.305 [ERROR] [Help 1] http://cwiki.apache.org/confluence/display/MAVEN/MojoFailureException
2017-07-10T05:59:07.305 [ERROR] 
2017-07-10T05:59:07.305 [ERROR] After correcting the problems, you can resume the build with
the command
2017-07-10T05:59:07.305 [ERROR]   mvn <goals> -rf :beam-runners-gearpump
channel stopped
Not sending mail to unregistered user klk@google.com
Not sending mail to unregistered user owenzhang1990@gmail.com

Mime
View raw message