beam-commits mailing list archives

Site index · List index
Message view « Date » · « Thread »
Top « Date » · « Thread »
From Apache Jenkins Server <jenk...@builds.apache.org>
Subject Build failed in Jenkins: beam_PostCommit_Java_ValidatesRunner_Spark #2651
Date Tue, 18 Jul 2017 17:34:43 GMT
See <https://builds.apache.org/job/beam_PostCommit_Java_ValidatesRunner_Spark/2651/display/redirect?page=changes>

Changes:

[bchambers] [BEAM-2084] Adding querying facility for distribution metrics in Java

------------------------------------------
[...truncated 449.36 KB...]
2017-07-18T17:33:39.049 [INFO] Tests run: 3, Failures: 0, Errors: 0, Skipped: 0, Time elapsed:
0 s - in org.apache.beam.runners.core.triggers.ReshuffleTriggerStateMachineTest
2017-07-18T17:33:39.049 [INFO] Running org.apache.beam.runners.core.triggers.AfterProcessingTimeStateMachineTest
2017-07-18T17:33:39.052 [INFO] Tests run: 7, Failures: 0, Errors: 0, Skipped: 0, Time elapsed:
0.001 s - in org.apache.beam.runners.core.triggers.AfterProcessingTimeStateMachineTest
2017-07-18T17:33:39.052 [INFO] Running org.apache.beam.runners.core.triggers.AfterPaneStateMachineTest
2017-07-18T17:33:39.055 [INFO] Tests run: 4, Failures: 0, Errors: 0, Skipped: 0, Time elapsed:
0.001 s - in org.apache.beam.runners.core.triggers.AfterPaneStateMachineTest
2017-07-18T17:33:39.055 [INFO] Running org.apache.beam.runners.core.triggers.AfterSynchronizedProcessingTimeStateMachineTest
2017-07-18T17:33:39.057 [INFO] Tests run: 2, Failures: 0, Errors: 0, Skipped: 0, Time elapsed:
0.001 s - in org.apache.beam.runners.core.triggers.AfterSynchronizedProcessingTimeStateMachineTest
2017-07-18T17:33:39.448 [INFO] 
2017-07-18T17:33:39.448 [INFO] Results:
2017-07-18T17:33:39.448 [INFO] 
2017-07-18T17:33:39.448 [INFO] Tests run: 227, Failures: 0, Errors: 0, Skipped: 0
2017-07-18T17:33:39.448 [INFO] 
[JENKINS] Recording test results
2017-07-18T17:33:44.352 [INFO] 
2017-07-18T17:33:44.352 [INFO] --- build-helper-maven-plugin:3.0.0:regex-properties (render-artifact-id)
@ beam-runners-core-java ---
2017-07-18T17:33:44.458 [INFO] 
2017-07-18T17:33:44.458 [INFO] --- jacoco-maven-plugin:0.7.8:report (report) @ beam-runners-core-java
---
2017-07-18T17:33:44.460 [INFO] Loading execution data file <https://builds.apache.org/job/beam_PostCommit_Java_ValidatesRunner_Spark/ws/runners/core-java/target/jacoco.exec>
2017-07-18T17:33:44.496 [INFO] Analyzed bundle 'Apache Beam :: Runners :: Core Java' with
193 classes
2017-07-18T17:33:44.967 [INFO] 
2017-07-18T17:33:44.967 [INFO] --- maven-jar-plugin:3.0.2:jar (default-jar) @ beam-runners-core-java
---
2017-07-18T17:33:44.998 [INFO] Building jar: <https://builds.apache.org/job/beam_PostCommit_Java_ValidatesRunner_Spark/ws/runners/core-java/target/beam-runners-core-java-2.2.0-SNAPSHOT.jar>
2017-07-18T17:33:45.130 [INFO] 
2017-07-18T17:33:45.130 [INFO] --- maven-site-plugin:3.5.1:attach-descriptor (attach-descriptor)
@ beam-runners-core-java ---
2017-07-18T17:33:45.343 [INFO] 
2017-07-18T17:33:45.343 [INFO] --- maven-jar-plugin:3.0.2:test-jar (default-test-jar) @ beam-runners-core-java
---
2017-07-18T17:33:45.362 [INFO] Building jar: <https://builds.apache.org/job/beam_PostCommit_Java_ValidatesRunner_Spark/ws/runners/core-java/target/beam-runners-core-java-2.2.0-SNAPSHOT-tests.jar>
2017-07-18T17:33:45.485 [INFO] 
2017-07-18T17:33:45.485 [INFO] --- maven-shade-plugin:3.0.0:shade (bundle-and-repackage) @
beam-runners-core-java ---
2017-07-18T17:33:45.488 [INFO] Excluding org.apache.beam:beam-sdks-java-core:jar:2.2.0-SNAPSHOT
from the shaded jar.
2017-07-18T17:33:45.488 [INFO] Excluding com.google.protobuf:protobuf-java:jar:3.2.0 from
the shaded jar.
2017-07-18T17:33:45.488 [INFO] Excluding com.fasterxml.jackson.core:jackson-core:jar:2.8.9
from the shaded jar.
2017-07-18T17:33:45.488 [INFO] Excluding com.fasterxml.jackson.core:jackson-annotations:jar:2.8.9
from the shaded jar.
2017-07-18T17:33:45.488 [INFO] Excluding com.fasterxml.jackson.core:jackson-databind:jar:2.8.9
from the shaded jar.
2017-07-18T17:33:45.488 [INFO] Excluding org.slf4j:slf4j-api:jar:1.7.14 from the shaded jar.
2017-07-18T17:33:45.488 [INFO] Excluding net.bytebuddy:byte-buddy:jar:1.6.8 from the shaded
jar.
2017-07-18T17:33:45.488 [INFO] Excluding org.apache.avro:avro:jar:1.8.2 from the shaded jar.
2017-07-18T17:33:45.488 [INFO] Excluding org.codehaus.jackson:jackson-core-asl:jar:1.9.13
from the shaded jar.
2017-07-18T17:33:45.488 [INFO] Excluding org.codehaus.jackson:jackson-mapper-asl:jar:1.9.13
from the shaded jar.
2017-07-18T17:33:45.488 [INFO] Excluding com.thoughtworks.paranamer:paranamer:jar:2.7 from
the shaded jar.
2017-07-18T17:33:45.488 [INFO] Excluding org.tukaani:xz:jar:1.5 from the shaded jar.
2017-07-18T17:33:45.488 [INFO] Excluding org.xerial.snappy:snappy-java:jar:1.1.4-M3 from the
shaded jar.
2017-07-18T17:33:45.488 [INFO] Excluding org.apache.commons:commons-compress:jar:1.14 from
the shaded jar.
2017-07-18T17:33:45.488 [INFO] Excluding org.apache.commons:commons-lang3:jar:3.6 from the
shaded jar.
2017-07-18T17:33:45.488 [INFO] Excluding org.apache.beam:beam-sdks-common-runner-api:jar:2.2.0-SNAPSHOT
from the shaded jar.
2017-07-18T17:33:45.488 [INFO] Excluding org.apache.beam:beam-runners-core-construction-java:jar:2.2.0-SNAPSHOT
from the shaded jar.
2017-07-18T17:33:45.488 [INFO] Excluding com.google.protobuf:protobuf-java-util:jar:3.2.0
from the shaded jar.
2017-07-18T17:33:45.488 [INFO] Excluding com.google.code.gson:gson:jar:2.7 from the shaded
jar.
2017-07-18T17:33:45.488 [INFO] Excluding com.google.code.findbugs:jsr305:jar:3.0.1 from the
shaded jar.
2017-07-18T17:33:45.488 [INFO] Including com.google.guava:guava:jar:20.0 in the shaded jar.
2017-07-18T17:33:45.488 [INFO] Excluding joda-time:joda-time:jar:2.4 from the shaded jar.
2017-07-18T17:33:47.750 [INFO] Replacing original artifact with shaded artifact.
2017-07-18T17:33:47.750 [INFO] Replacing <https://builds.apache.org/job/beam_PostCommit_Java_ValidatesRunner_Spark/ws/runners/core-java/target/beam-runners-core-java-2.2.0-SNAPSHOT.jar>
with <https://builds.apache.org/job/beam_PostCommit_Java_ValidatesRunner_Spark/ws/runners/core-java/target/beam-runners-core-java-2.2.0-SNAPSHOT-shaded.jar>
2017-07-18T17:33:47.750 [INFO] Replacing original test artifact with shaded test artifact.
2017-07-18T17:33:47.750 [INFO] Replacing <https://builds.apache.org/job/beam_PostCommit_Java_ValidatesRunner_Spark/ws/runners/core-java/target/beam-runners-core-java-2.2.0-SNAPSHOT-tests.jar>
with <https://builds.apache.org/job/beam_PostCommit_Java_ValidatesRunner_Spark/ws/runners/core-java/target/beam-runners-core-java-2.2.0-SNAPSHOT-shaded-tests.jar>
2017-07-18T17:33:47.750 [INFO] Dependency-reduced POM written at: <https://builds.apache.org/job/beam_PostCommit_Java_ValidatesRunner_Spark/ws/runners/core-java/dependency-reduced-pom.xml>
2017-07-18T17:33:47.956 [INFO] 
2017-07-18T17:33:47.956 [INFO] --- maven-dependency-plugin:3.0.1:analyze-only (default) @
beam-runners-core-java ---
2017-07-18T17:33:48.050 [INFO] No dependency problems found
[JENKINS] Archiving disabled
2017-07-18T17:33:49.472 [INFO]                                                           
             
2017-07-18T17:33:49.472 [INFO] ------------------------------------------------------------------------
2017-07-18T17:33:49.472 [INFO] Building Apache Beam :: Runners :: Direct Java 2.2.0-SNAPSHOT
2017-07-18T17:33:49.472 [INFO] ------------------------------------------------------------------------
2017-07-18T17:33:49.479 [INFO] Downloading: https://repo.maven.apache.org/maven2/org/codehaus/woodstox/stax2-api/3.1.4/stax2-api-3.1.4.pom
[INFO] I/O exception (java.net.SocketException) caught when processing request to {s}->https://repo.maven.apache.org:443:
Connection reset
[INFO] Retrying request to {s}->https://repo.maven.apache.org:443
[INFO] I/O exception (java.net.SocketException) caught when processing request to {s}->https://repo.maven.apache.org:443:
Connection reset
[INFO] Retrying request to {s}->https://repo.maven.apache.org:443
[INFO] I/O exception (java.net.SocketException) caught when processing request to {s}->https://repo.maven.apache.org:443:
Connection reset
[INFO] Retrying request to {s}->https://repo.maven.apache.org:443
2017-07-18T17:33:49.540 [INFO] Downloading: https://repo.maven.apache.org/maven2/org/codehaus/woodstox/woodstox-core-asl/4.4.1/woodstox-core-asl-4.4.1.pom
[INFO] I/O exception (java.net.SocketException) caught when processing request to {s}->https://repo.maven.apache.org:443:
Connection reset
[INFO] Retrying request to {s}->https://repo.maven.apache.org:443
2017-07-18T17:33:49.627 [INFO] Downloaded: https://repo.maven.apache.org/maven2/org/codehaus/woodstox/woodstox-core-asl/4.4.1/woodstox-core-asl-4.4.1.pom
(2 KB at 20.3 KB/sec)
2017-07-18T17:33:49.629 [INFO] Downloading: https://repo.maven.apache.org/maven2/com/google/cloud/dataflow/google-cloud-dataflow-java-proto-library-all/0.5.160304/google-cloud-dataflow-java-proto-library-all-0.5.160304.pom
2017-07-18T17:33:49.656 [INFO] Downloaded: https://repo.maven.apache.org/maven2/com/google/cloud/dataflow/google-cloud-dataflow-java-proto-library-all/0.5.160304/google-cloud-dataflow-java-proto-library-all-0.5.160304.pom
(3 KB at 95.5 KB/sec)
2017-07-18T17:33:49.657 [INFO] Downloading: https://repo.maven.apache.org/maven2/com/google/cloud/dataflow/google-cloud-dataflow-java-sdk-parent/1.4.0/google-cloud-dataflow-java-sdk-parent-1.4.0.pom
2017-07-18T17:33:49.696 [INFO] Downloaded: https://repo.maven.apache.org/maven2/com/google/cloud/dataflow/google-cloud-dataflow-java-sdk-parent/1.4.0/google-cloud-dataflow-java-sdk-parent-1.4.0.pom
(12 KB at 294.5 KB/sec)
2017-07-18T17:33:49.697 [INFO] Downloading: https://repo.maven.apache.org/maven2/com/google/google/5/google-5.pom
2017-07-18T17:33:49.725 [INFO] Downloaded: https://repo.maven.apache.org/maven2/com/google/google/5/google-5.pom
(3 KB at 85.7 KB/sec)
[JENKINS] Archiving disabled
[JENKINS] Archiving disabled
[JENKINS] Archiving disabled
[JENKINS] Archiving disabled
[JENKINS] Archiving disabled
[JENKINS] Archiving disabled
[JENKINS] Archiving disabled
[JENKINS] Archiving disabled
[JENKINS] Archiving disabled
[JENKINS] Archiving disabled
[JENKINS] Archiving disabled
[JENKINS] Archiving disabled
[JENKINS] Archiving disabled
[JENKINS] Archiving disabled
[JENKINS] Archiving disabled
[JENKINS] Archiving disabled
2017-07-18T17:33:57.717 [INFO] ------------------------------------------------------------------------
2017-07-18T17:33:57.717 [INFO] Reactor Summary:
2017-07-18T17:33:57.717 [INFO] 
2017-07-18T17:33:57.717 [INFO] Apache Beam :: Parent .............................. SUCCESS
[ 24.011 s]
2017-07-18T17:33:57.717 [INFO] Apache Beam :: SDKs :: Java :: Build Tools ......... SUCCESS
[ 11.494 s]
2017-07-18T17:33:57.717 [INFO] Apache Beam :: SDKs ................................ SUCCESS
[  2.246 s]
2017-07-18T17:33:57.717 [INFO] Apache Beam :: SDKs :: Common ...................... SUCCESS
[  2.181 s]
2017-07-18T17:33:57.717 [INFO] Apache Beam :: SDKs :: Common :: Runner API ........ SUCCESS
[ 11.933 s]
2017-07-18T17:33:57.717 [INFO] Apache Beam :: SDKs :: Common :: Fn API ............ SUCCESS
[  8.427 s]
2017-07-18T17:33:57.717 [INFO] Apache Beam :: SDKs :: Java ........................ SUCCESS
[  2.053 s]
2017-07-18T17:33:57.717 [INFO] Apache Beam :: SDKs :: Java :: Core ................ SUCCESS
[02:31 min]
2017-07-18T17:33:57.717 [INFO] Apache Beam :: Runners ............................. SUCCESS
[  2.306 s]
2017-07-18T17:33:57.717 [INFO] Apache Beam :: Runners :: Core Construction Java ... SUCCESS
[ 18.789 s]
2017-07-18T17:33:57.717 [INFO] Apache Beam :: Runners :: Core Java ................ SUCCESS
[ 31.256 s]
2017-07-18T17:33:57.717 [INFO] Apache Beam :: Runners :: Direct Java .............. FAILURE
[  0.486 s]
2017-07-18T17:33:57.717 [INFO] Apache Beam :: SDKs :: Java :: IO .................. SKIPPED
2017-07-18T17:33:57.717 [INFO] Apache Beam :: SDKs :: Java :: IO :: Kafka ......... SKIPPED
2017-07-18T17:33:57.717 [INFO] Apache Beam :: Runners :: Spark .................... SKIPPED
2017-07-18T17:33:57.717 [INFO] ------------------------------------------------------------------------
2017-07-18T17:33:57.717 [INFO] BUILD FAILURE
2017-07-18T17:33:57.717 [INFO] ------------------------------------------------------------------------
2017-07-18T17:33:57.717 [INFO] Total time: 05:13 min
2017-07-18T17:33:57.717 [INFO] Finished at: 2017-07-18T17:33:57+00:00
2017-07-18T17:33:58.188 [INFO] Final Memory: 117M/1577M
2017-07-18T17:33:58.188 [INFO] ------------------------------------------------------------------------
2017-07-18T17:33:58.188 [WARNING] The requested profile "validates-runner-tests" could not
be activated because it does not exist.
2017-07-18T17:33:58.192 [ERROR] Failed to execute goal on project beam-runners-direct-java:
Could not resolve dependencies for project org.apache.beam:beam-runners-direct-java:jar:2.2.0-SNAPSHOT:
Failed to collect dependencies at org.codehaus.woodstox:stax2-api:jar:3.1.4: Failed to read
artifact descriptor for org.codehaus.woodstox:stax2-api:jar:3.1.4: Could not transfer artifact
org.codehaus.woodstox:stax2-api:pom:3.1.4 from/to central (https://repo.maven.apache.org/maven2):
Connection reset -> [Help 1]
org.apache.maven.lifecycle.LifecycleExecutionException: Failed to execute goal on project
beam-runners-direct-java: Could not resolve dependencies for project org.apache.beam:beam-runners-direct-java:jar:2.2.0-SNAPSHOT:
Failed to collect dependencies at org.codehaus.woodstox:stax2-api:jar:3.1.4
	at org.apache.maven.lifecycle.internal.LifecycleDependencyResolver.getDependencies(LifecycleDependencyResolver.java:221)
	at org.apache.maven.lifecycle.internal.LifecycleDependencyResolver.resolveProjectDependencies(LifecycleDependencyResolver.java:127)
	at org.apache.maven.lifecycle.internal.MojoExecutor.ensureDependenciesAreResolved(MojoExecutor.java:257)
	at org.apache.maven.lifecycle.internal.MojoExecutor.execute(MojoExecutor.java:200)
	at org.apache.maven.lifecycle.internal.MojoExecutor.execute(MojoExecutor.java:153)
	at org.apache.maven.lifecycle.internal.MojoExecutor.execute(MojoExecutor.java:145)
	at org.apache.maven.lifecycle.internal.LifecycleModuleBuilder.buildProject(LifecycleModuleBuilder.java:116)
	at org.apache.maven.lifecycle.internal.LifecycleModuleBuilder.buildProject(LifecycleModuleBuilder.java:80)
	at org.apache.maven.lifecycle.internal.builder.singlethreaded.SingleThreadedBuilder.build(SingleThreadedBuilder.java:51)
	at org.apache.maven.lifecycle.internal.LifecycleStarter.execute(LifecycleStarter.java:128)
	at org.apache.maven.DefaultMaven.doExecute(DefaultMaven.java:307)
	at org.apache.maven.DefaultMaven.doExecute(DefaultMaven.java:193)
	at org.apache.maven.DefaultMaven.execute(DefaultMaven.java:106)
	at org.jvnet.hudson.maven3.launcher.Maven33Launcher.main(Maven33Launcher.java:129)
	at sun.reflect.NativeMethodAccessorImpl.invoke0(Native Method)
	at sun.reflect.NativeMethodAccessorImpl.invoke(NativeMethodAccessorImpl.java:62)
	at sun.reflect.DelegatingMethodAccessorImpl.invoke(DelegatingMethodAccessorImpl.java:43)
	at java.lang.reflect.Method.invoke(Method.java:498)
	at org.codehaus.plexus.classworlds.launcher.Launcher.launchStandard(Launcher.java:330)
	at org.codehaus.plexus.classworlds.launcher.Launcher.launch(Launcher.java:238)
	at jenkins.maven3.agent.Maven33Main.launch(Maven33Main.java:176)
	at sun.reflect.NativeMethodAccessorImpl.invoke0(Native Method)
	at sun.reflect.NativeMethodAccessorImpl.invoke(NativeMethodAccessorImpl.java:62)
	at sun.reflect.DelegatingMethodAccessorImpl.invoke(DelegatingMethodAccessorImpl.java:43)
	at java.lang.reflect.Method.invoke(Method.java:498)
	at hudson.maven.Maven3Builder.call(Maven3Builder.java:139)
	at hudson.maven.Maven3Builder.call(Maven3Builder.java:70)
	at hudson.remoting.UserRequest.perform(UserRequest.java:153)
	at hudson.remoting.UserRequest.perform(UserRequest.java:50)
	at hudson.remoting.Request$2.run(Request.java:336)
	at hudson.remoting.InterceptingExecutorService$1.call(InterceptingExecutorService.java:68)
	at java.util.concurrent.FutureTask.run(FutureTask.java:266)
	at java.util.concurrent.ThreadPoolExecutor.runWorker(ThreadPoolExecutor.java:1142)
	at java.util.concurrent.ThreadPoolExecutor$Worker.run(ThreadPoolExecutor.java:617)
	at java.lang.Thread.run(Thread.java:748)
Caused by: org.apache.maven.project.DependencyResolutionException: Could not resolve dependencies
for project org.apache.beam:beam-runners-direct-java:jar:2.2.0-SNAPSHOT: Failed to collect
dependencies at org.codehaus.woodstox:stax2-api:jar:3.1.4
	at org.apache.maven.project.DefaultProjectDependenciesResolver.resolve(DefaultProjectDependenciesResolver.java:180)
	at org.apache.maven.lifecycle.internal.LifecycleDependencyResolver.getDependencies(LifecycleDependencyResolver.java:195)
	... 34 more
Caused by: org.eclipse.aether.collection.DependencyCollectionException: Failed to collect
dependencies at org.codehaus.woodstox:stax2-api:jar:3.1.4
	at org.eclipse.aether.internal.impl.DefaultDependencyCollector.collectDependencies(DefaultDependencyCollector.java:291)
	at org.eclipse.aether.internal.impl.DefaultRepositorySystem.collectDependencies(DefaultRepositorySystem.java:316)
	at org.apache.maven.project.DefaultProjectDependenciesResolver.resolve(DefaultProjectDependenciesResolver.java:172)
	... 35 more
Caused by: org.eclipse.aether.resolution.ArtifactDescriptorException: Failed to read artifact
descriptor for org.codehaus.woodstox:stax2-api:jar:3.1.4
	at org.apache.maven.repository.internal.DefaultArtifactDescriptorReader.loadPom(DefaultArtifactDescriptorReader.java:302)
	at org.apache.maven.repository.internal.DefaultArtifactDescriptorReader.readArtifactDescriptor(DefaultArtifactDescriptorReader.java:218)
	at org.eclipse.aether.internal.impl.DefaultDependencyCollector.resolveCachedArtifactDescriptor(DefaultDependencyCollector.java:535)
	at org.eclipse.aether.internal.impl.DefaultDependencyCollector.getArtifactDescriptorResult(DefaultDependencyCollector.java:519)
	at org.eclipse.aether.internal.impl.DefaultDependencyCollector.processDependency(DefaultDependencyCollector.java:409)
	at org.eclipse.aether.internal.impl.DefaultDependencyCollector.processDependency(DefaultDependencyCollector.java:363)
	at org.eclipse.aether.internal.impl.DefaultDependencyCollector.process(DefaultDependencyCollector.java:351)
	at org.eclipse.aether.internal.impl.DefaultDependencyCollector.collectDependencies(DefaultDependencyCollector.java:254)
	... 37 more
Caused by: org.eclipse.aether.resolution.ArtifactResolutionException: Could not transfer artifact
org.codehaus.woodstox:stax2-api:pom:3.1.4 from/to central (https://repo.maven.apache.org/maven2):
Connection reset
	at org.eclipse.aether.internal.impl.DefaultArtifactResolver.resolve(DefaultArtifactResolver.java:444)
	at org.eclipse.aether.internal.impl.DefaultArtifactResolver.resolveArtifacts(DefaultArtifactResolver.java:246)
	at org.eclipse.aether.internal.impl.DefaultArtifactResolver.resolveArtifact(DefaultArtifactResolver.java:223)
	at org.apache.maven.repository.internal.DefaultArtifactDescriptorReader.loadPom(DefaultArtifactDescriptorReader.java:287)
	... 44 more
Caused by: org.eclipse.aether.transfer.ArtifactTransferException: Could not transfer artifact
org.codehaus.woodstox:stax2-api:pom:3.1.4 from/to central (https://repo.maven.apache.org/maven2):
Connection reset
	at org.eclipse.aether.connector.basic.ArtifactTransportListener.transferFailed(ArtifactTransportListener.java:43)
	at org.eclipse.aether.connector.basic.BasicRepositoryConnector$TaskRunner.run(BasicRepositoryConnector.java:355)
	at org.eclipse.aether.util.concurrency.RunnableErrorForwarder$1.run(RunnableErrorForwarder.java:67)
	at org.eclipse.aether.connector.basic.BasicRepositoryConnector$DirectExecutor.execute(BasicRepositoryConnector.java:581)
	at org.eclipse.aether.connector.basic.BasicRepositoryConnector.get(BasicRepositoryConnector.java:249)
	at org.eclipse.aether.internal.impl.DefaultArtifactResolver.performDownloads(DefaultArtifactResolver.java:520)
	at org.eclipse.aether.internal.impl.DefaultArtifactResolver.resolve(DefaultArtifactResolver.java:421)
	... 47 more
Caused by: org.apache.maven.wagon.TransferFailedException: Connection reset
	at org.apache.maven.wagon.providers.http.AbstractHttpClientWagon.fillInputData(AbstractHttpClientWagon.java:1066)
	at org.apache.maven.wagon.providers.http.AbstractHttpClientWagon.fillInputData(AbstractHttpClientWagon.java:960)
	at org.apache.maven.wagon.StreamWagon.getInputStream(StreamWagon.java:116)
	at org.apache.maven.wagon.StreamWagon.getIfNewer(StreamWagon.java:88)
	at org.apache.maven.wagon.StreamWagon.get(StreamWagon.java:61)
	at org.eclipse.aether.transport.wagon.WagonTransporter$GetTaskRunner.run(WagonTransporter.java:560)
	at org.eclipse.aether.transport.wagon.WagonTransporter.execute(WagonTransporter.java:427)
	at org.eclipse.aether.transport.wagon.WagonTransporter.get(WagonTransporter.java:404)
	at org.eclipse.aether.connector.basic.BasicRepositoryConnector$GetTaskRunner.runTask(BasicRepositoryConnector.java:447)
	at org.eclipse.aether.connector.basic.BasicRepositoryConnector$TaskRunner.run(BasicRepositoryConnector.java:350)
	... 52 more
Caused by: java.net.SocketException: Connection reset
	at java.net.SocketInputStream.read(SocketInputStream.java:210)
	at java.net.SocketInputStream.read(SocketInputStream.java:141)
	at sun.security.ssl.InputRecord.readFully(InputRecord.java:465)
	at sun.security.ssl.InputRecord.read(InputRecord.java:503)
	at sun.security.ssl.SSLSocketImpl.readRecord(SSLSocketImpl.java:973)
	at sun.security.ssl.SSLSocketImpl.readDataRecord(SSLSocketImpl.java:930)
	at sun.security.ssl.AppInputStream.read(AppInputStream.java:105)
	at org.apache.maven.wagon.providers.http.httpclient.impl.io.SessionInputBufferImpl.streamRead(SessionInputBufferImpl.java:136)
	at org.apache.maven.wagon.providers.http.httpclient.impl.io.SessionInputBufferImpl.fillBuffer(SessionInputBufferImpl.java:152)
	at org.apache.maven.wagon.providers.http.httpclient.impl.io.SessionInputBufferImpl.readLine(SessionInputBufferImpl.java:270)
	at org.apache.maven.wagon.providers.http.httpclient.impl.conn.DefaultHttpResponseParser.parseHead(DefaultHttpResponseParser.java:140)
	at org.apache.maven.wagon.providers.http.httpclient.impl.conn.DefaultHttpResponseParser.parseHead(DefaultHttpResponseParser.java:57)
	at org.apache.maven.wagon.providers.http.httpclient.impl.io.AbstractMessageParser.parse(AbstractMessageParser.java:260)
	at org.apache.maven.wagon.providers.http.httpclient.impl.DefaultBHttpClientConnection.receiveResponseHeader(DefaultBHttpClientConnection.java:161)
	at org.apache.maven.wagon.providers.http.httpclient.impl.conn.CPoolProxy.receiveResponseHeader(CPoolProxy.java:153)
	at org.apache.maven.wagon.providers.http.httpclient.protocol.HttpRequestExecutor.doReceiveResponse(HttpRequestExecutor.java:271)
	at org.apache.maven.wagon.providers.http.httpclient.protocol.HttpRequestExecutor.execute(HttpRequestExecutor.java:123)
	at org.apache.maven.wagon.providers.http.httpclient.impl.execchain.MainClientExec.execute(MainClientExec.java:254)
	at org.apache.maven.wagon.providers.http.httpclient.impl.execchain.ProtocolExec.execute(ProtocolExec.java:195)
	at org.apache.maven.wagon.providers.http.httpclient.impl.execchain.RetryExec.execute(RetryExec.java:86)
	at org.apache.maven.wagon.providers.http.httpclient.impl.execchain.RedirectExec.execute(RedirectExec.java:108)
	at org.apache.maven.wagon.providers.http.httpclient.impl.client.InternalHttpClient.doExecute(InternalHttpClient.java:184)
	at org.apache.maven.wagon.providers.http.httpclient.impl.client.CloseableHttpClient.execute(CloseableHttpClient.java:82)
	at org.apache.maven.wagon.providers.http.AbstractHttpClientWagon.execute(AbstractHttpClientWagon.java:832)
	at org.apache.maven.wagon.providers.http.AbstractHttpClientWagon.fillInputData(AbstractHttpClientWagon.java:983)
	... 61 more
2017-07-18T17:33:58.194 [ERROR] 
2017-07-18T17:33:58.194 [ERROR] Re-run Maven using the -X switch to enable full debug logging.
2017-07-18T17:33:58.194 [ERROR] 
2017-07-18T17:33:58.194 [ERROR] For more information about the errors and possible solutions,
please read the following articles:
2017-07-18T17:33:58.195 [ERROR] [Help 1] http://cwiki.apache.org/confluence/display/MAVEN/DependencyResolutionException
2017-07-18T17:33:58.195 [ERROR] 
2017-07-18T17:33:58.195 [ERROR] After correcting the problems, you can resume the build with
the command
2017-07-18T17:33:58.195 [ERROR]   mvn <goals> -rf :beam-runners-direct-java
channel stopped
Not sending mail to unregistered user mairbek@google.com
Not sending mail to unregistered user valentyn@google.com
Not sending mail to unregistered user ccy@google.com
Not sending mail to unregistered user fipsy@google.com
Not sending mail to unregistered user klk@google.com
Not sending mail to unregistered user kirpichov@google.com
Not sending mail to unregistered user sisk@google.com

Mime
View raw message