beam-commits mailing list archives

Site index · List index
Message view « Date » · « Thread »
Top « Date » · « Thread »
From Apache Jenkins Server <jenk...@builds.apache.org>
Subject Build failed in Jenkins: beam_PostCommit_Java_ValidatesRunner_Apex #1923
Date Thu, 06 Jul 2017 18:09:40 GMT
See <https://builds.apache.org/job/beam_PostCommit_Java_ValidatesRunner_Apex/1923/display/redirect>

------------------------------------------
Started by timer
[EnvInject] - Loading node environment variables.
Building remotely on beam1 (beam) in workspace <https://builds.apache.org/job/beam_PostCommit_Java_ValidatesRunner_Apex/ws/>
 > git rev-parse --is-inside-work-tree # timeout=10
Fetching changes from the remote Git repository
 > git config remote.origin.url https://github.com/apache/beam.git # timeout=10
Fetching upstream changes from https://github.com/apache/beam.git
 > git --version # timeout=10
 > git fetch --tags --progress https://github.com/apache/beam.git +refs/heads/*:refs/remotes/origin/*
+refs/pull/${ghprbPullId}/*:refs/remotes/origin/pr/${ghprbPullId}/*
 > git rev-parse origin/master^{commit} # timeout=10
Checking out Revision 85a99e29448670ae6728a8ee2e4cd3ef95877c3e (origin/master)
 > git config core.sparsecheckout # timeout=10
 > git checkout -f 85a99e29448670ae6728a8ee2e4cd3ef95877c3e
 > git rev-list 85a99e29448670ae6728a8ee2e4cd3ef95877c3e # timeout=10
Cleaning workspace
 > git rev-parse --verify HEAD # timeout=10
Resetting working tree
 > git reset --hard # timeout=10
 > git clean -fdx # timeout=10
[EnvInject] - Executing scripts and injecting environment variables after the SCM step.
[EnvInject] - Injecting as environment variables the properties content 
SPARK_LOCAL_IP=127.0.0.1

[EnvInject] - Variables injected successfully.
Parsing POMs
Downloaded artifact http://repo.maven.apache.org/maven2/org/apache/apache/18/apache-18.pom
Modules changed, recalculating dependency graph
Established TCP socket on 58999
maven33-agent.jar already up to date
maven33-interceptor.jar already up to date
maven3-interceptor-commons.jar already up to date
[beam_PostCommit_Java_ValidatesRunner_Apex] $ /home/jenkins/tools/java/latest1.8/bin/java
-Dorg.slf4j.simpleLogger.showDateTime=true -Dorg.slf4j.simpleLogger.dateTimeFormat=yyyy-MM-dd'T'HH:mm:ss.SSS
-XX:+TieredCompilation -XX:TieredStopAtLevel=1 -cp /home/jenkins/jenkins-slave/maven33-agent.jar:/home/jenkins/tools/maven/apache-maven-3.3.3/boot/plexus-classworlds-2.5.2.jar:/home/jenkins/tools/maven/apache-maven-3.3.3/conf/logging
jenkins.maven3.agent.Maven33Main /home/jenkins/tools/maven/apache-maven-3.3.3 /home/jenkins/jenkins-slave/slave.jar
/home/jenkins/jenkins-slave/maven33-interceptor.jar /home/jenkins/jenkins-slave/maven3-interceptor-commons.jar
58999
<===[JENKINS REMOTING CAPACITY]===>   channel started
Executing Maven:  -B -f <https://builds.apache.org/job/beam_PostCommit_Java_ValidatesRunner_Apex/ws/pom.xml>
-Dmaven.repo.local=<https://builds.apache.org/job/beam_PostCommit_Java_ValidatesRunner_Apex/ws/.repository>
clean verify --projects runners/apex --also-make --batch-mode --errors --activate-profiles
validates-runner-tests --activate-profiles local-validates-runner-tests
2017-07-06T18:01:49.683 [INFO] Error stacktraces are turned on.
2017-07-06T18:01:49.784 [INFO] Scanning for projects...
2017-07-06T18:01:51.193 [INFO] Downloading: https://repo.maven.apache.org/maven2/kr/motd/maven/os-maven-plugin/1.5.0.Final/os-maven-plugin-1.5.0.Final.pom
2017-07-06T18:01:51.991 [INFO] Downloaded: https://repo.maven.apache.org/maven2/kr/motd/maven/os-maven-plugin/1.5.0.Final/os-maven-plugin-1.5.0.Final.pom
(7 KB at 7.8 KB/sec)
2017-07-06T18:01:52.000 [INFO] Downloading: https://repo.maven.apache.org/maven2/org/sonatype/oss/oss-parent/9/oss-parent-9.pom
2017-07-06T18:01:52.036 [INFO] Downloaded: https://repo.maven.apache.org/maven2/org/sonatype/oss/oss-parent/9/oss-parent-9.pom
(7 KB at 178.2 KB/sec)
2017-07-06T18:01:52.046 [INFO] Downloading: https://repo.maven.apache.org/maven2/org/apache/maven/maven-plugin-api/3.2.1/maven-plugin-api-3.2.1.pom
2017-07-06T18:01:52.082 [INFO] Downloaded: https://repo.maven.apache.org/maven2/org/apache/maven/maven-plugin-api/3.2.1/maven-plugin-api-3.2.1.pom
(4 KB at 94.4 KB/sec)
2017-07-06T18:01:52.084 [INFO] Downloading: https://repo.maven.apache.org/maven2/org/apache/maven/maven/3.2.1/maven-3.2.1.pom
2017-07-06T18:01:52.138 [INFO] Downloaded: https://repo.maven.apache.org/maven2/org/apache/maven/maven/3.2.1/maven-3.2.1.pom
(23 KB at 408.5 KB/sec)
2017-07-06T18:01:52.141 [INFO] Downloading: https://repo.maven.apache.org/maven2/org/apache/maven/maven-parent/23/maven-parent-23.pom
2017-07-06T18:01:52.182 [INFO] Downloaded: https://repo.maven.apache.org/maven2/org/apache/maven/maven-parent/23/maven-parent-23.pom
(32 KB at 776.2 KB/sec)
2017-07-06T18:01:52.187 [INFO] Downloading: https://repo.maven.apache.org/maven2/org/apache/apache/13/apache-13.pom
2017-07-06T18:01:52.221 [INFO] Downloaded: https://repo.maven.apache.org/maven2/org/apache/apache/13/apache-13.pom
(14 KB at 401.4 KB/sec)
2017-07-06T18:01:52.228 [INFO] Downloading: https://repo.maven.apache.org/maven2/org/apache/maven/maven-model/3.2.1/maven-model-3.2.1.pom
2017-07-06T18:01:52.257 [INFO] Downloaded: https://repo.maven.apache.org/maven2/org/apache/maven/maven-model/3.2.1/maven-model-3.2.1.pom
(5 KB at 144.4 KB/sec)
2017-07-06T18:01:52.262 [INFO] Downloading: https://repo.maven.apache.org/maven2/org/codehaus/plexus/plexus-utils/3.0.17/plexus-utils-3.0.17.pom
2017-07-06T18:01:52.292 [INFO] Downloaded: https://repo.maven.apache.org/maven2/org/codehaus/plexus/plexus-utils/3.0.17/plexus-utils-3.0.17.pom
(4 KB at 110.5 KB/sec)
2017-07-06T18:01:52.295 [INFO] Downloading: https://repo.maven.apache.org/maven2/org/codehaus/plexus/plexus/3.3.1/plexus-3.3.1.pom
2017-07-06T18:01:52.330 [INFO] Downloaded: https://repo.maven.apache.org/maven2/org/codehaus/plexus/plexus/3.3.1/plexus-3.3.1.pom
(20 KB at 570.5 KB/sec)
2017-07-06T18:01:52.334 [INFO] Downloading: https://repo.maven.apache.org/maven2/org/sonatype/spice/spice-parent/17/spice-parent-17.pom
2017-07-06T18:01:52.364 [INFO] Downloaded: https://repo.maven.apache.org/maven2/org/sonatype/spice/spice-parent/17/spice-parent-17.pom
(7 KB at 220.0 KB/sec)
2017-07-06T18:01:52.367 [INFO] Downloading: https://repo.maven.apache.org/maven2/org/sonatype/forge/forge-parent/10/forge-parent-10.pom
2017-07-06T18:01:52.403 [INFO] Downloaded: https://repo.maven.apache.org/maven2/org/sonatype/forge/forge-parent/10/forge-parent-10.pom
(14 KB at 367.8 KB/sec)
2017-07-06T18:01:52.408 [INFO] Downloading: https://repo.maven.apache.org/maven2/org/apache/maven/maven-artifact/3.2.1/maven-artifact-3.2.1.pom
2017-07-06T18:01:52.437 [INFO] Downloaded: https://repo.maven.apache.org/maven2/org/apache/maven/maven-artifact/3.2.1/maven-artifact-3.2.1.pom
(2 KB at 66.3 KB/sec)
2017-07-06T18:01:52.443 [INFO] Downloading: https://repo.maven.apache.org/maven2/org/eclipse/sisu/org.eclipse.sisu.plexus/0.0.0.M5/org.eclipse.sisu.plexus-0.0.0.M5.pom
2017-07-06T18:01:52.474 [INFO] Downloaded: https://repo.maven.apache.org/maven2/org/eclipse/sisu/org.eclipse.sisu.plexus/0.0.0.M5/org.eclipse.sisu.plexus-0.0.0.M5.pom
(5 KB at 152.2 KB/sec)
2017-07-06T18:01:52.477 [INFO] Downloading: https://repo.maven.apache.org/maven2/org/eclipse/sisu/sisu-plexus/0.0.0.M5/sisu-plexus-0.0.0.M5.pom
2017-07-06T18:01:52.511 [INFO] Downloaded: https://repo.maven.apache.org/maven2/org/eclipse/sisu/sisu-plexus/0.0.0.M5/sisu-plexus-0.0.0.M5.pom
(13 KB at 390.7 KB/sec)
2017-07-06T18:01:52.514 [INFO] Downloading: https://repo.maven.apache.org/maven2/org/sonatype/oss/oss-parent/7/oss-parent-7.pom
2017-07-06T18:01:52.544 [INFO] Downloaded: https://repo.maven.apache.org/maven2/org/sonatype/oss/oss-parent/7/oss-parent-7.pom
(5 KB at 157.0 KB/sec)
2017-07-06T18:01:52.548 [INFO] Downloading: https://repo.maven.apache.org/maven2/javax/enterprise/cdi-api/1.0/cdi-api-1.0.pom
2017-07-06T18:01:52.576 [INFO] Downloaded: https://repo.maven.apache.org/maven2/javax/enterprise/cdi-api/1.0/cdi-api-1.0.pom
(2 KB at 50.0 KB/sec)
2017-07-06T18:01:52.579 [INFO] Downloading: https://repo.maven.apache.org/maven2/org/jboss/weld/weld-api-parent/1.0/weld-api-parent-1.0.pom
2017-07-06T18:01:52.607 [INFO] Downloaded: https://repo.maven.apache.org/maven2/org/jboss/weld/weld-api-parent/1.0/weld-api-parent-1.0.pom
(3 KB at 82.1 KB/sec)
2017-07-06T18:01:52.609 [INFO] Downloading: https://repo.maven.apache.org/maven2/org/jboss/weld/weld-api-bom/1.0/weld-api-bom-1.0.pom
2017-07-06T18:01:52.640 [INFO] Downloaded: https://repo.maven.apache.org/maven2/org/jboss/weld/weld-api-bom/1.0/weld-api-bom-1.0.pom
(8 KB at 249.1 KB/sec)
2017-07-06T18:01:52.642 [INFO] Downloading: https://repo.maven.apache.org/maven2/org/jboss/weld/weld-parent/6/weld-parent-6.pom
2017-07-06T18:01:52.677 [INFO] Downloaded: https://repo.maven.apache.org/maven2/org/jboss/weld/weld-parent/6/weld-parent-6.pom
(21 KB at 577.3 KB/sec)
2017-07-06T18:01:52.682 [INFO] Downloading: https://repo.maven.apache.org/maven2/javax/annotation/jsr250-api/1.0/jsr250-api-1.0.pom
2017-07-06T18:01:52.709 [INFO] Downloaded: https://repo.maven.apache.org/maven2/javax/annotation/jsr250-api/1.0/jsr250-api-1.0.pom
(1023 B at 37.0 KB/sec)
2017-07-06T18:01:52.712 [INFO] Downloading: https://repo.maven.apache.org/maven2/javax/inject/javax.inject/1/javax.inject-1.pom
2017-07-06T18:01:52.739 [INFO] Downloaded: https://repo.maven.apache.org/maven2/javax/inject/javax.inject/1/javax.inject-1.pom
(612 B at 22.1 KB/sec)
2017-07-06T18:01:52.742 [INFO] Downloading: https://repo.maven.apache.org/maven2/com/google/guava/guava/10.0.1/guava-10.0.1.pom
2017-07-06T18:01:52.771 [INFO] Downloaded: https://repo.maven.apache.org/maven2/com/google/guava/guava/10.0.1/guava-10.0.1.pom
(6 KB at 181.3 KB/sec)
2017-07-06T18:01:52.774 [INFO] Downloading: https://repo.maven.apache.org/maven2/com/google/guava/guava-parent/10.0.1/guava-parent-10.0.1.pom
2017-07-06T18:01:52.806 [INFO] Downloaded: https://repo.maven.apache.org/maven2/com/google/guava/guava-parent/10.0.1/guava-parent-10.0.1.pom
(2 KB at 58.0 KB/sec)
2017-07-06T18:01:52.811 [INFO] Downloading: https://repo.maven.apache.org/maven2/com/google/code/findbugs/jsr305/1.3.9/jsr305-1.3.9.pom
2017-07-06T18:01:52.839 [INFO] Downloaded: https://repo.maven.apache.org/maven2/com/google/code/findbugs/jsr305/1.3.9/jsr305-1.3.9.pom
(965 B at 32.5 KB/sec)
2017-07-06T18:01:52.843 [INFO] Downloading: https://repo.maven.apache.org/maven2/org/sonatype/sisu/sisu-guice/3.1.0/sisu-guice-3.1.0.pom
2017-07-06T18:01:52.873 [INFO] Downloaded: https://repo.maven.apache.org/maven2/org/sonatype/sisu/sisu-guice/3.1.0/sisu-guice-3.1.0.pom
(10 KB at 330.4 KB/sec)
2017-07-06T18:01:52.876 [INFO] Downloading: https://repo.maven.apache.org/maven2/org/sonatype/sisu/inject/guice-parent/3.1.0/guice-parent-3.1.0.pom
2017-07-06T18:01:52.911 [INFO] Downloaded: https://repo.maven.apache.org/maven2/org/sonatype/sisu/inject/guice-parent/3.1.0/guice-parent-3.1.0.pom
(11 KB at 313.8 KB/sec)
2017-07-06T18:01:52.916 [INFO] Downloading: https://repo.maven.apache.org/maven2/aopalliance/aopalliance/1.0/aopalliance-1.0.pom
2017-07-06T18:01:52.945 [INFO] Downloaded: https://repo.maven.apache.org/maven2/aopalliance/aopalliance/1.0/aopalliance-1.0.pom
(363 B at 12.2 KB/sec)
2017-07-06T18:01:52.949 [INFO] Downloading: https://repo.maven.apache.org/maven2/org/eclipse/sisu/org.eclipse.sisu.inject/0.0.0.M5/org.eclipse.sisu.inject-0.0.0.M5.pom
2017-07-06T18:01:52.978 [INFO] Downloaded: https://repo.maven.apache.org/maven2/org/eclipse/sisu/org.eclipse.sisu.inject/0.0.0.M5/org.eclipse.sisu.inject-0.0.0.M5.pom
(3 KB at 84.9 KB/sec)
2017-07-06T18:01:52.981 [INFO] Downloading: https://repo.maven.apache.org/maven2/org/eclipse/sisu/sisu-inject/0.0.0.M5/sisu-inject-0.0.0.M5.pom
2017-07-06T18:01:53.014 [INFO] Downloaded: https://repo.maven.apache.org/maven2/org/eclipse/sisu/sisu-inject/0.0.0.M5/sisu-inject-0.0.0.M5.pom
(14 KB at 427.1 KB/sec)
2017-07-06T18:01:53.018 [INFO] Downloading: https://repo.maven.apache.org/maven2/org/codehaus/plexus/plexus-component-annotations/1.5.5/plexus-component-annotations-1.5.5.pom
2017-07-06T18:01:53.047 [INFO] Downloaded: https://repo.maven.apache.org/maven2/org/codehaus/plexus/plexus-component-annotations/1.5.5/plexus-component-annotations-1.5.5.pom
(815 B at 27.4 KB/sec)
2017-07-06T18:01:53.049 [INFO] Downloading: https://repo.maven.apache.org/maven2/org/codehaus/plexus/plexus-containers/1.5.5/plexus-containers-1.5.5.pom
2017-07-06T18:01:53.078 [INFO] Downloaded: https://repo.maven.apache.org/maven2/org/codehaus/plexus/plexus-containers/1.5.5/plexus-containers-1.5.5.pom
(5 KB at 142.8 KB/sec)
2017-07-06T18:01:53.081 [INFO] Downloading: https://repo.maven.apache.org/maven2/org/codehaus/plexus/plexus/2.0.7/plexus-2.0.7.pom
2017-07-06T18:01:53.118 [INFO] Downloaded: https://repo.maven.apache.org/maven2/org/codehaus/plexus/plexus/2.0.7/plexus-2.0.7.pom
(17 KB at 444.5 KB/sec)
2017-07-06T18:01:53.123 [INFO] Downloading: https://repo.maven.apache.org/maven2/org/codehaus/plexus/plexus-classworlds/2.4/plexus-classworlds-2.4.pom
2017-07-06T18:01:53.154 [INFO] Downloaded: https://repo.maven.apache.org/maven2/org/codehaus/plexus/plexus-classworlds/2.4/plexus-classworlds-2.4.pom
(4 KB at 122.3 KB/sec)
2017-07-06T18:01:53.157 [INFO] Downloading: https://repo.maven.apache.org/maven2/org/codehaus/plexus/plexus-utils/2.1/plexus-utils-2.1.pom
2017-07-06T18:01:53.186 [INFO] Downloaded: https://repo.maven.apache.org/maven2/org/codehaus/plexus/plexus-utils/2.1/plexus-utils-2.1.pom
(4 KB at 135.8 KB/sec)
2017-07-06T18:01:53.189 [INFO] Downloading: https://repo.maven.apache.org/maven2/org/sonatype/spice/spice-parent/16/spice-parent-16.pom
2017-07-06T18:01:53.217 [INFO] Downloaded: https://repo.maven.apache.org/maven2/org/sonatype/spice/spice-parent/16/spice-parent-16.pom
(9 KB at 291.5 KB/sec)
2017-07-06T18:01:53.220 [INFO] Downloading: https://repo.maven.apache.org/maven2/org/sonatype/forge/forge-parent/5/forge-parent-5.pom
2017-07-06T18:01:53.249 [INFO] Downloaded: https://repo.maven.apache.org/maven2/org/sonatype/forge/forge-parent/5/forge-parent-5.pom
(9 KB at 281.6 KB/sec)
2017-07-06T18:01:53.268 [INFO] Downloading: https://repo.maven.apache.org/maven2/kr/motd/maven/os-maven-plugin/1.5.0.Final/os-maven-plugin-1.5.0.Final.jar
2017-07-06T18:01:53.269 [INFO] Downloading: https://repo.maven.apache.org/maven2/org/apache/maven/maven-plugin-api/3.2.1/maven-plugin-api-3.2.1.jar
2017-07-06T18:01:53.269 [INFO] Downloading: https://repo.maven.apache.org/maven2/org/apache/maven/maven-model/3.2.1/maven-model-3.2.1.jar
2017-07-06T18:01:53.270 [INFO] Downloading: https://repo.maven.apache.org/maven2/org/apache/maven/maven-artifact/3.2.1/maven-artifact-3.2.1.jar
2017-07-06T18:01:53.271 [INFO] Downloading: https://repo.maven.apache.org/maven2/org/eclipse/sisu/org.eclipse.sisu.plexus/0.0.0.M5/org.eclipse.sisu.plexus-0.0.0.M5.jar
2017-07-06T18:01:53.350 [INFO] Downloaded: https://repo.maven.apache.org/maven2/kr/motd/maven/os-maven-plugin/1.5.0.Final/os-maven-plugin-1.5.0.Final.jar
(29 KB at 347.5 KB/sec)
2017-07-06T18:01:53.350 [INFO] Downloading: https://repo.maven.apache.org/maven2/javax/enterprise/cdi-api/1.0/cdi-api-1.0.jar
2017-07-06T18:01:53.358 [INFO] Downloaded: https://repo.maven.apache.org/maven2/org/apache/maven/maven-artifact/3.2.1/maven-artifact-3.2.1.jar
(53 KB at 588.7 KB/sec)
2017-07-06T18:01:53.358 [INFO] Downloaded: https://repo.maven.apache.org/maven2/org/apache/maven/maven-plugin-api/3.2.1/maven-plugin-api-3.2.1.jar
(45 KB at 497.3 KB/sec)
2017-07-06T18:01:53.358 [INFO] Downloading: https://repo.maven.apache.org/maven2/javax/annotation/jsr250-api/1.0/jsr250-api-1.0.jar
2017-07-06T18:01:53.358 [INFO] Downloading: https://repo.maven.apache.org/maven2/javax/inject/javax.inject/1/javax.inject-1.jar
2017-07-06T18:01:53.370 [INFO] Downloaded: https://repo.maven.apache.org/maven2/org/eclipse/sisu/org.eclipse.sisu.plexus/0.0.0.M5/org.eclipse.sisu.plexus-0.0.0.M5.jar
(192 KB at 1919.4 KB/sec)
2017-07-06T18:01:53.371 [INFO] Downloading: https://repo.maven.apache.org/maven2/com/google/guava/guava/10.0.1/guava-10.0.1.jar
2017-07-06T18:01:53.388 [INFO] Downloaded: https://repo.maven.apache.org/maven2/org/apache/maven/maven-model/3.2.1/maven-model-3.2.1.jar
(157 KB at 1300.9 KB/sec)
2017-07-06T18:01:53.388 [INFO] Downloading: https://repo.maven.apache.org/maven2/com/google/code/findbugs/jsr305/1.3.9/jsr305-1.3.9.jar
2017-07-06T18:01:53.391 [INFO] Downloaded: https://repo.maven.apache.org/maven2/javax/enterprise/cdi-api/1.0/cdi-api-1.0.jar
(44 KB at 365.5 KB/sec)
2017-07-06T18:01:53.391 [INFO] Downloading: https://repo.maven.apache.org/maven2/org/sonatype/sisu/sisu-guice/3.1.0/sisu-guice-3.1.0-no_aop.jar
2017-07-06T18:01:53.393 [INFO] Downloaded: https://repo.maven.apache.org/maven2/javax/inject/javax.inject/1/javax.inject-1.jar
(3 KB at 20.0 KB/sec)
2017-07-06T18:01:53.393 [INFO] Downloading: https://repo.maven.apache.org/maven2/aopalliance/aopalliance/1.0/aopalliance-1.0.jar
2017-07-06T18:01:53.398 [INFO] Downloaded: https://repo.maven.apache.org/maven2/javax/annotation/jsr250-api/1.0/jsr250-api-1.0.jar
(6 KB at 45.0 KB/sec)
2017-07-06T18:01:53.399 [INFO] Downloading: https://repo.maven.apache.org/maven2/org/eclipse/sisu/org.eclipse.sisu.inject/0.0.0.M5/org.eclipse.sisu.inject-0.0.0.M5.jar
2017-07-06T18:01:53.422 [INFO] Downloaded: https://repo.maven.apache.org/maven2/aopalliance/aopalliance/1.0/aopalliance-1.0.jar
(5 KB at 28.9 KB/sec)
2017-07-06T18:01:53.422 [INFO] Downloading: https://repo.maven.apache.org/maven2/org/codehaus/plexus/plexus-component-annotations/1.5.5/plexus-component-annotations-1.5.5.jar
2017-07-06T18:01:53.424 [INFO] Downloaded: https://repo.maven.apache.org/maven2/com/google/code/findbugs/jsr305/1.3.9/jsr305-1.3.9.jar
(33 KB at 212.1 KB/sec)
2017-07-06T18:01:53.424 [INFO] Downloading: https://repo.maven.apache.org/maven2/org/codehaus/plexus/plexus-classworlds/2.4/plexus-classworlds-2.4.jar
2017-07-06T18:01:53.449 [INFO] Downloaded: https://repo.maven.apache.org/maven2/org/codehaus/plexus/plexus-component-annotations/1.5.5/plexus-component-annotations-1.5.5.jar
(5 KB at 23.2 KB/sec)
2017-07-06T18:01:53.449 [INFO] Downloading: https://repo.maven.apache.org/maven2/org/codehaus/plexus/plexus-utils/3.0.17/plexus-utils-3.0.17.jar
2017-07-06T18:01:53.461 [INFO] Downloaded: https://repo.maven.apache.org/maven2/org/codehaus/plexus/plexus-classworlds/2.4/plexus-classworlds-2.4.jar
(46 KB at 241.9 KB/sec)
2017-07-06T18:01:53.491 [INFO] Downloaded: https://repo.maven.apache.org/maven2/org/sonatype/sisu/sisu-guice/3.1.0/sisu-guice-3.1.0-no_aop.jar
(350 KB at 1586.6 KB/sec)
2017-07-06T18:01:53.507 [INFO] Downloaded: https://repo.maven.apache.org/maven2/org/eclipse/sisu/org.eclipse.sisu.inject/0.0.0.M5/org.eclipse.sisu.inject-0.0.0.M5.jar
(285 KB at 1205.8 KB/sec)
2017-07-06T18:01:53.557 [INFO] Downloaded: https://repo.maven.apache.org/maven2/org/codehaus/plexus/plexus-utils/3.0.17/plexus-utils-3.0.17.jar
(246 KB at 859.8 KB/sec)
2017-07-06T18:01:53.658 [INFO] Downloaded: https://repo.maven.apache.org/maven2/com/google/guava/guava/10.0.1/guava-10.0.1.jar
(1467 KB at 3789.1 KB/sec)
2017-07-06T18:01:53.860 [INFO] Downloading: https://repo.maven.apache.org/maven2/org/apache/maven/archetype/archetype-packaging/2.4/archetype-packaging-2.4.pom
2017-07-06T18:01:53.891 [INFO] Downloaded: https://repo.maven.apache.org/maven2/org/apache/maven/archetype/archetype-packaging/2.4/archetype-packaging-2.4.pom
(2 KB at 49.4 KB/sec)
2017-07-06T18:01:53.894 [INFO] Downloading: https://repo.maven.apache.org/maven2/org/apache/maven/archetype/maven-archetype/2.4/maven-archetype-2.4.pom
2017-07-06T18:01:53.923 [INFO] Downloaded: https://repo.maven.apache.org/maven2/org/apache/maven/archetype/maven-archetype/2.4/maven-archetype-2.4.pom
(13 KB at 429.7 KB/sec)
2017-07-06T18:01:53.925 [INFO] Downloading: https://repo.maven.apache.org/maven2/org/apache/maven/maven-parent/26/maven-parent-26.pom
2017-07-06T18:01:53.956 [INFO] Downloaded: https://repo.maven.apache.org/maven2/org/apache/maven/maven-parent/26/maven-parent-26.pom
(39 KB at 1253.3 KB/sec)
2017-07-06T18:01:53.960 [INFO] Downloading: https://repo.maven.apache.org/maven2/org/apache/apache/16/apache-16.pom
2017-07-06T18:01:53.988 [INFO] Downloaded: https://repo.maven.apache.org/maven2/org/apache/apache/16/apache-16.pom
(16 KB at 537.0 KB/sec)
2017-07-06T18:01:53.993 [INFO] Downloading: https://repo.maven.apache.org/maven2/org/codehaus/plexus/plexus-utils/1.1/plexus-utils-1.1.jar
2017-07-06T18:01:53.993 [INFO] Downloading: https://repo.maven.apache.org/maven2/org/apache/maven/archetype/archetype-packaging/2.4/archetype-packaging-2.4.jar
2017-07-06T18:01:54.040 [INFO] Downloaded: https://repo.maven.apache.org/maven2/org/apache/maven/archetype/archetype-packaging/2.4/archetype-packaging-2.4.jar
(8 KB at 156.5 KB/sec)
2017-07-06T18:01:54.062 [INFO] Downloaded: https://repo.maven.apache.org/maven2/org/codehaus/plexus/plexus-utils/1.1/plexus-utils-1.1.jar
(165 KB at 2385.8 KB/sec)
2017-07-06T18:01:54.254 [INFO] ------------------------------------------------------------------------
2017-07-06T18:01:54.254 [INFO] Detecting the operating system and CPU architecture
2017-07-06T18:01:54.254 [INFO] ------------------------------------------------------------------------
2017-07-06T18:01:54.255 [INFO] os.detected.name: linux
2017-07-06T18:01:54.255 [INFO] os.detected.arch: x86_64
2017-07-06T18:01:54.255 [INFO] os.detected.version: 3.19
2017-07-06T18:01:54.255 [INFO] os.detected.version.major: 3
2017-07-06T18:01:54.255 [INFO] os.detected.version.minor: 19
2017-07-06T18:01:54.256 [INFO] os.detected.release: ubuntu
2017-07-06T18:01:54.256 [INFO] os.detected.release.version: 14.04
2017-07-06T18:01:54.256 [INFO] os.detected.release.like.ubuntu: true
2017-07-06T18:01:54.256 [INFO] os.detected.release.like.debian: true
2017-07-06T18:01:54.256 [INFO] os.detected.classifier: linux-x86_64
2017-07-06T18:08:12.366 [INFO] ------------------------------------------------------------------------
2017-07-06T18:08:12.366 [INFO] Reactor Build Order:
2017-07-06T18:08:12.367 [INFO] 
2017-07-06T18:08:12.367 [INFO] Apache Beam :: Parent
2017-07-06T18:08:12.367 [INFO] Apache Beam :: SDKs :: Java :: Build Tools
2017-07-06T18:08:12.367 [INFO] Apache Beam :: SDKs
2017-07-06T18:08:12.367 [INFO] Apache Beam :: SDKs :: Common
2017-07-06T18:08:12.367 [INFO] Apache Beam :: SDKs :: Common :: Runner API
2017-07-06T18:08:12.367 [INFO] Apache Beam :: SDKs :: Common :: Fn API
2017-07-06T18:08:12.367 [INFO] Apache Beam :: SDKs :: Java
2017-07-06T18:08:12.367 [INFO] Apache Beam :: SDKs :: Java :: Core
2017-07-06T18:08:12.367 [INFO] Apache Beam :: Runners
2017-07-06T18:08:12.367 [INFO] Apache Beam :: Runners :: Core Construction Java
2017-07-06T18:08:12.367 [INFO] Apache Beam :: Runners :: Core Java
2017-07-06T18:08:12.367 [INFO] Apache Beam :: Runners :: Apex
2017-07-06T18:08:14.622 [INFO]                                                           
             
2017-07-06T18:08:14.622 [INFO] ------------------------------------------------------------------------
2017-07-06T18:08:14.622 [INFO] Building Apache Beam :: Parent 2.2.0-SNAPSHOT
2017-07-06T18:08:14.622 [INFO] ------------------------------------------------------------------------
2017-07-06T18:08:14.627 [INFO] Downloading: https://repo.maven.apache.org/maven2/org/apache/maven/plugins/maven-remote-resources-plugin/1.5/maven-remote-resources-plugin-1.5.pom
[INFO] I/O exception (java.net.SocketException) caught when processing request to {s}->https://repo.maven.apache.org:443:
Connection reset
[INFO] Retrying request to {s}->https://repo.maven.apache.org:443
[INFO] I/O exception (java.net.SocketException) caught when processing request to {s}->https://repo.maven.apache.org:443:
Connection reset
[INFO] Retrying request to {s}->https://repo.maven.apache.org:443
[INFO] I/O exception (java.net.SocketException) caught when processing request to {s}->https://repo.maven.apache.org:443:
Connection reset
[INFO] Retrying request to {s}->https://repo.maven.apache.org:443
[JENKINS] Archiving disabled
[JENKINS] Archiving disabled
[JENKINS] Archiving disabled
[JENKINS] Archiving disabled
[JENKINS] Archiving disabled
[JENKINS] Archiving disabled
[JENKINS] Archiving disabled
[JENKINS] Archiving disabled
[JENKINS] Archiving disabled
[JENKINS] Archiving disabled
[JENKINS] Archiving disabled
[JENKINS] Archiving disabled
[JENKINS] Archiving disabled
2017-07-06T18:08:30.241 [INFO] ------------------------------------------------------------------------
2017-07-06T18:08:30.241 [INFO] Reactor Summary:
2017-07-06T18:08:30.241 [INFO] 
2017-07-06T18:08:30.242 [INFO] Apache Beam :: Parent .............................. FAILURE
[  2.322 s]
2017-07-06T18:08:30.242 [INFO] Apache Beam :: SDKs :: Java :: Build Tools ......... SKIPPED
2017-07-06T18:08:30.242 [INFO] Apache Beam :: SDKs ................................ SKIPPED
2017-07-06T18:08:30.242 [INFO] Apache Beam :: SDKs :: Common ...................... SKIPPED
2017-07-06T18:08:30.242 [INFO] Apache Beam :: SDKs :: Common :: Runner API ........ SKIPPED
2017-07-06T18:08:30.242 [INFO] Apache Beam :: SDKs :: Common :: Fn API ............ SKIPPED
2017-07-06T18:08:30.242 [INFO] Apache Beam :: SDKs :: Java ........................ SKIPPED
2017-07-06T18:08:30.242 [INFO] Apache Beam :: SDKs :: Java :: Core ................ SKIPPED
2017-07-06T18:08:30.242 [INFO] Apache Beam :: Runners ............................. SKIPPED
2017-07-06T18:08:30.242 [INFO] Apache Beam :: Runners :: Core Construction Java ... SKIPPED
2017-07-06T18:08:30.242 [INFO] Apache Beam :: Runners :: Core Java ................ SKIPPED
2017-07-06T18:08:30.242 [INFO] Apache Beam :: Runners :: Apex ..................... SKIPPED
2017-07-06T18:08:30.242 [INFO] ------------------------------------------------------------------------
2017-07-06T18:08:30.242 [INFO] BUILD FAILURE
2017-07-06T18:08:30.242 [INFO] ------------------------------------------------------------------------
2017-07-06T18:08:30.242 [INFO] Total time: 06:40 min
2017-07-06T18:08:30.242 [INFO] Finished at: 2017-07-06T18:08:30+00:00
2017-07-06T18:08:30.689 [INFO] Final Memory: 39M/353M
2017-07-06T18:08:30.689 [INFO] ------------------------------------------------------------------------
2017-07-06T18:08:30.689 [WARNING] The requested profile "validates-runner-tests" could not
be activated because it does not exist.
Waiting for Jenkins to finish collecting data
2017-07-06T18:08:51.133 [ERROR] Plugin org.apache.maven.plugins:maven-remote-resources-plugin:1.5
or one of its dependencies could not be resolved: Failed to read artifact descriptor for org.apache.maven.plugins:maven-remote-resources-plugin:jar:1.5:
Could not transfer artifact org.apache.maven.plugins:maven-remote-resources-plugin:pom:1.5
from/to central (https://repo.maven.apache.org/maven2): Connection reset -> [Help 1]
2017-07-06T18:08:51.134 [ERROR] 
2017-07-06T18:08:51.134 [ERROR] To see the full stack trace of the errors, re-run Maven with
the -e switch.
2017-07-06T18:08:51.134 [ERROR] Re-run Maven using the -X switch to enable full debug logging.
2017-07-06T18:08:51.134 [ERROR] 
2017-07-06T18:08:51.134 [ERROR] For more information about the errors and possible solutions,
please read the following articles:
2017-07-06T18:08:51.134 [ERROR] [Help 1] http://cwiki.apache.org/confluence/display/MAVEN/PluginResolutionException
channel stopped

Mime
View raw message